{"text_format":"1","workbook":"xlsx","n_sheets":8,"sheets":["Hepak_v3.4","Gaspak_v3.3","Helium_critique","Saturation","Vapour_fraction","Density","Cp","Process_operations"],"not_rendered":{"charts":7,"images":3,"macros":1,"external_links":1,"defined_names":21,"comments":1,"pivot_tables":0},"unopened":[],"bounds":{"document_bytes":16777216,"sheet_cells":100000,"rows_first":2000,"rows_last":500,"rows_between":2000,"halvings":0,"cell_chars":16384,"cell_head_chars":4096},"cells_cut":0,"cells_raw":0,"read":"whole","date_system":"1900"}

{"sheet":"Hepak_v3.4","index":0,"n_rows":57,"n_cols":11,"rows_kept":57,"cut":false,"hidden":false,"merged":[[28,9,28,10],[24,15,24,16],[4,5,4,10],[5,5,5,10],[5,0,5,4],[4,0,4,4],[7,1,7,2],[11,9,11,10]]}
[]
[]
[]
[]
["HeUnit(index;Unit)",null,null,null,null,"HeProperty(index)"]
["HeCalc(Output;Phase;Input1;Value1;Input2;Value2;Unit)",null,null,null,null,"HeConst(index)"]
[]
[null,"Parameter",null,"Value","Unit","Unit system",1]
["Input1",{"$f":"VLOOKUP(C9,J13:K27,2,FALSE)","v":1}," Pressure ",{"$f":"1.6*10^5","v":160000},{"$f":"IF(B9=12,[1]!HeUnit(43,$G$8),[1]!HeUnit(VLOOKUP(C9,$A$13:$B$57,2,FALSE),$G$8))","v":" [Pa] "}]
["Input2",{"$f":"VLOOKUP(C10,J13:K27,2,FALSE)","v":2}," Temperature ",4.8,{"$f":"IF(B10=12,[1]!HeUnit(43,$G$8),[1]!HeUnit(VLOOKUP(C10,$A$13:$B$57,2,FALSE),$G$8))","v":" [K] "}]
[]
["Output Parameters","Index","Value","Unit",null,"Constants","Index","Value",null,"Input Parameters"]
[{"$f":"[1]!HeProperty(B13)","v":" Quality "},0,{"$f":"[1]!HeCalc(B13,0,$B$9,$D$9,$B$10,$D$10,$G$8)","v":2},{"$f":"[1]!HeUnit(B13,$G$8)","v":" [-] "},null,"Pressure upper limit",1,{"$f":"[1]!HeConst(G13)","v":2028000000},null," Pressure ",1]
[" Pressure ",1,159999.99901337078," [Pa] ",null,"Temperature upper limit",2,{"$f":"[1]!HeConst(G14)","v":1500},null," Temperature ",2]
[" Temperature ",2,4.8," [K] ",null,"Temperature lower limit",3,{"$f":"[1]!HeConst(G15)","v":0.8},null," Density ",3]
[" Density ",3,26.990000220131233," [kg/m3] ",null,"Gas constant \"R\"",4,2077.2347599999998,null," Specific Volume ",4]
[" Specific Volume ",4,3.7050759238383503E-2," [m3/kg] ",null,"Critical pressure",5,227462.3,null," Entropy ",5]
[" Z = PV/RT ",5,0.59455258698367652," [-] ",null,"Critical temperature",6,5.1952999999999996,null," Enthalpy ",6]
[" DPTSat ",6,0," [Pa/K] ",null,"Critical density",7,69.641237399999994,null," Internal Energy ",7]
[" Latent Heat ",7,0," [J/kg] ",null,"Lambda point pressure",8,5041.8,null," Gibbs Energy ",8]
[" Entropy ",8,7817.2952438277334," [J/kg-K] ",null,"Lambda point temperature",9,2.1768000000000001,null," Quality ",9]
[" Enthalpy ",9,30520.986158472675," [J/kg] ",null,"Lambda point vapor density",10,1.1923727,null," (T-Tlambda) ",10]
[" Helmholtz ",10,-12930.152453486442," [J/kg] ",null,"Lambda point liquid density",11,146.15,null," Melting line ",11]
[" Internal Energy ",11,24592.864716886677," [J/kg] ",null,"Molecular weight",12,4.0026000000000002,null," Saturation",12]
[" Gibbs Energy ",12,-7002.0310119004434," [J/kg] ",null,"Pressure of the standard state",13,0.101325,null," Saturated liquid ",13]
[" Res. for Fugacity ",13,0," [T/Tc] ",null,null,14,0,null," Saturated vapor ",14]
[" Cp ",14,13268.470065132915," [J/kg-K] ",null,"Hepack version",15,3.4,null," Lambda line ",15]
[" Cv ",15,3125.8879128127583," [J/kg-K] "]
[" Gamma ",16,4.2447043640773376," [-] ",null,null,null,null,null,"Phase"]
[" Expansivity ",17,4.4152065154013931," [TdV/VdT] ",null,null,null,null,null,"one single phase",0]
[" Gruneisen ",18,0.73489300053326201," [-] ",null,null,null,null,null,"Liquid",1]
[" Compressibility ",19,1.4835745832036775E-5," [1/Pa] ",null,null,null,null,null,"vapor",2]
[" Sound Velocity ",20,102.95977567986083," [m/s] "]
[" JT Coefficient ",21,9.5365926689625568E-6," [K/Pa] "]
[" dPdD|T ",22,2497.3978159139751," [Pa-m3/kg] "]
[" dPdT|D ",23,62001.243558804017," [Pa/K] "]
[" V*dHdV|P ",24,14424.84198428212," [J/kg] "]
[" Viscosity ",25,1.5088500060937553E-6," [Pa-s] "]
[" Conductivity ",26,1.1278705503758741E-2," [W/m-K] "]
[" Prandtl # ",27,1.7750380247058228," [-] "]
[" Thermal Diff ",28,3.1494558158481244E-8," [m2/s] "]
[" Surface Tension ",29,0," [N/m] "]
[" Dielectric - 1 ",30,1.0487493060185102E-2," [-] "]
[" Refraction - 1 ",31,5.2332539679632775E-3," [-] "]
[" dT(P) ",32,0," [K] "]
[" dT(V) ",33,0," [K] "]
[" RhoS/Rho ",34,0," [-] "]
[" 2nd Sound Vel. ",35,0," [m/s] "]
[" 4th Sound Vel. ",36,0," [m/s] "]
[" Gorter-Mellink ",37,0," [m-s/kg] "]
[" SFTC ",38,0," [W3/m5-K] "]
[" (T-Tlambda) ",39,0," [K] "]
["",40,"NUM"," [-] "]
[" Lambda line ",41,"NUM"," [-] "]
[" Melting line ",42,"NUM"," [-] "]
[" Saturated liquid ",43,"NUM"," [-] "]
[" Saturated vapor ",44,"NUM"," [-] "]

{"sheet":"Gaspak_v3.3","index":1,"n_rows":47,"n_cols":15,"rows_kept":47,"cut":false,"hidden":false,"merged":[[4,0,4,8],[5,0,5,8],[20,13,20,14],[8,13,8,14],[8,10,8,11],[8,5,8,6]]}
[]
[]
[]
[]
["FluidProperties(Fluid;Input1;Value1;Input2;Value2;Output;Phase;Unit)"]
["FConstant(Fluid;Parameter)"]
[{"$f":"VLOOKUP(B7,K10:L47,2,FALSE)","v":27},"Water"]
[]
["Index","Output Parameters","Value","Unit",null,"Constants",null,"Value","Unit",null,"Fluids",null,null,"Input Parameters"]
[1,"Pressure",{"$f":"3*10^5","v":300000},"Pa",null,1,"Pressure upper limit",{"$f":"FConstant($A$7,F10)","v":100000},"Pa",null,"Ammonia",1,null,1,"Pressure"]
[2,"Temperature",80.5,"K",null,2,"Temperature upper limit",{"$f":"FConstant($A$7,F11)","v":1273},"K",null,"Argon",2,null,2,"Temperature"]
[3,"Density",{"$f":"FluidProperties($A$7,$A$10,$C$10,$A$11,$C$11,A12,0,1)","v":0},"kg/m3",null,3,"Temperature lower limit",{"$f":"FConstant($A$7,F12)","v":273.16000000000003},"K",null,"Butane, Iso",3,null,3,"Density"]
[4,"Entropy",{"$f":"FluidProperties($A$7,$A$10,$C$10,$A$11,$C$11,A13,0,1)","v":0},"J/(kg.K)",null,4,"Gas constant \"R\"",8.3144039999999997,"J/(kg.K)",null,"Butane, Normal",4,null,4,"Entropy"]
[5,"Enthalpy",0,"J/kg",null,5,"Critical pressure",22064,"kPa",null,"Carbon Dioxide",5,null,5,"Enthalpy"]
[6,"Internal energy",0,"J/kg",null,6,"Critical temperature",647.14,"K",null,"Carbon Monoxide",6,null,6,"Internal energy"]
[7,"dP/dρ",0,"Pa.m3/kg",null,7,"Critical density",17.873657000000001,"kg/m3",null,"Deuterium",7,null,7,"Vapor mass fraction"]
[8,"dP/dT",0,"Pa/K",null,8,"Triple point pressure",0.61173999999999995,"Pa",null,"Ethane",8,null,8,"\"Ligne de mélange\""]
[9,"Cv",0,"J/(kg.K)",null,9,"Triple point temperature",273.16000000000003,"K",null,"Ethylene 81",9,null,9,"\"Diphasique\""]
[10,"Cp",0,"J/(kg.K)",null,10,"Triple point vapor density",2.6948E-4,"kg/m3",null,"Ethylene 86",10,null,10,"Saturation"]
[11,"Gamma",0,"-",null,11,"Triple point liquid density",55.496000000000002,"kg/m3",null,"Helium",11]
[12,"Alpha",0,"-",null,12,"Molecular weight",18.015339999999998,"g/mol",null,"Hydrogen, Equilibrium",12,null,"Phase"]
[13,"Gruneisen",0,"-",null,13,"Pressure of the standard state",101.325,"Pa",null,"Hydrogen, Normal",13,null,0,"one single phase"]
[14,"Kt",0,"-",null,14,"Accentric factor",0.34447725156697223,"…",null,"Hydrogen, Ortho",14,null,1,"Liquid"]
[15,"Sound velocity",0,"m/s",null,null,null,null,null,null,"Hydrogen, Para",15,null,2,"vapor"]
[16,"JT coefficient",0,"K/Pa",null,null,null,{"$f":"H10/10^5","v":1},null,null,"Hydrogen Sulfide",16]
[17,"(dH/dV)*V @ P=cst",0,"J/kg",null,null,null,null,null,null,"Krypton",17]
[18,"dH/dT @ ρ=cst",0,"-",null,null,null,null,null,null,"Methane 86",18]
[19,"dS/dT @ ρ=cst",0,"-",null,null,null,null,null,null,"Methane 89",19]
[20,"Compressibility factor Z",0,"1/Pa",null,null,null,null,null,null,"Neon 91",20]
[21,"Viscosity",0,"Pa.s",null,null,null,null,null,null,"Nitrogen 73",21]
[22,"Conductivity",0,"W/(m.K)",null,null,null,null,null,null,"Nitrogen 86",22]
[23,"Thermal diffusivity",0,"m2/s",null,null,null,null,null,null,"Nitrogen Trifluoride",23]
[24,"Prandtl number",0,"-",null,null,null,null,null,null,"Oxygen 78",24]
[25,"Surface Tension",0,"N/m",null,null,null,null,null,null,"Oxygen 85",25]
[26,"Dielectric cst",0,"-",null,null,null,null,null,null,"Propane",26]
[27,"PV/RT",0,"-",null,null,null,null,null,null,"Water",27]
[28,"dP/dT @ sat=cst",0,"K/Pa",null,null,null,null,null,null,"Xenon",28]
[29,"Latent Heat",0,"J/kg",null,null,null,null,null,null,"R-11",29]
[30,"Fugacity / Pressure",0,"-",null,null,null,null,null,null,"R-12",30]
[null,null,null,null,null,null,null,null,null,null,"R-22",31]
[null,null,null,null,null,null,null,null,null,null,"R-32",32]
[null,null,null,null,null,null,null,null,null,null,"R-123",33]
[null,null,null,null,null,null,null,null,null,null,"R-124",34]
[null,null,null,null,null,null,null,null,null,null,"R-125",35]
[null,null,null,null,null,null,null,null,null,null,"R-134a 92",36]
[null,null,null,null,null,null,null,null,null,null,"R-134a 93",37]
[null,null,null,null,null,null,null,null,null,null,"R-152a",38]

{"sheet":"Helium_critique","index":2,"n_rows":126,"n_cols":43,"rows_kept":126,"cut":false,"hidden":false,"merged":[[4,7,4,12],[5,7,5,12],[5,1,5,6],[4,1,4,6]]}
[]
[]
[]
[]
[null,"HeUnit(index;Unit)",null,null,null,null,null,"HeProperty(index)"]
[null,"HeCalc(Output;Phase;Input1;Value1;Input2;Value2;Unit)",null,null,null,null,null,"HeConst(index)"]
[]
[]
[null,"Density in kg/m3",null,"3"]
[null,null,null,null,null,null,null,null,null,null,null,null,null,null,null,"Pc = 2,28 bar"]
[null,"Pression",1,1.1000000000000001,1.2,1.3,1.4,1.5,1.6,1.7,1.8,1.9,2,2.1,2.2000000000000002,2.2999999999999998,2.4,2.5,2.6,2.7,2.8,2.9,3,3.1,3.2,3.3,3.4,3.5,3.6,3.7,3.8,3.9,4,4.0999999999999996,4.2,4.3,4.4000000000000004,4.5,4.5999999999999996,4.7,4.8,4.9000000000000004,5]
[null,"Temperature","bar","bar","bar","bar","bar","bar","bar","bar","bar","bar","bar","bar","bar","bar","bar","bar","bar","bar","bar","bar","bar","bar","bar","bar","bar","bar","bar","bar","bar","bar","bar","bar","bar","bar","bar","bar","bar","bar","bar","bar","bar"]
[null,3.7,{"$f":"[1]!HeCalc($D$9,0,1,C$11*10^5,2,$B13,1)","v":135.05232224976581},{"$f":"[1]!HeCalc($D$9,0,1,D$11*10^5,2,$B13,1)","v":135.41857529339575},135.77695217394606,136.12786618241395,136.47169688261769,136.80879379095333,137.13947955894218,137.46405273798877,137.78279019123528,138.09594920584223,138.40376940511459,138.70647413634202,139.0042723514315,139.29735955684509,139.58591906120452,139.87012299924379,140.15013324822291,140.42610221988417,140.69817376130862,140.96648349616305,141.23115975718255,141.49232396852497,141.75009117569647,142.0045704975588,142.25586553830658,142.50407476364651,142.74929184488806,142.99160597421519,143.23110215401817,143.46786146283637,143.70196130017015,143.9334756121676,144.16247509997268,144.3890274123271,144.61319732384794,144.83504690025691,145.05463565170254,145.2720206752021,145.48725678712836,145.70039664657256,145.91149087033679]
[null,3.8,{"$f":"[1]!HeCalc($D$9,0,1,C$11*10^5,2,$B14,1)","v":133.46974668440737},133.86704372226353,134.25480872744058,134.63359670871236,135.00391263302015,135.36621728433661,135.72093271620713,136.06844631626873,136.40911474617747,136.74326717490709,137.07120811492953,137.39321997168338,137.70956487522164,138.02048713685227,138.32621451707013,138.62695982422682,138.92292223323605,139.2142884595784,139.50123380744984,139.78392309928356,140.06251156150736,140.33714549374292,140.60796303982048,140.87509476147403,141.13866420662768,141.39878841728932,141.65557839150921,141.90913950435746,142.15957189225716,142.40697080447569,142.65142692512717,142.89302666863583,143.13185245127468,143.36798294109113,143.60149328827725,143.83245533781022,144.06093782599743,144.2870065623793,144.51072459829643,144.73215238329095,144.95134791038979]
[null,3.9,131.74717121793987,132.18229405042749,132.60562414961626,133.01793212111269,133.41991088568199,133.81218607761974,134.19532473050299,134.56984258174072,134.9362102542772,135.29485851868554,135.646182774892,135.99054705229173,136.3282870887829,136.65971349875545,136.98511421007436,137.30475668342066,137.6188898622849,137.92774589232621,138.23154164241845,138.53048005450154,138.82475134509406,139.11453407702538,139.39999605916481,139.6812955201018,139.95858124953679,140.23199393411255,140.50166646908934,140.7677245943849,141.03028741366668,141.28946786642311,141.54537315809347,141.79810515269753,142.04776073186579,142.2944321237008,142.53820720449446,142.77916977597661,143.01739982046513,143.25297373601992,143.48596455347422,143.71644213701265,143.94447336978553]
[null,4,129.85885968173122,130.3411446795678,130.80843552474951,131.26184734156521,131.70236800744689,132.13087734137713,132.54816274758673,132.95493208076408,133.35182431102959,133.73941843017005,134.11824093982986,134.48877218717865,134.85145175688018,135.20668308500169,135.5548373648306,135.89625726126272,136.2312593897409,136.56013730826336,136.88316366427009,137.2005921898581,137.51265946073462,137.81958645205808,138.12157991896848,138.41883364449814,138.71152939897402,138.99983831820109,139.28392118236778,139.56392971295733,139.84000706309192,140.11228850360709,140.38090200735959,140.64596877948938,140.90760373958955,141.16591596098365,141.42100907165738,141.67298162083904,141.92192741473661,142.16793582453033,142.41109206935647,142.65147747670636,142.88916972239497]
[null,4.0999999999999996,127.76832329781816,128.3111955685979,128.83432218958197,129.33940443049502,129.82792020564719,130.30116259100774,130.76027024975861,131.2062517451636,131.64000517287306,132.06233416521715,132.47396105183492,132.87553776856424,133.26765496652334,133.65084967012359,134.02561175579413,134.3923894651584,134.75159412219472,135.10360411378412,135.44876873654709,135.78741065552657,136.1198290094176,136.44630159469446,136.7670869040812,137.08242592347096,137.3925437212034,137.69765085814015,137.99794460809795,138.29361024968148,138.58482172424138,138.87174287879731,139.15452810252592,139.43332309005882,139.70826550010409,139.9794855518563,140.24710656619325,140.51124545774601,140.77201318315633,141.02951515017068,141.28385159165069,141.53511790808824,141.78340498178849]
[null,4.2,125.42128674696256,126.0451832571396,126.64182752505531,127.21400412139627,127.76406817429763,128.29403126287315,128.80562726008688,129.30036238837798,129.7795545680913,130.24436422355291,130.69581919179356,131.1348346930379,131.5622296419568,131.97874006248267,132.38503020861225,132.78170185127021,133.16930208635216,133.54832994075812,133.91924199415837,134.28245708632207,134.63836091134107,134.98730881981135,135.32962951114908,135.66562756519235,135.99558580861799,136.31976739358112,136.63841763001204,136.95176560615511,137.26002557649889,137.56339849056889,137.86207263614475,138.15622515941064,138.44602273217643,138.73162242602879,139.01317245544175,139.2908128492156,139.5646760584691,139.83488750832106,140.10156609947299,140.36482466511046,140.6247703878683]
[null,4.3,15.745723090957473,123.46992181740812,124.16830334961141,124.83152188123584,125.46366938768801,126.06812479605416,126.64771473408375,127.20483073260414,127.74151639635716,128.25953371110836,128.76041349964348,129.24549547537364,129.71595953043973,130.17285083469352,130.6171001318788,131.049540290588,{"$f":"[1]!HeCalc($D$9,0,1,S$11*10^5,2,$B19,1)","v":131.47091992016666},131.88191466202215,132.28313662169234,132.67514230107145,133.0584393110887,133.43349198413134,133.80072671225071,134.16053540025862,134.51327967037764,134.8592938532779,135.19888773841697,135.53234898114781,135.85994521727784,136.18192592716559,136.49852395359574,136.80995761950669,{"$f":"[1]!HeCalc($D$9,0,1,AI$11*10^5,2,$B19,1)","v":137.11643072057345},137.41813499632784,137.71525051507396,138.00794673755667,138.29638335586878,138.58071104975414,138.86107216997812,139.1376013571325,139.41042610313519]
[null,4.4000000000000004,14.942620083923147,17.361437201417004,121.31168475231041,122.10648299654918,122.85427383278858,123.5613879391622,124.23289269643698,124.87291542952401,125.48486803775657,126.07160736345584,126.6355523676952,127.17877137735198,127.70304888546367,128.20993576456647,128.70078991545273,129.17680765505364,129.63904900808424,130.08845820289991,130.52588035152385,130.95207521148848,131.36772859711263,131.77346191686186,132.16984007665039,132.55737880367255,132.93654955691082,133.30778512576674,133.6714837120517,134.0280126133222,134.37771142125558,134.72089481051233,135.05785498008368,135.38886378241298,135.71417469449531,136.0340243318974,136.34863409288411,136.65821140012176,136.96295089604484,137.26303549842788,137.55863734754234,137.84991865812606,138.13703248753225]
[null,4.5,14.251128215182785,16.432520500306715,18.957707001634727,22.032640426004637,119.81490132889429,120.67376651829413,121.47726043581608,122.23342166644139,122.9485713714635,123.62778125411738,124.27519017466355,124.89422509277881,125.48775935653775,126.058228704063,126.60771783072499,127.13802695744073,127.65072167631082,128.14717368480711,128.62859212134498,129.0960489072408,129.55049925005241,129.9927982769957,130.4237154656127,130.84394513685754,131.25411672290167,131.65480268035245,132.04652533506768,132.42976271380348,132.80495353929581,133.17250153023099,133.53277912021721,133.88613068843517,134.2328753773169,134.57330956235981,134.90770901741448,135.23633083184998,135.55941510126905,135.87718643037798,136.18985527057268,136.49761911409817,136.80066356302726]
[null,4.5999999999999996,13.644776600115531,15.642545759832775,17.896929618403085,20.522924750772333,23.755722766401384,117.22561842502512,118.23703925373204,119.16906057029756,120.03541349910292,120.84638825528408,121.60991987112773,122.3322716974167,123.01848458566184,123.67268275112686,124.29828835793788,124.89817595099848,125.47478606984106,126.0302103303339,126.56625697292908,127.08450021576932,127.58632051248361,128.07293567100373,128.54542600634372,129.0047549004336,129.45178533468209,129.88729378195802,130.31198165614967,130.72648491494115,131.1313821527294,131.5272014624789,131.91442628671294,132.29350043294207,132.66483239413085,133.02879908744902,133.38574910591018,133.73600555196936,134.07986852612538,134.41761731060441,134.74951229781115,135.07579669714059,135.39669805055217]
[null,4.7,13.105673839793988,14.955937335244066,17.006025865057119,19.327044371938324,22.043936836186468,25.416545286179659,114.22751067342669,115.46215543655975,116.57429499487461,117.5899155255883,118.52718298868393,119.39935617805618,120.21644375970807,120.98620818756855,121.71480516279078,122.4072078866609,123.06749822411805,123.69907232383247,124.30478942655023,124.88708169875815,125.44803783683173,125.98946515368911,126.51293989753452,127.01984567492673,127.51140432191852,127.98870074689174,128.4527031112498,128.9042794015908,129.34421107500802,129.77320446652806,130.19190033626629,130.6008819284333,131.00068181238831,131.39178772210732,131.77464750684365,132.14967375023821,132.51724691457028,132.87771919382286,133.23141705760781,133.5786438032917,133.91968174886307]
[null,4.8,12.621107624276664,14.34950818942011,16.2383735979117,18.334779408749501,20.713568867034098,23.506721200267233,26.990000220131233,110.61664804277939,112.21117930209932,113.59436479655214,114.82350788765781,115.93453378388681,116.95162926925609,117.89194698173402,118.76814266505512,119.58985094444883,120.36459485933129,121.09837318675397,121.79605447685931,122.46164999397276,123.09850797666512,123.70945499507506,124.29690193107147,124.86292227614328,125.40931443470765,125.93764911196827,126.44930701814211,126.94550898028177,127.42734024065496,127.89577024950478,128.35166892855921,128.79582013815022,129.22893291323408,129.65165090034986,130.06456030679254,130.46819681277827,130.86305110213206,131.24957410527173,131.62818116435702,131.99925578571475,132.36315288400851]
[null,4.9000000000000004,12.181694757492217,13.807217305764055,15.564652784938929,17.486745595758588,19.621960232683218,22.047189983907604,24.897458868294375,28.452276329078444,33.516373310836698,108.21964655665415,110.05875387544597,111.61839637112847,112.98295704572101,114.20235815303931,115.30886667924649,116.32467654689115,117.26577786126782,118.14411244806264,118.96885865638869,119.74723859932375,120.48504756220422,121.18701373036797,121.85704977523795,122.49843486321639,123.11394540085303,123.70595606995212,124.27651492030148,124.82740184020017,125.3601743508391,125.87620391067814,126.37670501417416,126.86275874891108,127.33533204096936,127.79529357928121,128.24342662878414,128.68044073224837,129.10698027373266,129.52363266888923,129.93093497258761,130.32937959514047,130.7194192200536]
[null,5,11.780297733711095,13.31746440078107,14.965094496764396,16.746834367863865,18.69584610978357,20.860982754647562,23.319181446067002,26.203859626305526,29.784656853202055,34.792141670263717,102.84908543960121,105.62739350317227,107.76655995275608,109.53384676340858,111.05358990603231,112.39492063987316,113.60067139254961,114.69940430056934,115.71121319130995,116.65082213550903,117.52937315721205,118.35552016148776,119.13613090319093,119.87675507276762,120.58194810210476,121.25549792415524,121.90059243641876,122.51994179301064,123.1158710582135,123.69039119957219,124.24525426760974,124.78199690501756,125.30197461327957,125.80639026776156,126.29631608022352,126.77271248234294,127.23644338808244,127.68828895462369,128.12895627834357,128.55908841710669,128.97927204592926]
[null,5.0999999999999996,11.411353739094608,12.871566768498482,14.425675617652553,16.091267801770432,17.891990570642424,19.860810024741998,22.045875291309027,24.5220435771949,27.416447474451797,30.976525658593783,35.817170819440548,44.934834358335465,99.423841459059631,102.8427056059443,105.34053704996927,107.34666400413845,109.04078871908833,110.51698934776356,111.83126635974254,113.01989299886564,114.10782789857551,115.11303943829105,116.04892957324411,116.92578217585439,117.7516758573111,118.53308024962469,119.27526445101893,119.98258096821465,120.65867002531915,121.30660965656266,121.92902666156971,122.5281840311974,123.1060445188496,123.66432321442892,124.20452808226916,124.72799259181141,125.23590210180734,125.72931506128187,126.20918178499815,126.67635782634819,127.13161699984776]
["Tc = 5,2K",5.1999999999999904,11.070438056318459,12.462844676656603,13.93605739881963,15.503473317402133,17.182505172458033,18.996412221079083,20.977332666400383,23.171625792781235,25.650063114828978,28.529472112957428,32.026355343470357,36.62666678049203,43.963838623221797,86.958448280413933,95.732807677908838,99.90334454078706,102.80423940420786,105.07314365141362,106.95663381434052,108.57796995928658,110.00824566412498,111.29244992030047,112.46097921746086,113.53539833154268,114.53159722124799,115.4616444588176,116.33493626982607,117.15894102905641,117.93969959852463,118.68217209427556,119.3904846254141,120.06810889915245,120.71799558223836,121.3426750750311,121.94433485437314,122.52487966526982,123.08597895454086,123.62910467538295,124.15556172967766,124.66651269037838,125.16299820197187]
[null,5.2999999999999901,10.75397171994423,12.086042419072715,13.488381553336367,14.971397142932878,16.548245451851344,18.235910839293773,20.056881279233934,22.041866593835415,24.23445730986256,26.699682496065094,29.541216080383407,32.940510040858094,37.263310942807003,43.447544537342573,55.467849513729227,82.117930903949315,92.044658199416972,96.906441380461203,100.2079085010914,102.74422387456757,104.82225936207114,106.59333042072946,108.14350299021707,109.52656393348518,110.77845820528694,111.92444464583947,112.98298010202089,113.96797961898244,114.89020620601018,115.75816497397616,116.57869815503682,117.35739781882073,118.09889535521627,118.80707212913515,119.48521493851399,120.13613294643675,120.76224704254489,121.36565911097748,121.9482064131665,122.51150478027877,123.0569832800018]
[null,5.3999999999999897,10.459016339949597,11.736946395594238,13.076525891928361,14.48597577435147,15.975448354177242,17.557689806497429,19.24901491305295,21.070789224528529,23.051772612679642,25.232002891507566,27.669611352162153,30.453669271351199,33.730706193715598,37.76628399795279,43.110988474696683,51.110587105285383,64.577373389776184,79.858852444613589,88.785990652177759,94.012327621490428,97.63204848587624,100.40774517692194,102.66928894078221,104.58555285116113,106.25388633470084,107.73537442773808,109.07083626473474,110.28889905597759,111.41042119033671,112.45107752133511,113.42295173397017,114.33556042300933,115.1965359668342,116.01209653520901,116.7873761432683,117.52666617034647,118.23359078916515,118.91123976037116,119.56226948497076,120.18898115799374,120.79338199172403]
[null,5.4999999999999902,10.18312985308569,11.412124407578331,12.695622366215208,14.040209783476911,15.453860112768645,16.946354589501862,18.529873028360452,20.219846394590078,22.0362221860373,24.005404771431788,26.163345397495455,28.560684439444156,31.271756566218258,34.411295776435438,38.167304874500857,42.8679961937831,49.101927211372605,57.707794408309589,68.505382434453708,78.73503970875133,86.22260965211693,91.393444712029208,95.175569285067084,98.125048285199782,100.53878060831684,102.58383645462727,104.36116776628765,105.93573334155364,107.35155547375847,108.63975074689412,109.82308989305635,110.91872201665302,111.93987822476669,112.89697849420808,113.79837492097356,114.65086525622566,115.46005667143196,116.23062913232729,116.9665298140729,117.67111910713737,118.34728238649714]
[null,5.5999999999999899,9.9242596088120809,11.108741744111093,12.341733024071177,13.628573920791334,14.975621065009097,16.390520828195019,17.882579746686467,19.463276258244854,21.146982248844161,22.952003970285801,24.90212213380067,27.028934356535643,29.375523900476551,32.002374038332341,34.997118644487131,38.490590410328132,42.681030343885062,47.855539115207208,54.330185632530359,62.103690238074371,70.407094186185645,78.062588273170775,84.315358293482305,89.154815904999055,92.927531826841971,95.960025274898641,98.476497701822154,100.62186600729028,102.49091548462651,104.14760928214105,105.63660340581869,106.99007668487207,108.23188237303093,109.38013843441018,110.44890569172956,111.44930131261151,112.39025966672554,113.27906474313899,114.12173093463021,114.92328076922448,115.68795108781744]
[null,5.6999999999999904,9.6806635502065195,10.824429931690446,12.011625286031494,13.246625863338316,14.534565099538019,15.881514600993155,17.29472355047384,18.782936557198848,20.356823282816247,22.02956825962638,23.817694273751705,25.742231476179693,27.830404300898941,30.118096596795361,32.65346757595541,35.502155560335453,38.754187251631166,42.530698284091692,46.980860548083363,52.239535519786315,58.303781090258518,64.890125006334998,71.491217019908206,77.602611667324339,82.89824453683012,87.306745367512718,90.940354395425999,93.964423575834843,96.525205976414725,98.733650645236196,100.67014953221565,102.3927038924447,103.94366446686237,105.35450722545066,106.64907481767608,107.84576290641522,108.95901244609692,110.00033647281809,110.97904587471032,111.90276727915005,112.77782018640822]
[null,5.7999999999999901,9.4508503611417893,10.557188726990768,11.702611208453048,12.890738015582789,14.125760265685317,15.412564732391962,16.756890034368141,18.165530744915493,19.646602133875053,21.20988914668451,22.867310991736215,24.633545605221386,26.526875184549372,28.570333818093626,30.793254211367053,33.233290517504919,35.938862824555663,38.971464824360353,42.40583650712729,46.32260691292533,50.782987479555842,55.777851165617918,61.175888280296583,66.733836874964965,72.174656332312907,77.257961391973694,81.820408811229356,85.799817429732173,89.223711659718845,92.16761227293911,94.717078161455987,{"$f":"[1]!HeCalc($D$9,0,1,AH$11*10^5,2,$B34,1)","v":96.948574468276362},98.924184307257249,100.69242569465992,102.29079676890176,103.74833582850012,105.08771252805073,106.32681673799939,107.4799322472544,108.55859767593299,109.57223816979359]
[null,5.8999999999999897,9.2335334378379432,10.305313332853711,11.412431517260435,12.557907332186188,13.745196653562672,14.97827785880243,16.261757126420314,17.601002012029255,19.002309465131017,{"$f":"[1]!HeCalc($D$9,0,1,L$11*10^5,2,$B35,1)","v":20.473119629971347},22.022289359103667,23.66044359842957,25.400427311717038,27.2578839426297,29.251985628289557,31.406319504973283,33.749882043074372,36.31796701304107,39.152364505748878,42.299513869881764,45.804009871390718,49.694039394980216,53.95833596951227,58.525246024458575,63.264639467407221,{"$f":"[1]!HeCalc($D$9,0,1,AB$11*10^5,2,$B35,1)","v":68.018093816768243},72.633181666063251,76.982744394440047,80.976035668861414,84.567701881798399,87.757171961140202,90.575728352919342,93.06964012260876,95.287494087760834,97.273594016204996,99.065674444311966,100.69484209834924,102.18638616880767,103.56079557068904,104.83471000728329,106.02171340012458]
[null,5.9999999999999902,{"$f":"[1]!HeCalc($D$9,0,1,C$11*10^5,2,$B36,1)","v":9.0275950048101112},10.067338727903316,11.139168045680242,12.245619708444565,13.389568065618205,14.574284447094346,15.803510810282202,17.081547471618418,18.413363038100862,19.804729023499426,21.262386447074363,22.794251805746367,24.409670800033584,26.119727688391865,27.937615438573445,29.879057811816804,31.96275379786783,34.210748271530889,36.648518611861178,39.304342958895454,42.207172836388587,45.381874069579801,48.840872691444432,52.573011595100716,56.534397031231308,60.648824408236337,64.820501598694619,68.951389948932956,72.953179790073065,76.752679858582439,80.295491394423919,83.549717294025697,86.506860372331403,89.177909105849622,91.586342459715453,93.761219986752167,95.732252379173772,97.527045083679013,99.169949509708573,100.68184650443148,102.08037575471701]
[null,6.0999999999999899,8.8320577942712628,9.8419965877473121,10.881178156198883,11.95174785196811,13.056114513452089,14.1969927951217,15.377453252669456,16.600983998626258,17.87156159352563,19.193738880711933,20.572749102966018,22.014630622876581,23.52637493039397,25.116099693235284,26.793246457742377,28.568793984066559,30.455469949549439,32.467913404299388,34.622700176954034,36.938066423723861,39.433054945083548,42.125683740680344,45.02969099213685,48.149699131773929,51.475553285935788,54.978075272784892,58.609256319132918,62.308114461921427,66.009631542799852,69.652288555132927,73.182010601707503,76.553778619107604,79.733024907890552,82.697283149508792,85.436964548480475,87.954234762452657,90.260191772886131,92.371413755410813,94.306903776981372,96.085897113042392,97.726555003940504]
[null,6.1999999999999904,8.6460624459258852,9.6281815114501192,10.637044172856587,11.674475546535364,12.742508182521918,13.843412391327018,14.979731518259696,16.154324304746702,17.3704128109352,18.631640127604339,19.942137049742232,21.306599579064898,22.730377882866986,24.219576477793275,25.781163946492516,27.42308541583656,29.154367530409228,30.985190733718316,32.926888077292084,34.991799595939383,37.192871169521979,39.542839900730037,42.0528187443131,44.73013530337483,47.575496831652494,50.579999936802871,53.723074931827703,56.97265196780112,60.288095066331394,63.62495766062866,66.939591201953021,70.192136737725065,73.347812815610396,76.37743332513088,79.257994699643746,81.973452572387387,84.51521838763513,86.881885615607828,89.078102584125588,91.112918416563716,92.998047411987486]
[null,6.2999999999999901,8.4688492894915317,9.4249242302224836,10.405533969363093,11.412239524381732,12.44676648980461,13.511026963437788,14.607144786642506,15.737484305801152,16.904684624502391,18.111696712800473,19.361827589637414,20.658789340655396,22.006753838022426,23.410412254847277,24.875037629651857,26.406545860178305,28.011548748520038,29.697385182604201,31.472109874219672,33.344406057032785,35.323372443339544,37.418116031806662,39.637067879963766,41.986944965961349,44.471333286079179,47.089003163066018,49.832281074070046,52.686024957070856,55.627782081144154,58.629375857279825,61.659537182077969,64.686702204936154,67.681149148917072,70.616144280455742,73.468363086804104,76.218064664239449,78.849356717617994,81.350577424959042,83.714588637636524,85.938746482109906,88.024454660230504]
[null,6.3999999999999897,8.2997435247458533,9.2313701276018563,10.185569869695078,11.163684391500871,12.167186820351413,13.197697746159697,14.257003317978029,15.347075707047287,16.470095857617785,17.628480371183748,18.824909009587941,20.062357129006639,21.344129760720183,22.673897622977666,24.055733423904424,25.494145429483414,26.994104138472945,28.561054148334104,30.200900097927967,31.919949570906841,33.724788827776891,35.622059217870977,37.618094857437477,39.718386638883324,41.926835859762562,44.244835309563143,46.670252026365965,49.196520241299176,51.812122611550464,54.500733143725896,57.242132476640506,60.013727684313878,62.79226752700054,65.555304100296041,68.282137204390779,70.954251397910525,73.555447158011802,76.071899617944396,78.492283556760583,80.8079674462589,83.013182107542974]
[null,6.4999999999999902,8.1381430637423389,9.0467618506984468,9.976203832559067,10.927627221009491,11.902295937351935,12.901591328037338,13.927025234108775,14.980254525985648,16.063097192636306,17.177549694769969,18.325807321802685,19.510283426279468,20.733631954974715,21.998769303814967,23.308895548410025,24.6675129148373,26.078438669349516,27.545807825998377,29.074059321945469,30.667896419749553,32.332208824144416,34.071940348318428,35.891882842605284,37.796375937097125,39.788899557313023,41.871550627257676,44.0444428786194,46.305087323226978,48.647877721379608,51.063827956710753,53.540694872083741,56.063537144023449,58.615629292898731,61.179532154640569,63.738076588637142,66.275090204926329,68.775808489176754,71.227037646360515,73.617188769695446,75.936295269235899,78.176073092082333]
[null,6.5999999999999899,7.9835084795936027,8.8704251083440475,9.7765974485114899,10.703029415944796,11.650810393044569,12.621123865290915,13.615256915126718,14.634610612225156,15.680711314036239,16.755222849156773,17.859959152958421,18.996898982807199,20.168198263314263,21.376204518212926,22.623469050168225,23.912756896125931,25.24705239499977,26.629557642098604,28.063680029548205,29.553003643718299,31.101237674513094,32.712133238579256,34.389358512867553,36.13632152136784,37.955931284146104,39.850295038495126,41.820354502520367,43.865493070865028,45.983154822903799,48.16854930136023,50.414521430430064,52.71165377517594,55.048624206852985,57.412776996993287,59.790804868600262,62.169412322137653,64.53585073316259,66.878270645152,69.185899852162166,71.449100095065972,73.659369387243572]
[null,6.6999999999999904,7.8353546373173533,8.7017569776172472,9.5860056668705003,10.488974112591551,11.411605174508422,12.354917557097201,13.32001273641691,14.308082422450029,15.320416534949555,16.358411635968295,17.423579711218103,18.517556793788572,19.642112921466939,20.799158941797256,21.990754493057832,23.219112876145196,24.486602726922925,25.795744637883089,27.149200368118745,28.549751565018234,30.000264082803053,31.503633104450437,33.062703525340048,34.680159741681116,36.358379590421926,38.099249272605377,39.903941634488497,41.772664521437157,43.704402999806902,45.696683307718658,47.745402641694724,49.844768512789685,51.987382291448014,54.16447724220631,56.366287338346481,58.582493787185946,60.802674349160789,63.016687854735252,65.214962407435522,67.388662281834641,69.529764109921047]
[null,6.7999999999999901,7.693243679048626,8.5402162035200444,9.4037634445956009,10.284647858855434,11.183688600693891,12.101766267337702,13.039827967554359,13.998892696728898,14.980056981268589,15.984500727382519,17.013493170357634,18.068398766862853,19.15068250189659,20.261915937209043,21.403779699866728,22.578066586896007,23.786681006374639,25.031634968588683,26.315038923802604,27.639085575430798,29.006024344512586,30.418123704766082,31.877618225529314,33.386636991846643,34.947110332283252,36.560652350230839,38.228422141335813,39.950958743912743,41.728011696913889,43.558369320623363,45.439712203084497,47.368515367072789,49.34002405426201,51.348321280474444,53.386491509058374,55.446866719806096,57.521323901464548,59.601594388622367,61.679540902606782,63.747379425786924,65.797826863421719]
[null,6.8999999999999897,7.5567791082355615,8.3853150963281422,9.2292747070438068,10.089325628383166,10.966182025367814,11.860608067659003,12.773421643720328,13.705498236333307,14.657774918225838,15.63125440479903,16.627009071705746,17.646184806177843,18.69000450985558,19.759770746587602,20.856868644738068,21.982765250033189,23.139008923503134,24.32722511256533,25.549108645392515,26.806411198379827,28.100922512584766,29.434443690502778,30.808750705164762,32.225546167263204,33.686397524201055,35.19266034493014,36.745386096323095,38.345217407370129,39.992269725108407,41.686014054143698,43.425163946987226,45.207584161626272,47.030235217684577,48.889168036401003,50.779578298083287,52.695922104195645,54.632084496725561,56.581582888809159,58.537781760758932,60.494093219858698,62.444145113919213]
[null,6.9999999999999902,7.4256007720299726,8.2366127200122996,9.0620031546243069,9.9023584643082359,10.758303277636355,11.630503086336818,12.519666966013411,13.426550367252473,14.351957937068978,15.29674631392087,16.26182681775418,17.248167928445298,18.256797410057391,19.288803736906054,20.345337449870442,21.42761009542901,22.53689286588957,23.674512675572142,24.84184570701246,26.040307566918809,27.271339155192408,28.536387216192669,29.836878435625888,31.174185903800208,32.549586836723861,33.964210697192428,35.418976808450878,36.914525740932199,38.451135429860514,40.028642218515628,41.646357033016756,43.302991533221672,44.996601337770144,46.724555576727639,48.483540934291106,50.269605321231047,52.078241517789948,53.904505389369746,55.743157888962322,57.588815960710377,59.436100773968192]
[null,7.0999999999999899,7.2993805827076175,8.093709131828053,8.9014645557344068,9.7231632155703771,10.559353039961538,11.410615472695847,12.277567461134998,13.160863458907126,14.061197406467185,14.979304640385905,15.915963666091384,16.871997708477195,17.84827592943838,18.845714074407603,19.865274903762685,20.907966934238154,21.974842755244698,23.066995495777164,24.185553424585944,25.331672123583321,26.50652365646426,27.711282079543775,28.94710458510545,30.215107547745614,31.516336787270404,32.85173150136886,34.222081597495148,35.627978280852986,37.069760955385973,38.547455856082685,40.060719067681738,41.608778997837902,43.190387785568241,44.803786326575803,46.446688590868057,48.116289970400551,49.809302391162625,51.522016002309044,53.250383886684325,54.990123097583954,56.736822909180873]
[null,7.1999999999999904,7.1778188509801062,7.9562404837472727,8.7472202457718957,9.551213952945405,10.36870355726631,11.200198588352666,12.046237599822398,12.907389596355491,13.784255409532914,14.677468980915183,15.587698498883011,16.515647321063739,17.462054596217921,18.42769541798134,19.413380712617887,20.419955913526636,21.448299193183633,22.499318335571228,23.573946214455457,24.673134505538002,25.797845252172632,26.949039861847861,28.12766508018721,29.334635481130722,30.570812040212328,31.836976440180702,33.133800915432317,34.461813101973981,35.821360288254731,37.212562804278434,38.635275182938067,40.089042259029441,41.573060356996088,43.086145459637621,44.626712040653743,46.192766061160356,47.781914895319041,49.391395619305406,51.018121285464524,52.658742779840487,54.309721904163098]
[null,7.2999999999999901,7.0606411289148987,7.8238748351238154,8.5988716119482227,9.3860347442403231,10.18578921243588,10.998582753525957,11.824886904992663,12.66519801032555,13.520038158790111,14.389956024851472,15.275527563824038,16.177356509659347,17.096074608024391,18.032341464461233,18.98684412366158,19.96029575513327,20.953433929056164,21.967017875021543,23.001824688306321,24.058644231888902,25.138272479449466,26.241503020321009,27.3691164311542,28.521867216832472,29.700468042695285,30.905571031061552,32.137745988583745,33.397455578827703,34.685027316507352,36.000625238235209,37.34421548751564,38.715537229667255,40.114071625817871,41.539015279048272,42.989259557356583,44.46337818458008,45.959625267161698,47.475945373503173,49.00999639403561,50.559184766729047,52.120711411219553]
[null,7.3999999999999897,6.9475954796225698,7.6963085558917301,8.4560553893039181,9.2271935374963618,10.010098608491536,10.805165034936595,11.612806818609616,12.433458226684495,13.267574416684724,14.115631961579219,14.978129239936759,15.855586648308508,16.748546583900001,17.657573109821197,18.583251371078038,19.526186336549912,20.487001183272824,21.466334907518043,22.464839133620735,23.483173947035731,24.522002578248227,25.581984750268251,26.663768494036056,27.76798023662861,28.895212981135035,30.046012429886638,31.220860960583838,32.420159454234764,33.644206548277218,34.893179268772535,36.167105322724744,37.46584322948577,38.789057951887045,40.136199587707615,41.50648530586404,42.898886105403975,44.312119952053862,45.744652638687761,47.194707312225226,48.660283012374009,{"$f":"[1]!HeCalc($D$9,0,1,AQ$11*10^5,2,$B50,1)","v":50.139181835000116}]
[null,7.4999999999999902,6.8384501061944762,7.5732632228872783,8.3184396284647111,9.0742969537319116,9.8411678763483526,10.619400678730351,11.409359769553541,12.21142615305941,13.025997826877429,13.853490084949435,14.694335697300149,15.548984932752623,16.417905384160932,17.3015815311268,18.200514081964872,19.11521879642347,20.046225006560544,20.994073541407037,21.959314034691989,22.942501494009683,23.944192011782388,24.9649374904611,26.00527925028916,27.06574038971484,28.146816778794204,29.248966587802432,30.372598290295493,31.518057135699003,32.685610164488132,33.875429612047192,35.087577190401255,36.32198358340171,37.578433027652096,38.856545730319425,40.155762451096358,41.475334371801274,42.814310713076836,44.171539460543137,45.545667686760957,46.935150623529779,48.338266754684497]
[null,7.5999999999999899,6.7329912845365296,7.4544829301691919,8.1857202229394055,8.9269858311476238,9.6785749865963258,10.440795879210352,11.21397001249367,11.998432506469323,12.794532332079093,13.602632457912382,14.423109886541488,15.256355553616665,16.102774058181392,16.962783175281452,17.83681317814553,18.725305753046708,19.628712664555415,20.547493955280387,21.48211566731214,22.433046998770575,23.400756811858535,24.385709404396355,25.38835945503472,26.409146054495618,27.448485742846007,28.506764487812113,29.584328563547349,30.681474325192138,31.798436923950497,32.935377600076968,34.092372848221011,35.269397130483554,36.466312394145717,37.682853895639951,38.918618030683248,40.173051773821733,41.445444878652339,42.734924285138227,44.040453522695209,45.360835498197559,46.694720255205617]
[null,7.6999999999999904,6.6310215544626185,7.3397319486679562,8.0576179050840846,8.7849313939539382,9.5219348892476212,10.268901640135905,11.026115903014173,11.793873122862701,12.572480050688979,13.362254781456613,14.163526694236964,14.976636273300178,15.801934785477229,16.639783776505315,17.490554405652443,18.354626455996929,19.232387140781135,20.124229542351745,21.030550677485337,21.951749126530018,22.888222167307333,23.840362352327048,24.808553467345863,25.793165811452145,26.794550744645381,27.813034459416375,28.848910949341583,29.902434171433814,30.973809431085545,32.063184059751009,33.1706372226325,34.29617090842585,35.439697153636359,36.601029607409778,37.779873152689468,38.97581514389308,40.188318073308714,41.416714572871157,42.660204045552433,43.917853347727679,45.188599849778484]
[null,7.7999999999999901,6.5323581312241892,7.2287926820041477,7.9338756366619378,8.6478319433405737,9.3708953404915079,10.103308535658639,10.845323346050595,11.597200791526733,12.359211129063761,13.131633816005252,13.914757387411248,14.70887923061013,15.514305237606672,16.331349306607937,17.160332707462818,18.001583185690084,18.855433901025251,19.722222073280744,20.602287334304162,21.495969740220136,22.40360740182928,23.325533689832533,24.262073971678173,25.213541838801575,26.180234787446743,27.162429323807991,28.160375475650625,29.174290708610897,30.204353266724624,31.250694983906222,32.313393267111138,33.392464855041602,34.487854670960424,35.599430138250391,36.726972620933537,37.87017023123547,39.028611568333247,40.201780742437343,41.389054039175967,42.589698555298185,43.802873083493786]
[null,7.8999999999999897,6.4368315059711163,7.121463874538092,7.8142563332651989,8.515409987250921,9.2251333028012787,9.9436422166959737,10.671160209369429,11.407918334194395,12.154155193865961,12.91011685355255,13.676056679002498,14.452235086167008,15.238919187125878,16.036382309954423,16.844903404645915,17.664766236329186,18.496258444604628,19.339670367874554,20.195293634947483,21.063419489965955,21.94433682034709,22.838329856906405,23.745675515776146,24.666640353459695,25.601477109766201,26.550420818870627,27.513684476802741,28.491454264739918,29.483884341981749,30.491091240733194,31.513147441650524,32.550077307747181,33.601847012026262,34.668361075092115,35.749455239585053,36.844890613110444,37.954348401611853,39.07742548027921,40.213631056536286,41.362384672508689,42.523015770088975]
[null,7.9999999999999796,6.3442842087778812,7.0175590351481674,7.6985408725217344,8.3874097407775494,9.0843518261440046,9.7895595386098506,10.503231535845339,11.225572707137466,11.956794109934398,12.697112850589832,13.446751899796668,14.205939832001475,14.974910476803585,15.7539024647996,16.543158678231215,17.342925527275671,18.153452118047674,18.974989230639604,19.8077881117303,20.652099056335256,21.508169756723365,22.376243396394543,23.256556467579507,24.14933629220188,25.054798228880852,25.973142552620633,26.904550999617104,27.849182977396559,28.807171450541183,29.778618524747127,30.76359076698898,31.762114025423113,32.774169727442953,33.799687534880739,34.838542173371927,35.890548110219861,36.955455177763035,38.032944749025226,39.122626399110068,40.224036975015899,41.33663702472014]
[null,8.0999999999999801,6.2545697120703512,6.9169050462637021,7.5865263445763302,8.2635949410723519,8.9482773349525946,9.6407452095903281,10.341175420867755,11.049749949419081,11.766655810692239,12.492084915983535,13.22623387677805,13.969303743847004,14.721499671617796,15.483030493969455,16.254108220515032,{"$f":"[1]!HeCalc($D$9,0,1,R$11*10^5,2,$B57,1)","v":17.034947389146108},17.825764330831284,18.626776279984963,19.43820033622012,20.260252258265183,21.093145074006934,21.937087490703167,22.792282090000775,23.658923293639479,24.537195087779914,25.42726849694067,26.329298802745178,27.243422508242798,28.169754055639324,29.10838231397026,30.059366863630089,{"$f":"[1]!HeCalc($D$9,0,1,AH$11*10^5,2,$B57,1)","v":31.022733765002851},31.998473147894522,32.986532464095923,33.98681460665459,34.999173399740222,36.023409983409294,37.05926956719307,38.1064386831032,39.164543058953917,40.233146330727962]
[null,8.1999999999999797,6.1675514557409956,6.8193409325939811,7.4780245102660929,8.1437469303529078,8.8166572589685259,9.496908877699541,10.1846594466704,10.880070835245,{"$f":"[1]!HeCalc($D$9,0,1,K$11*10^5,2,$B58,1)","v":11.583309015359896},12.294543911912843,13.013949204017832,13.741702070288769,14.477982870634417,15.222974753574015,15.97686319706847,16.739835430338282,17.512079784343062,18.29378491610353,19.085138913252905,19.886328264174399,20.697536681952311,21.518943770553932,22.350723522224836,23.193042636118051,24.04605864979213,24.909917877519977,25.784753152464738,26.670681373814965,27.567800865028083,28.476188555484747,29.395897005138874,30.326950893221895,31.269345640077269,32.22304107410411,33.187960595337437,34.163987315332726,35.150961077730713,36.14867572838893,37.156876729265555,38.175259213890754,39.203466253559519]
[null,8.2999999999999794,{"$f":"[1]!HeCalc($D$9,0,1,C$11*10^5,2,$B59,1)","v":6.0831019780904274},6.7247167680226179,7.3728604380446789,8.0276629684041474,8.6892579568306054,9.3577825892659359,10.03337758542836,10.716187115499386,11.406358683819015,12.104042975043495,12.809393657763401,13.522567140102392,14.243722271323994,14.973019980686121,15.710622860595215,16.456694650887215,17.211399664849814,17.974902111749859,18.747365322330623,19.528950866048454,20.319817551365102,21.120120300648299,21.930008891748933,22.749626559182438,23.579108449116436,24.418579924129698,25.26815471603685,26.127932928039343,26.997998891131378,27.878418884105233,28.769238731683672,29.670481301242983,30.582143671798171,31.504195651025604,32.436575223086002,33.379187486077164,34.33190174137173,35.294549209272262,36.266920984260288,37.248766301738364,38.239790789028852]
[null,8.3999999999999808,6.0011021390975756,6.6328927024545701,7.2708712953186652,7.9151547423207278,8.5658628899592593,9.2231185630987227,9.8870474988722652,10.557778254912378,11.235442088525398,11.920172803101096,12.612106557708822,13.311381635480997,14.018138166027867,14.732517794877806,15.454663306132423,16.184718162764156,16.922825999086559,17.669130028010141,18.423772369301354,19.186893290184667,19.958630351856492,20.739117455727754,21.528483783669103,22.326852627242005,23.134340101909459,23.951053743580019,24.7770909865989,25.612537524506997,26.457465557583077,27.311931934394572,28.175976198322147,29.049618554277874,29.93285748933906,30.825668919425588,31.728001897345827,32.639778171735458,33.56088966527993,34.491196566979056,35.430525593566671,36.37866847320587,37.335380706041875]
[null,8.4999999999999805,5.9214404244898846,6.5437380931478506,7.1719052736459457,7.8060470464137106,8.4462710113139572,9.0926872344677001,9.7454081748686043,10.404548588236354,11.070225405324507,11.742557581654207,12.421665915392735,13.107672829839059,13.800702116721178,14.500878634688277,15.208327968391252,15.923176018817982,16.645548554139438,17.375570690166029,18.113366306187793,18.859057389491273,19.612763303775026,20.374599976926032,21.144679004017377,21.923106661972263,22.709982833143989,23.505399836118926,24.309441163392879,25.122180127230799,25.943678417022042,26.773984573806207,27.613132390374286,28.461139248438602,29.318004093710165,30.183707087423961,31.058205515496464,31.941433846929545,32.83330153102073,33.733691404337513,34.642458218681796,35.55942732955036,36.484393586075925]
[null,8.5999999999999801,5.8440123207322801,6.4571307273435616,7.0758206303731495,7.7001766094531048,8.3302953393277974,8.9662755304614539,9.6082178516205037,10.256224832315914,10.910400742813277,11.570851449235116,12.237684241093092,12.911007628400441,13.590931105330355,14.277564875908208,14.971019546400591,15.671405760221173,16.378833800037452,17.093413131564944,17.815251894274372,18.544456333800117,19.281130172491402,20.025373914771627,20.777284084313013,21.536952390515843,22.304464822425043,23.079900669044772,23.863331466046024,24.654819870122576,25.454418463754482,26.262168494896041,27.078098558121127,27.902223226025551,28.734541305846655,29.575035891930032,30.423670441436141,31.280389227497707,32.145115399999334,33.017749653873288,33.898168985077731,34.786225563853279,35.681745756183894]
[null,8.6999999999999797,5.768719752436918,6.3729561249122231,6.9824848318830384,7.5973910499195023,8.2177616920136991,8.843685344576544,9.4752521883933536,10.112553901784279,10.755683544081416,11.404735417397452,12.059804904523014,12.720988280653888,13.388382496518132,14.0620849292734,14.742193105174179,15.428804374100087,16.122015556679205,16.821922542976484,17.528619847385588,18.24220011566419,18.962753581459324,19.690367469871198,20.425125345896124,21.167106405985994,21.916384711479051,22.673028363308859,23.437098618201471,24.208648947536304,24.987724041186826,25.774358759978277,26.568577041903438,27.370390768919275,28.179798250196239,28.996784588546539,29.821317905113901,30.653350097885877,31.49281512244367,32.339627876582703,33.193683149318076,34.054854656618062,34.922994187338276]
[null,8.7999999999999794,5.6954705748618073,6.2911069113302283,6.891773785783804,7.4975479428378264,8.1085075600971539,8.724732183494579,9.3463026483765947,9.9733009848817371,10.605810306055183,11.243914677041694,11.887698963597764,12.537248658066256,13.192649680864346,13.853988154562391,14.521350153958595,15.194821415784874,15.874487025381901,16.560431063045815,17.252736214100967,17.951483339531034,18.656751005189228,19.368614967787401,20.087147616111942,20.812417366241863,21.544488009961231,22.283418016075757,23.029259784970609,23.782058857493148,24.541853080116351,25.308671729341274,26.082534599429618,26.863451058816853,27.651418718403843,28.446424038994884,29.248438698585183,30.057420580369133,30.873312239230245,31.696039965269286,32.525512895234534,33.361622188854383,34.204240288001998]
[null,8.8999999999999808,5.624178115152862,6.211482252642976,6.803571151180166,7.4005139841783896,8.0023811012235608,8.6092439632010276,9.2211750647748207,9.838247843011418,10.460536570864813,11.088116234164302,11.72106239067304,12.359451009715881,13.003358290810995,13.652860458951075,14.308033539412397,14.968953098667313,15.635693965835527,16.308329920480176,16.986933350249394,17.671574875889966,18.362322942157679,19.059243373306362,19.762398892047379,20.471848601141662,21.187647427124038,21.909845526072118,22.638487651825873,23.373612487645097,24.115251942964882,24.863430417676074,25.618164037218705,26.379459862728311,27.147314712658659,27.921715950118141,28.702637993201755,29.490043468599779,30.28388183688277,31.084088604063155,31.890584569263233,32.703275121526666,33.522049599560553]
[null,8.9999999999999805,5.5547607568214676,6.1339873452050213,6.7177677176846631,7.3061642408254786,7.8992402399406121,8.4970599350667868,9.0996883657248677,9.7071913034635262,10.319635151127256,10.937086827734914,11.559613637802039,12.187283123891676,12.82016290113495,13.458320471824415,14.101823022498111,14.750737192525486,15.405128826164615,16.065062696472374,16.730602204060048,17.401809048762889,18.078742873126465,18.761460876749251,19.450017400698261,20.144463481438049,20.844846373987707,21.551209044351129,22.263589631656981,22.982020880900254,23.706529547700367,24.437135777082098,25.173852458945579,25.916684563616819,26.665628092415741,27.420670993900437,28.181789821369499,28.948950998724314,29.722109583196744,30.501208599573268,31.286178401988149,32.076936073360052,32.873384873146414]
[null,9.0999999999999801,5.4871415626629512,6.0585329539484238,6.6342608451076694,7.2143814758036777,7.798951860369332,8.3880297253908562,8.9816734373529616,9.5799419195138373,10.18289455713618,10.790591090160554,11.403091492369803,12.020455836060089,12.642744141205645,13.270016207588844,13.902331431915067,14.539748600937724,15.182325670480028,15.830119520867424,16.483185691307835,17.141578091712489,17.805348691144449,18.474547182200084,19.149220620778419,19.829413040878293,20.515165044287063,21.206513365290867,21.903490410847869,22.606123777025541,23.314435742912039,24.02844274367158,24.748154824922892,25.473575081177238,26.204698716403087,26.941514046904263,27.683999311589513,28.432124006008397,29.185847765426441,29.945119800900507,30.709878356673254,31.48005019673047,32.255550128841875]
[null,9.1999999999999797,5.4212479319309317,5.9850349937475373,6.5529539568480972,7.1250555398751514,7.701391080331323,8.2820124743011103,8.8669721073688006,9.4563227760418354,10.050117598958211,10.648409917127996,11.251253182433082,11.858700833587179,12.470806158740634,13.087622143498908,13.709201306032984,14.335595511968775,14.966855777192714,15.603032050847975,16.244172980657854,16.890325659401746,17.541535351945068,18.197845202326139,18.859295920529192,19.525925448726216,20.197768606953648,20.874856718404935,21.557217214769786,22.244873222336093,22.937843129892823,23.636140139831749,24.339771804242147,25.04873954822347,25.763037825539126,26.482655173384547,27.207571181012188,27.937757855959671,28.673178613602737,29.413787798013171,30.159530219508628,30.910340715046321,31.666143737989344]
[null,9.2999999999999794,5.3570112881049923,5.9134141491454812,6.4737560809263917,7.0380828218234548,7.6064405972590947,8.1788760619173182,8.7554362341611416,9.3361684220789378,9.9211201405640548,10.51033901881201,11.103872697602252,11.701768715717431,12.304074384843531,12.910836651959736,13.522101950606515,14.137916035086594,14.758323804274255,15.383369108757046,16.013094543098767,16.647541222310618,17.286748542093378,17.930753922500624,18.579592534779604,19.233297011274001,19.891897138423001,20.555419533066257,21.223887302464828,21.89731968867617,22.57573169817654,23.259133717907133,23.947531119230732,24.640923851621018,25.339305681507291,26.042665270691064,26.750983307975019,27.464233878634705,28.182383549019796,28.905390958182611,29.633206422734446,30.365771559788445,31.103018933145638]
[null,9.3999999999999808,5.2943667940382424,5.8435955283040739,6.3965814333851254,6.9533657507593487,7.5139900975325444,8.0784964113674711,8.646926888507064,9.2193239144154671,9.7957299865449521,10.376187628723233,10.960739296644633,11.549427273940447,12.14229355829969,12.73937973684308,13.340726851894377,13.94637525232663,14.556364435943232,15.17073287780795,15.789517846014906,16.412755204190752,17.040479200413738,17.672722242309064,18.309514658169803,18.950884444058975,19.596856996972072,20.247454834282181,20.902697299851919,21.562600257379376,22.227175771748595,22.896431779379402,23.570371748815649,24.248994333054153,24.93229268193063,25.620255521542031,26.312864452059742,27.010095297558689,27.711917276087032,28.418292650543414,29.129176390159927,29.844515846453604,30.564250447745515]
[null,9.4999999999999805,5.2332530916585922,5.7755083475510496,6.3213490394521958,6.8708123446516796,7.4239357219998938,7.9807568596712031,8.5413136168105108,9.1056439586675761,9.6737858848129452,10.245777350020516,10.821656177395246,11.401459963320727,11.985225973800901,12.572991031555553,13.164791394809097,13.760662623869818,14.360639439952978,14.964755572136612,15.573043593687656,16.185534747212408,16.802258758407689,17.423243638253162,18.048515473561292,18.678098205889885,19.312013398924563,19.950279994555245,20.592914058002581,21.239928512497539,21.891332864180406,22.547132918064005,23.20733048609943,23.871923088590183,24.54090333215758,25.214259972322992,25.891975378975918,26.57402684885863,27.260385852934121,27.951017737017374,28.645881431005261,29.344929169796593,30.04810622917995]
[null,9.5999999999999801,5.1736120637322358,5.7090856433391437,6.2479823884357506,6.790335800027365,7.3361795813893256,7.8855475887084427,8.4384737763057931,8.9949921361125558,9.555136631063526,10.118941122067836,10.68643928821302,11.257664539857943,11.832649924272117,12.411428023307685,12.994030843873439,13.580489698059164,14.170835076533898,14.765096511902655,15.363302433046064,15.965480010023663,16.571654989386513,17.181851519799423,17.796091967937276,18.414396724694093,19.036784001828146,19.663269619262376,20.293866783367005,20.928585856670214,21.567434119574354,22.210415524797792,22.857530445416828,23.508775417546651,24.164142577200433,24.823620692269856,25.487192795365207,26.154837445648717,26.826528046415206,27.502232587633003,28.181913395530994,28.865526891720648,29.55302336449008]
[null,9.6999999999999797,5.1153886154880626,5.6442640088122351,6.1764091188136341,6.7118541184187022,7.2506293161261741,7.7927651095145078,8.3382919339478647,8.8872402062081939,9.4396402627767699,9.9955222924857985,10.554916263259955,11.117851842668927,11.684358312015872,12.254464473550431,12.828198551434694,13.405588083922744,13.986659809695453,14.571439545683328,15.159952057223167,15.752220920229039,16.348268375275069,16.948115173534287,17.551780414572111,18.159281376055073,18.770633335505899,19.38584938431498,20.0049402343064,20.627914017253566,21.25477607784579,21.885528760721908,22.520171192310674,23.158699058348756,23.801104093921698,24.447375074532346,25.09749561436335,25.751445367842766,26.40919941119812,27.070728020408385,27.735996454988118,28.404964749619538,29.077587515765732]
[null,9.7999999999999794,5.05853047415372,5.5809833525030559,6.1065607304058016,6.6352897656812972,7.1671976957622379,7.7023117940147996,8.2406593218029265,8.7822674760707944,9.3271633322153686,9.8753737820200325,10.426925466421279,10.981844702882912,11.540157407157198,12.101889009104287,12.66706436308224,{"$f":"[1]!HeCalc($D$9,0,1,R$11*10^5,2,$B74,1)","v":13.235707650866019},13.807842279478942,14.383490771795934,14.962674650615579,15.545414315959796,16.131728915537245,16.721636208346798,17.31515242144329,17.912292099939858,18.51306795037992,19.117490677677154,19.725568815894079,20.337308553209173,20.952713551508552,21.571784761131202,22.194520231396041,22.820914917644156,23.450960219502491,24.08464492362139,24.721953163909316,25.362865556282152,26.007358638622964,26.655404678745679,27.306971487231955,27.962022236782694,28.620515289819526]
[null,9.8999999999999808,{"$f":"[1]!HeCalc($D$9,0,1,C$11*10^5,2,$B75,1)","v":5.002988004673754},5.5191866769728977,6.0383723208861726,6.5605693607751361,7.0858022538175609,7.6140954490577144,8.1454733426830099,8.6799602293398372,9.2175802493005783,9.7583573312944427,10.302315130816638,10.849476963733956,11.399865735010284,11.953503862290132,12.510413194757318,13.070614925631029,13.634129500226958,14.20097651786975,14.771174628230465,15.344741421909028,15.921693315226699,16.502045429227717,17.085811462928465,17.673003560896149,18.263632175288119,18.857705922537043,19.455231434926755,20.056213207368696,20.660653439758875,21.268551875370914,21.879905635820883,22.494709053224124,23.112953252313527,23.734627039826961,24.359715021972974,24.988198668336551,25.620055805221739,26.25526044912764,26.893782644332088,27.535588305927114,28.180639069724954]
[null,9.9999999999999805,4.9487139814227232,5.4588198754524093,5.9717823442094735,6.4876233910068413,7.006364954345992,7.5280289282437973,8.0526371205628333,8.580211207839282,9.110772686453938,9.6443428199930121,10.18094258264829,10.720592598510231,11.263313076613153,11.809123741524619,12.358043759818205,12.910091661118916,13.465285255277916,14.023641544307933,14.585176629551283,15.149905613948302,15.717842499392379,16.289000079186966,16.863389825653346,17.441021772974615,18.02190439540238,18.606044480997937,19.193447001128774,19.784114975994687,20.378049336515499,20.975248782973598,21.575709640869732,22.179425714518882,22.786387909127541,23.39658506378143,24.010002220337302,24.626621614503801,25.246422217996773,25.869379593766578,26.495465754716182,27.124649027016314,27.756893919183256]
[null,10.1,4.8956636768233404,5.3998315447595227,5.906732388805862,6.4163859510823009,6.9288118869768454,7.4440297775990745,7.9620590909985189,8.4829191402844604,9.0066290385200585,9.533207650265842,10.062673539650785,10.595044914853389,11.130339568880995,11.66857481648276,12.209767427472251,12.753933555412859,13.301088662921622,13.85124744250118,14.404423733288079,14.960630433622477,15.519879409440666,16.082181398517275,16.647545910611854,17.215981123605989,17.787493775751329,18.362089054186612,18.939770479922565,19.520539789537729,20.104396813875518,20.69133935408297,21.281363055384887,21.874460994127492,22.470624760879506,23.069842386419342,23.672099604559143,24.277379345481787,24.885661607438625,25.496923330574749,26.111138273743528,26.728276895224766,27.348306238309029]
[null,10.199999999999999,4.8437943321960768,5.3421728129601709,5.8431669736378247,6.3467945036238067,6.8530729875669048,7.362019911614917,7.8736526273535556,8.3879883130023369,8.9050439317633288,9.4248361872210378,9.9473814756951491,10.472695835452143,11.000794892687457,11.531693804148631,12.065407196623935,12.601949102462573,13.14133289213806,13.683571202988611,14.228675864454125,14.776657819743514,15.327527043944917,15.881292458613006,16.437961842891379,16.997541741254587,17.56003736798321,18.125452508516705,18.693789417863123,19.265048716280791,19.839229282486521,20.416328144685803,20.99634036976402,21.5792586906718,22.165074499970498,22.753775963427309,23.345349174722674,23.939777699377423,24.537042462664338,25.137121639380023,25.739990546194026,26.345621537334974,26.953983904411754]
[null,10.3,4.7930652940410301,5.2857971245542386,5.7810333604245399,6.2787896590711156,6.7790817819277391,7.2819253165869,7.7873356991419458,8.2953281782504611,8.8059177766828753,9.3191192502737863,9.8349470441969817,10.353415246489423,10.874537538754813,11.398327143945414,11.924796771404845,12.453958558509344,12.985824009721739,13.520403932372137,14.057708369428518,14.597746529213328,15.140526712086162,15.686056234131467,16.234341347910298,16.785387160357775,17.339197547932049,17.895775069147199,18.455120874650554,19.017234615035562,19.582114346613352,20.149756435400118,20.720155459613178,21.293303873947064,21.869192917008611,22.447810900632639,23.029144261496366,23.613177151211016,24.199891338166864,24.789266111015245,25.38127818438679,25.975901607479862,26.573107676183721]
[null,10.4,4.7434378194784221,5.2306603272594758,5.7202813805240531,6.2123149731177998,6.7067751503821773,7.2036757785413306,7.7030305592356898,8.2048529962529884,8.7091563600365838,9.2159536499044243,9.7252575539154069,10.23708040632407,10.751434142569648,11.268330251720705,11.787779726524452,12.309793010535744,12.83437994298087,13.361549700814445,13.891310738186645,14.423670723293769,14.958636472637572,15.496213882734635,16.036407859334545,16.579222244224589,17.124659739719309,17.672721830955307,18.223408706135647,18.776719174893127,19.332650584968821,19.891198737429928,20.452357800680705,21.016120008429588,21.582476485118487,22.151415699003575,22.722924416287348,23.296987333269954,23.873586990200991,24.452703686579895,25.034315398408104,25.618397697923697,26.204923676374747]
[null,10.5,4.6948749619816823,5.176720168786721,5.6608632148785443,6.1473167600364533,6.6360931111542705,7.1272046333470147,7.6206634570615366,8.1164815075316703,8.614670472021059,9.1152417650465196,9.6182064915316356,10.123575407844335,10.631358880676787,11.141566843707118,11.654208752164749,12.169293534884662,12.686829544377455,13.206824504489008,13.729285455829352,14.254218698956713,14.781629735345378,15.311523206179746,15.843902829031808,16.378771332495447,16.916130388868378,17.455980544991217,17.99832115137302,18.543150289753797,19.090464699276769,19.64025970146616,20.192528871301285,20.747265030555681,21.304458466472894,21.864098066066763,22.426170914094762,22.990662216395183,23.557555224112935,24.126831159213548,24.698469141709626,25.272446119046062,25.848736798110853]
[null,10.6,4.6473414654182692,5.1239364290149991,5.6027334986921433,6.0837439204241583,6.5669786208171699,7.0524485368797771,7.5401643752412433,8.0301366325090555,8.5223755650358566,9.0168911569037178,9.5136930860860627,10.012790688751274,10.514192921676457,11.017908322725342,11.523944969490158,12.032310435771075,12.543011746316857,13.056055329492761,13.57144696802458,14.089191747814512,14.609294004859365,15.131757270313368,15.656584213750726,16.183776584696577,16.713335152510087,17.245259644718875,17.779548683920897,18.316199723387502,18.855208981519887,19.396571375330684,19.940280225886539,20.486328151249271,21.034705469256121,21.585401215416478,22.138402783898499,22.693695859928905,{"$f":"[1]!HeCalc($D$9,0,1,AM$11*10^5,2,$B82,1)","v":23.251264353004732},23.811090331255954,24.373153957317729,24.937433426088973,25.503904904770891]
[null,10.7,4.6008036656873372,5.0722707353280807,5.5458487870723001,6.0215477214775586,6.4993773902155487,6.9793472533426275,7.4614667874158869,7.9457451957072998,8.432191440876819,8.9208142154928449,9.4116219109468879,9.9046225847349891,10.399823926082322,10.897233219876645,11.396857308992784,11.898702554752031,12.40277479585747,12.909079305544426,13.417620747070101,13.928403127545154,14.441429750138559,14.956703164697261,15.474225116832967,15.993996495540257,16.516017279422623,17.040286481616572,17.566802093517776,18.095561027428197,18.62655905825876,19.159790764437968,19.69524926455292,{"$f":"[1]!HeCalc($D$9,0,1,AH$11*10^5,2,$B83,1)","v":20.232927017642496},20.772814394436217,21.314900588230199,21.859173294779286,22.405618652567927,22.954221183824824,23.504963736569749,24.05782742799698,24.612791589514575,25.169833713772338]
[null,10.8,4.5552293993132649,5.0216864545465096,5.4901677079505564,5.9606819041355736,6.4332376433143015,6.9078434600507244,7.3845074352450268,7.8632376721679362,8.3440419635655818,8.826927835642822,9.3119025194968685,9.7989729211142347,10.288145589914016,10.77942668581238,11.272821944876172,11.768336643365716,12.265975560441241,12.765742939330581,13.267642447061627,13.771677132767635,14.27784938459672,14.786160885265687,15.296612566307628,15.80920456107285,16.323936156553309,16.84080574411206,17.359810769211037,17.88094768024316,18.404211876587503,18.929597424364999,19.457097979620571,19.986705186957462,20.518409720963625,21.052200940826506,21.588066837006512,22.125993978360533,22.665967459948256,23.2079708517673,23.751986148676526,24.297993721778909,24.84597227154649]
[null,10.9,4.5105879184161619,4.9721485925478843,5.4356507705789463,5.901102144965952,6.3685102592933696,6.8378824881749853,7.3092261227905313,7.7825479539813269,8.2578547953373533,8.7351531195545444,9.2144491111698255,9.6957486390352035,10.179057227515347,10.664380026390919,11.151721779524097,11.641086792130928,12.132478896881718,12.625901418673287,13.121357138159885,13.618848254054591,14.118376344231985,14.619942325670571,15.123546413281266,15.629188077677139,16.136866001948437,16.646578037516672,17.158321159151555,17.672091419245099,18.187883901448149,18.705692467786626,19.225510579126084,19.74732987250442,20.271141085689869,20.79693375070266,21.324696146490385,21.854415252031398,22.386076700065946,22.919664731665776,23.45516215186375,23.992550286575039,24.531808941050297]
[null,11,4.4668498115358117,4.9236237009314037,5.3822602564978643,5.8427662129287761,6.3051481531163285,6.7694124894668484,7.2355654442162862,7.7036131350450185,8.1735611535844477,8.6454151033535087,9.119180224854933,9.594861452780302,10.072463389622754,10.551990278155936,11.033445972826488,11.51683390994002,12.002157076819135,12.489417979813819,12.978618611237433,13.469760415242536,13.962844252666544,14.457870364883643,14.954838336706322,15.453747058387357,15.954594686780688,16.457378605727886,16.962095385745485,17.468740743097211,17.977309269104708,18.487795351708211,19.000191610457453,19.514489927583938,20.030681120701789,20.548754900490891,21.068699828624126,21.590503276100488,22.114151382156255,22.639629013935096,23.166919727106986,23.696005727634041,24.226867834888683]
[null,11.1,4.4239869298349213,4.8760797901447441,5.3299601181934539,5.785633776810724,6.2431064753982284,6.7023837525619969,7.1634709578516338,7.626373232594081,8.0910954898108702,8.5576425053525256,9.0260184570235342,9.4962275351332348,9.9682734104391084,10.44215981960925,10.917889511761111,11.395465248603212,11.874889262688278,12.356163331068487,12.839288745287659,13.324266280458733,13.811096163455341,14.299778040251791,14.790310942451988,15.282693253053761,15.776922671502181,16.272996178091958,16.770909997786582,17.270659563529243,17.772239276576066,18.275643320013067,18.780864276537564,19.287894037967551,19.796723516126018,20.307342605129314,20.81974014391956,21.333903879181417,21.84982042879162,22.367475245957113,22.886852584205119,23.407935463394939,23.930705636927666]
[null,11.2,4.3819723229917784,4.8294862564240351,5.2787158971656316,5.7296663146477815,6.1823424242403604,6.6367489710239429,7.0928905127380739,7.5507714018935514,8.0103957670381245,8.4717674931668956,8.934890124040276,9.3997671594021206,9.8664015576258617,10.334796014718938,10.804952816171253,11.276873967927848,11.750561028964954,12.226015126938599,12.703236930923261,13.182226623360839,13.662983871247359,14.145507796589738,14.629796946170043,15.1158492606601,15.60366204313506,16.093231927040438,16.584554843673253,17.077625989244389,17.572439612988976,18.068989733744942,18.567268921445869,19.0672690977405,19.568981280960823,20.072395552459739,20.577501023190205,21.084285800647457,21.592736956302822,22.102840493663731,22.614581317100647,23.127943201587179,23.642908763504529]
[null,11.3,4.3407801549311218,4.7838137730660835,5.2284945838624672,5.6748269342877622,6.122815017625773,6.5724628583973388,7.0237742965458922,7.476752970878553,7.9314023017549866,8.3877254730179285,8.845725413161226,9.3054047757333027,9.7667659189761853,10.229810884702756,10.694541376417524,11.160958736689077,11.629063923785578,12.098857487587809,12.570339544798088,13.043509753466848,13.518367284433722,13.994910803082375,14.473138430788232,14.953047723604495,15.434635642401624,15.917898524003679,16.402832051920811,16.889431032314821,17.377690179053953,17.867602799294271,18.359161665525914,18.852358746758053,19.347185178288019,19.843631231606661,20.341686284540387,20.841338791735655,21.342576255597493,21.845385197798549,22.349751131480346,22.855658534272852,23.36309082226277]
[null,11.4,4.3003856754260621,4.7390342727760917,5.1792646189203166,5.6210804033738615,6.0644851631094401,6.5094822685451046,6.9560749088756539,7.4042660767408046,7.8540585522245774,8.3054548861820265,8.7584573828910948,9.2130680820292614,9.669288739976766,10.127120810450254,10.586565424473296,{"$f":"[1]!HeCalc($D$9,0,1,R$11*10^5,2,$B90,1)","v":11.047623369692493},11.510295069050988,11.974580558833763,12.440479466102511,12.907990985541041,13.377113855735615,13.847846334918474,14.320186176206473,14.794130602370936,15.269676280178915,15.746819294350514,16.225555121181344,16.705878601883885,17.187783915706206,17.671264552891348,18.15631317270244,18.64292205090236,19.131082314428959,19.620784426992525,20.112018028223808,20.604771907281609,21.09903397687988,21.594791247835687,22.092029804243243,22.590734779383364,23.090890332480786]
[null,11.5,{"$f":"[1]!HeCalc($D$9,0,1,C$11*10^5,2,$B91,1)","v":4.2607651414674246},4.6951208444190184,5.1309957577610286,5.5683929728616022,6.0073154303183331,6.447765906936783,6.88974700212278,7.3332611236835774,7.7783104730341774,8.2248970298066855,8.6730225358620245,9.1226884787050917,9.5738960743063011,10.026646249334348,10.4809396228073,10.936776487171199,11.394156788818009,11.853080108057108,12.313545638557461,12.775552166280287,13.239098047925284,13.704181188916516,14.170799020957483,14.638948479188333,15.108625978981838,15.579827392418457,16.052548024484629,16.526782589042497,17.002525184623153,17.479769270099663,17.958507640300372,18.438732401626822,18.920434947745242,19.403605935424114,19.888235260594957,20.374312034716905,20.861824561529751,21.350760314283622,21.841105913536914,22.332847105617187,22.825968675707163]
[null,11.6,4.2218957706287394,4.6520476814725926,5.0836590150448622,5.5167323186956594,5.9512699912928868,6.3872742711203845,6.8247472232522783,7.2636907264002311,7.7041064592314168,8.1459958861564274,8.5893602425877198,9.0342005196707245,9.4805174484914492,9.9283114837661088,10.377582787020302,10.828331209267146,11.280556273196071,11.734257154886141,12.189432665060218,12.646081229898781,13.104200871434928,13.563789187554773,14.024843331630409,14.487359991815589,14.951335370037441,15.416765160720608,15.883644529283666,16.351968090450903,16.82172988642613,17.292923364978481,17.765541357493809,18.239576057048794,18.715018996568269,19.191861027129825,19.670092296483205,20.149702227855013,20.630679499112976,21.113012022366281,21.596686924082093,22.081690525800422,22.568008325532094]
[null,11.7,4.1837556917624026,4.6097900244216605,5.0372265979697275,5.4660674651675825,5.8963145330010285,6.3279695514321803,6.7610341016827871,7.1955095840473611,7.6313972052351673,8.0686979652413857,8.5074126437489692,8.9475417860641926,9.3890856885903009,9.8320443838452949,10.276417625031602,10.722204870167047,11.169405265788663,11.61801763024261,12.068040436575842,12.51947179504714,12.972309435277682,13.426550688063445,13.88219246687458,14.339231249069172,14.797663056851757,15.257483438009517,15.718687446462029,16.181269622663265,16.64522397389754,17.110543954513922,17.577222446146799,18.045251737973064,18.514623507059525,18.985328798856855,19.457358007899504,19.930700858773534,20.405346387417136,20.88128292282105,21.358498069198475,21.83697868869632,22.316710884721356]
[null,11.8,4.1463238987666102,4.5683241068014837,4.9916718438656256,5.4163687132888372,5.8424161756677009,6.269815538408773,6.6985679448531625,7.1286743629815392,7.5601355736996085,7.9929521587051928,8.4271244879391816,8.862652706623976,9.2995367218942526,9.7377761890263645,10.177370497274229,10.618318755321015,11.060619776357838,11.504272062802174,11.949273790670793,12.395622793623781,12.843316546698381,13.292352149753297,13.742726310646546,14.194435328171918,14.647475074781621,15.101840979124974,15.557528008435419,16.014530650800715,16.472842897353509,16.932458224422106,17.393369575683831,17.855569344365765,18.319049355540251,18.783800848564979,19.249814459719932,19.717080205095613,20.185587463789556,20.655324961469777,21.126280754366171,21.598442213752566,22.071796010983547]
[null,11.9,4.1095802071981407,4.5276271046179497,4.9469691617586138,5.3676075737925855,5.7895433964643823,6.2127775363681534,6.6373107408508654,7.0631435875409414,7.4902764735031795,7.9187096040217684,8.3484429810141911,8.7794763910800828,9.211809393190137,9.6454413060215618,10.080371194947867,10.516597858692117,10.954119815654449,11.392935289925976,11.833042197003033,12.274438129217295,12.717120340899102,13.161085733293183,13.606330839247818,14.052851807700446,14.500644387984744,14.949703913986262,15.400025288175678,15.851602965551063,16.30443093752244,16.758502715774316,17.213811316143811,17.670349242554266,18.128108471046406,18.587080433950948,19.047256004248915,19.508625480167595,19.971178570062168,20.43490437763456,20.899791387543022,21.365827451457129,21.832999774614454]
[null,12,4.0735052135249603,4.487677088896028,4.9030939776070062,5.3197567044118559,5.7376659581440235,6.1568222826752024,6.5772260675391196,6.9988775382208992,7.4217767461134043,7.8459235581428803,8.2713176460671196,8.6979584754504735,9.1258452943209623,9.5549771215160746,9.9853527347248647,10.416970658235229,10.849829150396719,11.283926190810391,11.719259467258812,12.155826362390734,12.593623940176503,13.032648932151909,13.472897723469824,13.914366338780576,14.357050427963872,14.800945251736787,15.246045667164104,15.692346113099171,16.13984059558523,16.588522673249031,17.03838544272044,17.48942152411335,17.941623046605454,18.394981634155553,18.849488391399529,19.30513388976707,19.761908153863327,20.21980064816087,20.678800264048785,21.13889530728704,21.600073485915232]
[null,12.1,4.0380802568298062,4.4484529811288018,4.8600226829381787,5.2727898511126376,5.6867548422438388,6.1019178722509464,6.518279007671417,6.9358381566530767,7.3545950596493865,7.7745492798205627,8.1957001931440665,8.6180469782389455,9.0415886059094284,9.4663238284141915,9.8922511684687926,10.319368907989865,10.747675076590861,11.177167439840293,11.607843487294744,12.039700420320173,12.472735139716429,12.906944233161262,13.342323962491582,13.778870250841134,14.216578669655302,14.655444425605303,15.095462347425498,15.536626872699181,15.978932034619801,16.422371448756046,16.866938299850908,17.312625328686302,17.759424819046444,18.207328584814508,18.656327957238876,19.106413772406121,19.557576358959981,20.009805526105886,20.463090551942649,20.917420172163329,21.372782569168464]
[null,12.2,4.0032873827913935,4.409934511418502,4.8177325866373417,5.2266817929881784,5.6367821865114074,6.0480336869241178,6.4604360695282805,6.8739889568521235,7.2886918100268634,7.7045439199017354,8.1215443979010757,8.5396921666279848,8.9589859502199385,9.3794242644627293,9.8010054066699492,10.223727445336214,10.647588209573549,11.072585278341117,11.498715969479855,11.925977328564601,12.354366117587483,12.783878803487623,13.214511546543353,13.646260188644565,14.079120241463963,14.513086874547424,14.948154903344916,15.384318777204925,15.821572567356446,16.259909954904217,16.699324218864007,17.139808224266204,17.581354410357246,18.0239547789296,18.46760088281242,18.912283814555977,19.357994195344219,19.804722164170819,20.252457367314936,20.701188948154023,21.150905537351466]
[null,12.3,3.9691093097839816,4.3721021791181363,4.776201869660655,5.1814082905458623,5.5877212262395197,5.9951403292589225,6.4036651126527318,6.8132949422423357,7.2240290286272861,7.6358664189578187,8.0488059884784082,8.462846431846808,8.8779862542340204,9.2942237622112334,9.7115570544308483,10.129984012109297,10.549502289320607,10.970109303110304,11.391802223440456,11.814577962977483,12.238433166735597,12.663364201589607,13.089367145672025,13.5164377776705,13.944571566042747,14.373763658167256,14.804008869449213,15.235301672402286,15.667636185728034,16.101006163415871,16.53540498388768,16.9708256392123,17.407260724416204,17.84470242691771,18.28314251611334,18.722572333145536,19.162982780882341,19.604364314140128,20.046706930181475,20.490000159521081,20.934233057073001]
[null,12.4,3.9355293969488487,4.3349372157980302,4.7354095424638762,5.1369460371407492,5.53954623922212,5.9432095605248465,6.3479352782983067,6.7537225280204014,7.1605702959831241,7.5684774116708757,7.9774425399354527,8.3874641729721962,8.7985406221025517,9.2106700093689806,9.6238502589489361,10.038079088395351,10.45335399971197,10.869672270272611,11.287030943594392,11.705426819975733,12.124856447011007,12.545316109994486,12.966801822227277,13.389309315241929,13.812834028960262,14.2373711018011,14.66291536075547,15.089461311447931,15.517003128203596,15.945534644141519,16.375049341316011,16.805540340928424,17.237000393633,17.669421869961099,18.102796750889205,18.537116618576825,18.97237264730126,19.408555594616836,19.845655792767076,20.283663140378707,20.722567094466978]
[null,12.5,3.9025316141028279,4.2984215503757008,4.6953354049548972,5.0932726133302655,5.4922324940680385,5.892214242502857,6.2932169242370755,6.6952394684495999,7.0982806610169806,7.5023391374500745,7.907413375650127,8.3135016884887705,8.7206022162169532,9.1287129187085814,9.5378315675452807,9.9479557379492558,10.359082800572226,10.771209913148827,11.184334012023875,11.598451803563554,12.013559755461415,12.429654087950878,12.846730764936828,13.264785485059603,13.683813672705652,14.103810468980017,14.524770722656449,14.946688981122142,15.369559481334695,15.793376140809839,16.218132548659348,16.643821956699341,17.070437270650025,17.497971041448601,17.926415456697988,18.355762332274601,18.786003104119072,19.217128820234532,19.649130132917534,20.081997291247291,20.515720133859215]
[null,12.6,3.8701005133596911,4.2625377762604755,4.6559600087941195,5.0503664439432301,5.4457562016312595,5.8421282828485088,6.2394815636055077,6.6378147887161045,7.0371265654130957,7.4374153567996926,7.8386794751406397,8.2409170749973555,8.6441261462119972,9.0483045067459233,9.4534497953786651,9.8595594642740707,10.266630771420992,10.674660772956498,11.083646315380236,11.49358402766935,11.904470313303989,12.316301342214125,12.729073042659271,13.142781093053225,13.557420913746901,13.972987658782923,14.389476207636454,14.806881156957513,15.225196812330708,15.644417180069125,16.064535959059739,16.485546532678558,16.90744196079428,17.330214971879926,17.753857955252695,18.178362953462582,18.60372165485127,19.029925386302921,19.456965106209314,19.884831397671931,20.313514461964086]
[null,12.7,3.8382212023497568,4.2272691203759027,4.6172646218806452,5.0082067576731362,5.4000944693363317,5.7929265837557189,6.1867018074933853,6.5814187210098574,6.9770757727365353,7.3736712730020217,7.7712033878160653,8.16967013251538,8.5690693652760341,8.9693987804976434,9.3706559020651721,9.7728380764946241,10.175942465969507,10.579966041275583,10.984905574641861,11.390757632496602,11.797518568147543,12.20518451439626,12.613751376097211,13.023214822672672,13.43357028059536,13.844812925851221,14.256937676395573,14.669939184616309,15.083811829818636,15.498549710746381,15.914146638155556,16.330596127456438,16.747891391441133,17.166025333113915,17.584990538642472,18.004779270448502,18.425383460456615,18.846794703520946,19.269004251049392,19.692003004845475,20.115781511188423]
[null,12.8,3.8068793189319772,4.192599413933773,4.5792311948751996,4.9667735490210063,5.3552252581957491,5.7445849936862912,6.1348513110057308,6.5260226445212366,6.9180973019485981,7.3110734587167414,7.7049491522058418,8.0997222758631153,8.4953905732008348,8.8919516316815006,9.2894028764957106,9.6877415642385731,10.0869647764912,10.487069413314183,10.888052186660561,11.289909613716281,11.692638010176744,12.096233483468492,12.50069192592577,12.906009007932136,13.312180171037964,13.719200621065132,14.127065321210921,14.535768985163477,14.945306070242035,15.355670770575324,15.766857010332417,16.17885843702058,16.591668414865328,17.005280018288268,17.419686025498866,17.834878912216642,18.250850845540764,18.667593677984264,19.085098941690553,19.503357842850246,19.922361256336234]
[null,12.9,3.7760610073007377,4.1585130648433042,4.5418423296223391,4.9260475424269385,5.3111273423323633,5.697080261949492,6.0839047225501428,6.4715990290707035,6.8601613649968938,7.2495897871327717,7.6398822202575785,8.0310364516742787,8.423050125654175,8.8159207377822622,9.2096456292085556,9.6042219808108946,9.9996468072753171,10.39591695110046,10.793029076532944,11.190979663441162,11.589765001135355,11.989381182142393,12.389824095944082,12.791089422688385,13.19317262688342,13.59606895108455,13.999773409585421,14.404280782124259,14.809585607617246,15.215682177931214,15.622564531708427,16.030226448256609,16.438661441517841,16.847862754130343,17.257823351597601,17.66853591657955,18.079992843321037,18.492186232232918,18.905107884641534,19.318749297722572,19.733101659635359]
[null,13,3.7457528953970005,4.1249950316478712,4.5050812493451708,4.886010158442236,5.267780270834967,5.6503899959334225,6.0338376361222155,6.4181213821121128,6.8032393081856029,7.1891893673395,7.5759693863279702,7.9635770606097669,8.3520099492037723,8.7412654694572947,9.1313408917320551,{"$f":"[1]!HeCalc($D$9,0,1,R$11*10^5,2,$B106,1)","v":9.5222333340129968},9.9139397564456821,10.306456955808176,10.699781559923998,11.09391002202293,11.488838615056951,11.884563425979081,12.281080349993218,12.678385084783526,13.076473124732427,13.475339755136563,13.874980046430622,14.275388848429275,14.676560784597925,15.078490246363378,15.481171387475895,15.884598118434525,16.288764100987997,16.693662742723674,17.099287191757654,17.50563033153907,17.912684775782395,18.320442863541221,18.728896654437783,19.138037924062413,19.547858159557187]
[null,13.1,{"$f":"[1]!HeCalc($D$9,0,1,C$11*10^5,2,$B107,1)","v":3.7159420735401207},4.0920307988899056,4.4689317704955656,4.8466434818054474,5.2251643317886556,5.6044926208058135,5.9846265463802029,6.365564198871672,6.7473035570559654,7.1298424836124701,7.513178720523638,7.8973098843896761,8.2822334616624005,8.6679468038024847,9.0544471223647012,9.441731484016012,9.8297968054918563,10.21863984849614,10.60825721455104,10.998645339802875,11.389800489790806,11.781718754185423,12.174396041504771,12.567828073815532,12.962010381427717,13.356938297591343,13.752606953204156,14.149011271539671,14.546145963005223,14.944005519940116,15.342584211464196,15.741876078387589,16.141874928192664,16.54257433009948,16.943967610226412,17.346047846857783,17.748807865830674,18.152240236053217,18.556337265166903,18.961090995365637,19.366493199384401]
[null,13.2,3.6866160742028442,4.059606353811934,4.4333782761516698,4.8079302312962184,5.1832605183339879,5.5593673415162943,5.9362488063167689,6.3139029154038848,6.6923275645291467,7.0715205383338473,7.4514795060775114,7.8322020172914195,8.2136854973609559,8.5959272430407161,8.9789244179067307,9.3626740477503407,9.7471730159187064,10.13241805860711,10.518405760108635,10.905132548027115,11.292594688459484,11.680788281154124,12.069709254652027,12.459353361417971,12.849716172969213,13.240793075009563,13.632579262576957,14.025069735213066,14.41825929216367,14.812142527618962,15.206713826003101,15.601967357322737,15.997897072584458,16.394496699291292,16.791759737028819,17.189679453151484,{"$f":"[1]!HeCalc($D$9,0,1,AM$11*10^5,2,$B108,1)","v":17.588248878579989},17.987460803720893,18.387307774519513,18.78778208865765,19.188875791907403]
[null,13.3,3.657762852857644,4.0277081643085717,4.3984056908627114,4.7698537312504445,5.1420504966201985,5.5149941069453057,5.888682587350921,6.2631138643632891,6.6382857620838749,7.014195998291088,7.3908421804725979,7.7682218017914888,8.1463322369897533,8.525170738232859,8.9047344308994898,9.2850203093206627,9.6660252324728884,10.047745919630191,10.430178945980149,10.813320738209361,11.197167570064101,11.581715557892108,11.966960656171862,12.352898653035897,12.739525165795047,13.126835636470737,13.514825327342834,13.903489316520671,14.292822493545314,14.682819555031264,15.073475000356124,{"$f":"[1]!HeCalc($D$9,0,1,AH$11*10^5,2,$B109,1)","v":15.464783127406941},15.856738028392275,16.24933358572904,16.64256346801373,17.03642112608744,17.430899789204535,17.825992461314911,18.221691917469769,18.617990700361293,19.014881117006212]
[null,13.4,3.6293707698277338,3.9963231580505423,4.3639994568484752,4.7323978846289982,5.1015165755280547,5.471353576056857,5.8419068416771101,6.2131742333068667,6.5851535137594475,6.9578423441180028,7.3312382800486446,7.7053387680551362,8.0801411416785154,8.4556426176451556,8.8318402919670476,9.2087311359983204,9.5863119924523037,9.9645795713835845,10.343530446139884,10.723161049288766,11.103467668524404,11.484446442559996,11.866093357011584,12.24840424027931,12.63137475943241,13.01500041610446,13.399276542405682,13.784198296859307,14.169760660369265,14.555958432226658,14.94278622616277,15.330238466456448,15.718309384104044,16.106993013060134,16.496283186557591,16.886173533515528,17.276657475043987,17.667728221054272,18.059378766983816,18.451601890644945,18.844390149206436]
[null,13.5,3.6014285730808551,3.9654387027074667,4.330145511467653,4.6955471475403208,5.0616416780472955,5.42842708592317,5.7959012667210601,6.1640620253564355,6.5329070727913265,6.9024340226614038,7.2726403878486563,7.6435235770025756,8.0150808910129534,8.3873095194376273,8.7602065368887256,9.1337688993811241,9.5079934406471676,9.8828768684217625,10.258415760702352,10.634606561988306,11.011445579504734,11.388928979415661,11.767052783031991,12.145812863019755,12.525204939614378,12.90522457684699,13.2858671787889,13.6671279858207,14.049002070932529,14.431484336062328,14.814569508479074,15.198252137218139,15.5825265895761,15.967387047672524,16.352827505086349,16.738841763574658,17.125423429881746,17.512565912646458,17.900262419415952,18.288505953774031,18.677289312592269]
[null,13.6,3.573925381908329,3.9350425872014867,4.2968302658755464,4.6592865051245393,5.0224093142022355,5.3861966214993622,5.7506462715634878,6.1157560220636258,6.4815235407017626,6.8479464020737009,7.2150220844817969,7.5827479667023399,7.951121324710491,8.3201393283659293,8.6897990380625334,9.0600974013455406,9.4310312494999646,9.802597294114122,10.17479212362238,10.547612199831395,10.921053854434385,11.295113285518061,11.669786554067144,12.045069580471543,12.420958141041426,12.797447864535719,13.174534228709604,13.552212556886879,13.930478014563215,14.309325606046404,14.688750171140017,15.068746381876904,15.449308739309259,15.830431570361867,16.212109024755659,16.594335072008366,16.977103498519597,17.360407904747376,17.744241702483524,18.128598112235252,18.513470160720253]
[null,13.7,3.5468506714358843,3.9051230039285709,4.2640405847972627,4.6236014487135266,4.9838035554269728,5.3446447870353468,5.7061229452033535,6.068235748332131,6.4309808286815473,6.7943557294475339,7.1583579017969354,7.5229847018624367,7.888233387700371,8.254101116214283,8.6205849400474328,8.9876818044473978,9.35538854410634,9.7237018799804709,10.092618416092565,10.462134636321421,10.832246901182547,11.202951444604196,11.574244370703454,11.946121650566866,12.318579119040532,12.691612471534663,13.065217260847684,13.439388894015291,13.814122629189885,14.189413572555967,14.565256675287342,14.941646730551922,15.318578370570208,15.696046063733563,16.074044111788524,16.452566647093452,16.831607629954028,17.211160846044002,17.591219903917789,17.971778232621553,18.352829079409315]
[null,13.8,3.5201942579164758,3.8756685318887989,4.2317637673478927,4.5884779541874572,4.9458090102988326,5.3037547790205322,5.6623130265419164,6.0214814392629057,6.3812576211117165,6.7416390908227859,7.1026232791772168,7.4642075262081393,7.8263890783736514,8.1891650856999956,8.5525325988980079,8.9164885664557136,9.2810298317104643,9.6461531299038352,10.011855085222855,10.378132207831289,10.744980890894668,11.112397407603211,11.480377908196616,11.848918416995126,12.218014829441204,12.587662909156471,12.95785828501853,13.328596448262628,13.699872749613078,14.071682396449544,14.444020450013483,14.816881822660017,15.190261275160786,15.564153414063183,15.938552689111818,16.31345339073777,16.688849647621513,17.064735424335364,17.441104519071331,17.817950561460336,18.195267010488827]
[null,13.9,3.4939462847587457,3.8466681206710422,4.1999875288359307,4.5539024614541601,4.9084108015453607,5.2635103605645668,5.6191988759777454,5.9754740087981482,6.3323333410853948,6.6897743734093256,7.0477945222808183,7.4063911175518502,7.7655613997872708,8.1253025176108356,8.4856115250282489,8.8464853787299997,9.2079209353770519,9.5699149488724515,9.932464067622135,10.295564831788337,10.659213670539117,11.023406899297692,11.388140716995355,11.753411203331916,12.119214316047756,12.48554588821165,12.852401625528669,13.219777103672639,13.587667765647641,13.956068919183242,14.324975734168246,14.694383240127753,15.064286323748533,15.434679726457752,15.805558042060142,16.176915714438771,16.548747035324766,16.921046142141126,17.293807015926077,17.667023479341271,18.040689194770248]
[null,14,3.4680972092479205,3.8181110752411742,4.1686999834906961,4.5198618549827367,4.871594544246161,5.2238958371243998,5.5767634485107926,5.9301950200490285,6.2841881178005519,6.6387402298808107,6.9938487640664349,7.3495110453755164,7.7057243136232607,8.0624857209554381,8.4197923293621777,8.7776411081747128,9.1360289315479193,9.4949525759315048,9.8544087175328468,10.214393929774703,10.574904680750965,10.935937330683899,11.297488129386347,11.659553213732496,12.022128605140976,12.385210207074097,12.748793802557167,13.11287505172198,13.477449489378568,13.84251252261952,14.208059428461157,14.574085351526005,14.940585301771071,15.307554152266457,15.674986637029015,16.042877348915653,16.4112207375811,16.780011107504894,17.14924261609238,17.518909271854628,17.889004932671988]
[null,14.1,3.4426377899188565,3.7899870414864703,4.1378896280585877,4.4863434453277531,4.8353463251565687,5.1848960334943666,5.5349902682611809,5.8856266572007261,6.2368027557040406,6.5885160446056696,6.9407639279543094,7.2935437307599331,7.6468526967196073,8.0006879859241664,8.3550466725482231,8.7099257425258596,9.0653220912147141,9.4212325210510528,9.77765373919868,10.134582355194576,10.49201487859429,10.849947716620184,11.20837717181576,11.567299439709426,11.926710606491074,12.286606646704993,12.646983420962805,13.007836673680016,13.36916203084006,13.730954997789686,14.093210957069596,14.455925166284423,14.819092756016101,15.182708727784778,15.546767952061483,15.911265166336831,16.276194973249993,16.641551838782341,17.007330090520053,17.373523915990084,17.740127361073867]
[null,14.2,3.4175590745436337,3.7622859924720355,4.107545326216826,4.453334951584722,4.7996526830851964,5.1464962719819107,5.4938634043150252,5.8417516988959299,6.1901587052760476,6.5390819016914108,6.8885186929848574,7.2384664085077652,7.588922300003321,7.939883539473457,8.2913472170316727,8.6433103387439925,8.9957698244605435,9.3487225056401915,9.7021651231708521,10.056094325188177,10.410506664895367,10.765398598387042,11.120766482480082,11.476606572554527,11.832915020407684,12.189687872124658,12.546921065968608,12.90461043029415,13.26275168148735,13.621340421935821,13.980372138032587,14.339842198217326,14.69974585105872,15.06007822338171,15.420834318443463,15.782009014161895,16.143597061400691,16.505593082314679,16.867991568759511,17.230786880769681,17.593973245108707]
[null,14.3,3.3928523886985937,3.7349982153680523,4.0776562937567764,4.4208244847216775,4.7645005902621538,5.1086823516970972,5.4533674478159337,5.7985534930052083,6.1442380353522363,6.4904185547274569,6.8370924608471961,7.1842570913186838,7.5319097096691552,7.8800475033610571,8.2286675817954151,8.5777669743054759,8.9273426281429167,9.2773914064588947,9.6279100862823697,9.9788953564981888,10.330343815827471,10.68225197081302,11.034616233812425,11.387432921001711,11.740698250392402,12.094408339865002,12.44855920522186,12.803146758262603,13.158166804885244,13.513615043216223,13.869487061772674,14.22577833766022,14.582484234809769,14.939600002256613,15.297120772465451,15.655041559704721,16.013357258473849,16.372062641986922,16.731152360716361,17.090620941000228,17.450462783716606]
[null,14.4,3.3685093248780138,3.7081142990094036,4.0482120844922207,4.3888005317353924,4.7298774346391328,5.071440528888945,5.4134874902265491,5.7560159326991016,6.0990234068881888,6.442507398120136,6.7864653246592201,7.1308945358855178,7.475792310459128,7.8211558544726323,8.1669822995937338,8.5132687012000154,8.8600120365080013,9.2072092026985501,9.5548570150409518,9.9029522050178791,10.251491418453739,10.600471213648703,10.949888059521115,11.299738333760706,11.650018320995395,12.000724210974315,12.351852096769928,12.703397973001969,13.055357734086259,13.407727172511162,13.760501977144887,14.113677731576498,14.46724991249388,14.821213888101633,15.175564916582207,15.530298144603341,15.885408605875089,16.240891219759607,16.596740789936952,16.952952003130179,17.309519427892869]
[null,14.5,3.3445217321237308,3.6816251220517455,4.0192025768508648,4.3572519405842778,4.6957710030664819,5.0347574982663668,5.3742091026897709,5.7141234337428513,6.0544980480776083,6.3953304399210671,6.7366180393895903,7.078358210789947,7.4205482509087703,7.7631853872921361,8.1062667765170993,8.4497895024569623,8.7937505745423312,9.1381469260198482,9.4829754122107683,9.8282328087714017,10.173915809957768,10.520021026896586,10.866544985865016,11.213484126581497,11.560834800510149,11.908593269181241,12.256755702530228,12.605318177258075,12.95427667521539,13.303627081813186,13.653365184462928,14.0034866710487,14.353987128434309,14.704862041008102,15.05610678926851,15.407716648453054,15.759686787213868,16.112012266342589,16.464688037547525,16.81770894228616,17.171069710655761]
[null,14.6,3.3208817061420364,3.6555218416904349,3.9906179611101904,4.3261679058531932,4.6621694652962047,4.9986203752456424,5.3355183164241469,5.6728609129401883,6.010645730742004,6.3488702760572586,6.6875319938198112,7.026628266085134,7.3661564104358925,7.7061136783793307,8.0464972537381279,{"$f":"[1]!HeCalc($D$9,0,1,R$11*10^5,2,$B122,1)","v":8.3873042510364417},8.7285317138830063,9.0701766133530572,9.4122358463710825,9.7547062340962967,10.097584520312965,10.440867369827604,10.784551366875208,11.128633013536747,11.473108728170114,11.817974843856925,12.163227606867398,12.508863175145798,12.854877616818825,13.201266908729473,13.548026934998783,13.895153485618131,14.24264225507458,14.590488841011826,14.9386887429295,15.287237360923347,15.63612999446897,15.985361841251827,16.334927996046073,16.684823449645016,17.03504308784574]
[null,14.7,{"$f":"[1]!HeCalc($D$9,0,1,C$11*10^5,2,$B123,1)","v":3.2975815798809589},3.6297958829109191,3.9624487272412385,4.2955379551083803,4.6290613587631659,4.9630166790704209,5.2974016040924736,5.6322137676576913,5.9674507479152972,6.3031100658777275,6.6391891839519017,6.9756855044607784,7.3125963681566768,7.6499190527278413,7.9876507712998626,8.3257886709335125,8.6643298311207193,9.003271262280407,9.3426099042559283,9.6823426248160001,10.022466218160965,10.362977403436336,10.703872823255619,11.045149042234387,11.386802545537771,11.728829737443379,12.071226939921878,12.413990391237407,12.75711624457003,13.100600566662525,13.444439336493826,13.788628443981363,14.133163688714736,14.478040778723031,14.82325532927822,15.168802861736987,15.514678802423459,15.860878481555211,16.207397132214979,16.554229889370522,16.901371788945031]
[null,14.8,3.2746139145427757,3.6044389282411684,3.9346856533263321,4.2653519359034586,4.5964355740999787,4.9279343167537046,5.2598458620866948,5.5921678563659487,5.9248978925521092,6.2580335089373573,6.5915721877737852,6.9255113538935511,7.2598483733221597,7.5945805518863194,7.9297051338178024,8.2652193003548113,8.6011201683424634,8.9374047888339252,9.2740701456939192,9.6111131542062509,9.9485306596871173,10.286319436105988,10.624476184715904,10.962997532695017,11.301880031801307,11.641120157042472,11.980714305362863,12.32065879434958,12.660949860959745,13.001583660271004,13.342556264257389,13.68386366059266,14.025501751483274,14.367466352533128,14.709753191642294,15.052357907941905,15.395276050767396,15.738503078672322,16.082034358484911,16.425865164409625,16.769990677175837]
[null,14.9,3.2519714910081685,3.5794429079786423,3.907319794518882,4.2356000033999663,4.564281341343988,4.8933615677947877,5.2228383936760849,5.5527094801380477,5.8829724372934136,6.2136248229442756,6.5446641413007471,6.8760878416926987,7.207893317275893,7.5400779037337724,7.8726388779763301,8.2055734568373992,8.538878795771895,8.8725519875544148,9.2065900609807976,9.540989979574185,9.8757486402971946,10.210862872271887,10.546329435509181,10.882145019649473,11.21830624271619,11.554809649884119,11.891651712264258,12.228828825707131,12.56633730962638,12.904173405844563,13.242333277463088,13.580813007758223,13.919608599105159,14.258715971932054,14.598130963706163,14.937849327953883,15.277866733316905,15.618178762646322,15.95878091213679,16.299668590502726,16.640837118198501]
[null,15,3.2296473016498859,3.5547999908659738,3.8803424725154816,4.2062726085682822,4.5325882167974552,4.8592870696271238,5.1863668929691915,5.5138253650499589,5.8416601152276666,6.1698687228020219,6.4984487158168394,6.8273975698569265,7.1567127068404188,7.4863914938077931,7.8164312417088588,8.1468292041889665,8.4775825763758785,8.8086884936686012,9.1401440305296884,9.4719461992823799,9.804091948914154,10.136578163888176,10.469401662964232,10.802559198030721,11.136047452949311,11.469863042413989,11.804002510826063,12.138462331186956,12.473238904010373,12.808328556255731,13.143727540284511,13.479432032841371,13.815438134061797,14.151741866508106,14.48833917423563,14.825225921890885,15.16239789384359,15.499850793354303,15.837580241779584,16.175581777816419,16.513850856787808]

{"sheet":"Saturation","index":3,"n_rows":49,"n_cols":6,"rows_kept":49,"cut":false,"hidden":false,"merged":[]}
[]
[null,"Fluid","Helium",{"$f":"VLOOKUP(C2,Fluids_table,2,FALSE)","v":11}]
[null,"Pressure step",0.05]
[null,"Critical pressure",{"$f":"IF($D$2=11,[1]!HeConst(5)/10^5,FConstant($D$2,5)/10^2)","v":2.2746230000000001}]
[null,"Max scale",{"$f":"MIN(B49,C4)","v":2.2746230000000001}]
[]
[]
[null,"Saturated pressure","Saturated temperature","Liquid density","Gas density","Latent Heat"]
[null,1,{"$f":"IF($D$2=11,[1]!HeCalc(2,0,1,$B9*10^5,43,0,1),FluidProperties($D$2,1,$B9*10^5,10,0,2,2,1))","v":4.2081365347309596},{"$f":"IF($D$2=11,[1]!HeCalc(3,0,1,$B9*10^5,43,0,1),FluidProperties($D$2,1,$B9*10^5,10,0,3,1,1))","v":125.21672394588089},{"$f":"IF($D$2=11,[1]!HeCalc(3,0,1,$B9*10^5,44,0,1),FluidProperties($D$2,1,$B9*10^5,10,0,3,2,1))","v":16.61735982803901},{"$f":"IF($D$2=11,[1]!HeCalc(7,0,1,$B9*10^5,43,0,1),FluidProperties($D$2,1,$B9*10^5,10,0,29,1,1))/1000","v":20.745447371591684}]
[null,{"$f":"B9+$C$3","v":1.05},{"$f":"IF($D$2=11,[1]!HeCalc(2,0,1,$B10*10^5,43,0,1),FluidProperties($D$2,1,$B10*10^5,10,0,2,2,1))","v":4.2601943560059805},{"$f":"IF($D$2=11,[1]!HeCalc(3,0,1,$B10*10^5,43,0,1),FluidProperties($D$2,1,$B10*10^5,10,0,3,1,1))","v":124.19913990818411},{"$f":"IF($D$2=11,[1]!HeCalc(3,0,1,$B10*10^5,44,0,1),FluidProperties($D$2,1,$B10*10^5,10,0,3,2,1))","v":17.479174519230952},{"$f":"IF($D$2=11,[1]!HeCalc(7,0,1,$B10*10^5,43,0,1),FluidProperties($D$2,1,$B10*10^5,10,0,29,1,1))/1000","v":20.450505434327326}]
[null,{"$f":"B10+$C$3","v":1.1000000000000001},{"$f":"IF($D$2=11,[1]!HeCalc(2,0,1,$B11*10^5,43,0,1),FluidProperties($D$2,1,$B11*10^5,10,0,2,2,1))","v":4.3105866099547026},{"$f":"IF($D$2=11,[1]!HeCalc(3,0,1,$B11*10^5,43,0,1),FluidProperties($D$2,1,$B11*10^5,10,0,3,1,1))","v":123.1748119111285},{"$f":"IF($D$2=11,[1]!HeCalc(3,0,1,$B11*10^5,44,0,1),FluidProperties($D$2,1,$B11*10^5,10,0,3,2,1))","v":18.357305269386359},{"$f":"IF($D$2=11,[1]!HeCalc(7,0,1,$B11*10^5,43,0,1),FluidProperties($D$2,1,$B11*10^5,10,0,29,1,1))/1000","v":20.142838560667624}]
[null,1.1500000000000001,{"$f":"IF($D$2=11,[1]!HeCalc(2,0,1,$B12*10^5,43,0,1),FluidProperties($D$2,1,$B12*10^5,10,0,2,2,1))","v":4.3594336631277217},{"$f":"IF($D$2=11,[1]!HeCalc(3,0,1,$B12*10^5,43,0,1),FluidProperties($D$2,1,$B12*10^5,10,0,3,1,1))","v":122.14186182205474},{"$f":"IF($D$2=11,[1]!HeCalc(3,0,1,$B12*10^5,44,0,1),FluidProperties($D$2,1,$B12*10^5,10,0,3,2,1))","v":19.253565978406225},{"$f":"IF($D$2=11,[1]!HeCalc(7,0,1,$B12*10^5,43,0,1),FluidProperties($D$2,1,$B12*10^5,10,0,29,1,1))/1000","v":19.821903466896075}]
[null,1.2000000000000002,{"$f":"IF($D$2=11,[1]!HeCalc(2,0,1,$B13*10^5,43,0,1),FluidProperties($D$2,1,$B13*10^5,10,0,2,2,1))","v":4.4068423378834014},{"$f":"IF($D$2=11,[1]!HeCalc(3,0,1,$B13*10^5,43,0,1),FluidProperties($D$2,1,$B13*10^5,10,0,3,1,1))","v":121.09831707235071},{"$f":"IF($D$2=11,[1]!HeCalc(3,0,1,$B13*10^5,44,0,1),FluidProperties($D$2,1,$B13*10^5,10,0,3,2,1))","v":20.169953917551393},{"$f":"IF($D$2=11,[1]!HeCalc(7,0,1,$B13*10^5,43,0,1),FluidProperties($D$2,1,$B13*10^5,10,0,29,1,1))/1000","v":19.486994406711368}]
[null,1.2500000000000002,{"$f":"IF($D$2=11,[1]!HeCalc(2,0,1,$B14*10^5,43,0,1),FluidProperties($D$2,1,$B14*10^5,10,0,2,2,1))","v":4.4529080913970933},{"$f":"IF($D$2=11,[1]!HeCalc(3,0,1,$B14*10^5,43,0,1),FluidProperties($D$2,1,$B14*10^5,10,0,3,1,1))","v":120.04207152595436},{"$f":"IF($D$2=11,[1]!HeCalc(3,0,1,$B14*10^5,44,0,1),FluidProperties($D$2,1,$B14*10^5,10,0,3,2,1))","v":21.108687952581249},{"$f":"IF($D$2=11,[1]!HeCalc(7,0,1,$B14*10^5,43,0,1),FluidProperties($D$2,1,$B14*10^5,10,0,29,1,1))/1000","v":19.137260822931655}]
[null,1.3000000000000003,{"$f":"IF($D$2=11,[1]!HeCalc(2,0,1,$B15*10^5,43,0,1),FluidProperties($D$2,1,$B15*10^5,10,0,2,2,1))","v":4.4977168145467648},{"$f":"IF($D$2=11,[1]!HeCalc(3,0,1,$B15*10^5,43,0,1),FluidProperties($D$2,1,$B15*10^5,10,0,3,1,1))","v":118.97084068797545},{"$f":"IF($D$2=11,[1]!HeCalc(3,0,1,$B15*10^5,44,0,1),FluidProperties($D$2,1,$B15*10^5,10,0,3,2,1))","v":22.072256729213432},{"$f":"IF($D$2=11,[1]!HeCalc(7,0,1,$B15*10^5,43,0,1),FluidProperties($D$2,1,$B15*10^5,10,0,29,1,1))/1000","v":18.771719423356075}]
[null,1.3500000000000003,{"$f":"IF($D$2=11,[1]!HeCalc(2,0,1,$B16*10^5,43,0,1),FluidProperties($D$2,1,$B16*10^5,10,0,2,2,1))","v":4.5413461507962349},{"$f":"IF($D$2=11,[1]!HeCalc(3,0,1,$B16*10^5,43,0,1),FluidProperties($D$2,1,$B16*10^5,10,0,3,1,1))","v":117.88211371765884},{"$f":"IF($D$2=11,[1]!HeCalc(3,0,1,$B16*10^5,44,0,1),FluidProperties($D$2,1,$B16*10^5,10,0,3,2,1))","v":23.063475945799979},{"$f":"IF($D$2=11,[1]!HeCalc(7,0,1,$B16*10^5,43,0,1),FluidProperties($D$2,1,$B16*10^5,10,0,29,1,1))/1000","v":18.389260724468155}]
[null,1.4000000000000004,{"$f":"IF($D$2=11,[1]!HeCalc(2,0,1,$B17*10^5,43,0,1),FluidProperties($D$2,1,$B17*10^5,10,0,2,2,1))","v":4.5838666481855981},{"$f":"IF($D$2=11,[1]!HeCalc(3,0,1,$B17*10^5,43,0,1),FluidProperties($D$2,1,$B17*10^5,10,0,3,1,1))","v":116.77309421680418},{"$f":"IF($D$2=11,[1]!HeCalc(3,0,1,$B17*10^5,44,0,1),FluidProperties($D$2,1,$B17*10^5,10,0,3,2,1))","v":24.085563785867986},{"$f":"IF($D$2=11,[1]!HeCalc(7,0,1,$B17*10^5,43,0,1),FluidProperties($D$2,1,$B17*10^5,10,0,29,1,1))/1000","v":17.988646610463736}]
[null,1.4500000000000004,{"$f":"IF($D$2=11,[1]!HeCalc(2,0,1,$B18*10^5,43,0,1),FluidProperties($D$2,1,$B18*10^5,10,0,2,2,1))","v":4.6253426314810531},{"$f":"IF($D$2=11,[1]!HeCalc(3,0,1,$B18*10^5,43,0,1),FluidProperties($D$2,1,$B18*10^5,10,0,3,1,1))","v":115.64063026642005},{"$f":"IF($D$2=11,[1]!HeCalc(3,0,1,$B18*10^5,44,0,1),FluidProperties($D$2,1,$B18*10^5,10,0,3,2,1))","v":25.142237028211323},{"$f":"IF($D$2=11,[1]!HeCalc(7,0,1,$B18*10^5,43,0,1),FluidProperties($D$2,1,$B18*10^5,10,0,29,1,1))/1000","v":17.568498092960816}]
[null,1.5000000000000004,{"$f":"IF($D$2=11,[1]!HeCalc(2,0,1,$B19*10^5,43,0,1),FluidProperties($D$2,1,$B19*10^5,10,0,2,2,1))","v":4.6658328965490226},{"$f":"IF($D$2=11,[1]!HeCalc(3,0,1,$B19*10^5,43,0,1),FluidProperties($D$2,1,$B19*10^5,10,0,3,1,1))","v":114.48112787794098},{"$f":"IF($D$2=11,[1]!HeCalc(3,0,1,$B19*10^5,44,0,1),FluidProperties($D$2,1,$B19*10^5,10,0,3,2,1))","v":26.237837470479821},{"$f":"IF($D$2=11,[1]!HeCalc(7,0,1,$B19*10^5,43,0,1),FluidProperties($D$2,1,$B19*10^5,10,0,29,1,1))/1000","v":17.127270059198153}]
[null,1.5500000000000005,{"$f":"IF($D$2=11,[1]!HeCalc(2,0,1,$B20*10^5,43,0,1),FluidProperties($D$2,1,$B20*10^5,10,0,2,2,1))","v":4.7053912498476542},{"$f":"IF($D$2=11,[1]!HeCalc(3,0,1,$B20*10^5,43,0,1),FluidProperties($D$2,1,$B20*10^5,10,0,3,1,1))","v":113.29044185448043},{"$f":"IF($D$2=11,[1]!HeCalc(3,0,1,$B20*10^5,44,0,1),FluidProperties($D$2,1,$B20*10^5,10,0,3,2,1))","v":27.377500955615794},{"$f":"IF($D$2=11,[1]!HeCalc(7,0,1,$B20*10^5,43,0,1),FluidProperties($D$2,1,$B20*10^5,10,0,29,1,1))/1000","v":16.663209118482829}]
[null,1.6000000000000005,{"$f":"IF($D$2=11,[1]!HeCalc(2,0,1,$B21*10^5,43,0,1),FluidProperties($D$2,1,$B21*10^5,10,0,2,2,1))","v":4.744066917234445},{"$f":"IF($D$2=11,[1]!HeCalc(3,0,1,$B21*10^5,43,0,1),FluidProperties($D$2,1,$B21*10^5,10,0,3,1,1))","v":112.06373523738483},{"$f":"IF($D$2=11,[1]!HeCalc(3,0,1,$B21*10^5,44,0,1),FluidProperties($D$2,1,$B21*10^5,10,0,3,2,1))","v":28.567387934770245},{"$f":"IF($D$2=11,[1]!HeCalc(7,0,1,$B21*10^5,43,0,1),FluidProperties($D$2,1,$B21*10^5,10,0,29,1,1))/1000","v":16.17428865220954}]
[null,1.6500000000000006,{"$f":"IF($D$2=11,[1]!HeCalc(2,0,1,$B22*10^5,43,0,1),FluidProperties($D$2,1,$B22*10^5,10,0,2,2,1))","v":4.7819048400151791},{"$f":"IF($D$2=11,[1]!HeCalc(3,0,1,$B22*10^5,43,0,1),FluidProperties($D$2,1,$B22*10^5,10,0,3,1,1))","v":110.79529451008057},{"$f":"IF($D$2=11,[1]!HeCalc(3,0,1,$B22*10^5,44,0,1),FluidProperties($D$2,1,$B22*10^5,10,0,3,2,1))","v":29.815005237238097},{"$f":"IF($D$2=11,[1]!HeCalc(7,0,1,$B22*10^5,43,0,1),FluidProperties($D$2,1,$B22*10^5,10,0,29,1,1))/1000","v":15.658111944752294}]
[null,1.7000000000000006,{"$f":"IF($D$2=11,[1]!HeCalc(2,0,1,$B23*10^5,43,0,1),FluidProperties($D$2,1,$B23*10^5,10,0,2,2,1))","v":4.8189458703293724},{"$f":"IF($D$2=11,[1]!HeCalc(3,0,1,$B23*10^5,43,0,1),FluidProperties($D$2,1,$B23*10^5,10,0,3,1,1))","v":109.45833984444873},{"$f":"IF($D$2=11,[1]!HeCalc(3,0,1,$B23*10^5,44,0,1),FluidProperties($D$2,1,$B23*10^5,10,0,3,2,1))","v":31.125842110724765},{"$f":"IF($D$2=11,[1]!HeCalc(7,0,1,$B23*10^5,43,0,1),FluidProperties($D$2,1,$B23*10^5,10,0,29,1,1))/1000","v":15.113269849936238}]
[null,1.7500000000000007,{"$f":"IF($D$2=11,[1]!HeCalc(2,0,1,$B24*10^5,43,0,1),FluidProperties($D$2,1,$B24*10^5,10,0,2,2,1))","v":4.8552268725312677},{"$f":"IF($D$2=11,[1]!HeCalc(3,0,1,$B24*10^5,43,0,1),FluidProperties($D$2,1,$B24*10^5,10,0,3,1,1))","v":108.02318729836813},{"$f":"IF($D$2=11,[1]!HeCalc(3,0,1,$B24*10^5,44,0,1),FluidProperties($D$2,1,$B24*10^5,10,0,3,2,1))","v":32.504248643036149},{"$f":"IF($D$2=11,[1]!HeCalc(7,0,1,$B24*10^5,43,0,1),FluidProperties($D$2,1,$B24*10^5,10,0,29,1,1))/1000","v":14.53902430996844}]
[null,1.8000000000000007,{"$f":"IF($D$2=11,[1]!HeCalc(2,0,1,$B25*10^5,43,0,1),FluidProperties($D$2,1,$B25*10^5,10,0,2,2,1))","v":4.890780731394889},{"$f":"IF($D$2=11,[1]!HeCalc(3,0,1,$B25*10^5,43,0,1),FluidProperties($D$2,1,$B25*10^5,10,0,3,1,1))","v":106.50183644195577},{"$f":"IF($D$2=11,[1]!HeCalc(3,0,1,$B25*10^5,44,0,1),FluidProperties($D$2,1,$B25*10^5,10,0,3,2,1))","v":33.965480770616665},{"$f":"IF($D$2=11,[1]!HeCalc(7,0,1,$B25*10^5,43,0,1),FluidProperties($D$2,1,$B25*10^5,10,0,29,1,1))/1000","v":13.930395625977791}]
[null,1.8500000000000008,{"$f":"IF($D$2=11,[1]!HeCalc(2,0,1,$B26*10^5,43,0,1),FluidProperties($D$2,1,$B26*10^5,10,0,2,2,1))","v":4.9256362609040378},{"$f":"IF($D$2=11,[1]!HeCalc(3,0,1,$B26*10^5,43,0,1),FluidProperties($D$2,1,$B26*10^5,10,0,3,1,1))","v":104.88052621571671},{"$f":"IF($D$2=11,[1]!HeCalc(3,0,1,$B26*10^5,44,0,1),FluidProperties($D$2,1,$B26*10^5,10,0,3,2,1))","v":35.521845363121258},{"$f":"IF($D$2=11,[1]!HeCalc(7,0,1,$B26*10^5,43,0,1),FluidProperties($D$2,1,$B26*10^5,10,0,29,1,1))/1000","v":13.284217666633703}]
[null,1.9000000000000008,{"$f":"IF($D$2=11,[1]!HeCalc(2,0,1,$B27*10^5,43,0,1),FluidProperties($D$2,1,$B27*10^5,10,0,2,2,1))","v":4.9598179971559944},{"$f":"IF($D$2=11,[1]!HeCalc(3,0,1,$B27*10^5,43,0,1),FluidProperties($D$2,1,$B27*10^5,10,0,3,1,1))","v":103.14484338101528},{"$f":"IF($D$2=11,[1]!HeCalc(3,0,1,$B27*10^5,44,0,1),FluidProperties($D$2,1,$B27*10^5,10,0,3,2,1))","v":37.184216686526824},{"$f":"IF($D$2=11,[1]!HeCalc(7,0,1,$B27*10^5,43,0,1),FluidProperties($D$2,1,$B27*10^5,10,0,29,1,1))/1000","v":12.598867743780838}]
[null,1.9500000000000008,{"$f":"IF($D$2=11,[1]!HeCalc(2,0,1,$B28*10^5,43,0,1),FluidProperties($D$2,1,$B28*10^5,10,0,2,2,1))","v":4.9933458427471287},{"$f":"IF($D$2=11,[1]!HeCalc(3,0,1,$B28*10^5,43,0,1),FluidProperties($D$2,1,$B28*10^5,10,0,3,1,1))","v":101.28053924026246},{"$f":"IF($D$2=11,[1]!HeCalc(3,0,1,$B28*10^5,44,0,1),FluidProperties($D$2,1,$B28*10^5,10,0,3,2,1))","v":38.958087143051316},{"$f":"IF($D$2=11,[1]!HeCalc(7,0,1,$B28*10^5,43,0,1),FluidProperties($D$2,1,$B28*10^5,10,0,29,1,1))/1000","v":11.875787860421038}]
[null,2.0000000000000009,{"$f":"IF($D$2=11,[1]!HeCalc(2,0,1,$B29*10^5,43,0,1),FluidProperties($D$2,1,$B29*10^5,10,0,2,2,1))","v":5.0262344999930813},{"$f":"IF($D$2=11,[1]!HeCalc(3,0,1,$B29*10^5,43,0,1),FluidProperties($D$2,1,$B29*10^5,10,0,3,1,1))","v":99.273923863674781},{"$f":"IF($D$2=11,[1]!HeCalc(3,0,1,$B29*10^5,44,0,1),FluidProperties($D$2,1,$B29*10^5,10,0,3,2,1))","v":40.838964480772248},{"$f":"IF($D$2=11,[1]!HeCalc(7,0,1,$B29*10^5,43,0,1),FluidProperties($D$2,1,$B29*10^5,10,0,29,1,1))/1000","v":11.12050479882763}]
[null,2.0500000000000007,{"$f":"IF($D$2=11,[1]!HeCalc(2,0,1,$B30*10^5,43,0,1),FluidProperties($D$2,1,$B30*10^5,10,0,2,2,1))","v":5.0584925636979889},{"$f":"IF($D$2=11,[1]!HeCalc(3,0,1,$B30*10^5,43,0,1),FluidProperties($D$2,1,$B30*10^5,10,0,3,1,1))","v":97.106893228301814},{"$f":"IF($D$2=11,[1]!HeCalc(3,0,1,$B30*10^5,44,0,1),FluidProperties($D$2,1,$B30*10^5,10,0,3,2,1))","v":42.821782553945923},{"$f":"IF($D$2=11,[1]!HeCalc(7,0,1,$B30*10^5,43,0,1),FluidProperties($D$2,1,$B30*10^5,10,0,29,1,1))/1000","v":10.336411915488265}]
[null,2.1000000000000005,{"$f":"IF($D$2=11,[1]!HeCalc(2,0,1,$B31*10^5,43,0,1),FluidProperties($D$2,1,$B31*10^5,10,0,2,2,1))","v":5.090121051224421},{"$f":"IF($D$2=11,[1]!HeCalc(3,0,1,$B31*10^5,43,0,1),FluidProperties($D$2,1,$B31*10^5,10,0,3,1,1))","v":94.716938129047719},{"$f":"IF($D$2=11,[1]!HeCalc(3,0,1,$B31*10^5,44,0,1),FluidProperties($D$2,1,$B31*10^5,10,0,3,2,1))","v":45.029792090632533},{"$f":"IF($D$2=11,[1]!HeCalc(7,0,1,$B31*10^5,43,0,1),FluidProperties($D$2,1,$B31*10^5,10,0,29,1,1))/1000","v":9.4690999870083026}]
[null,2.1500000000000004,{"$f":"IF($D$2=11,[1]!HeCalc(2,0,1,$B32*10^5,43,0,1),FluidProperties($D$2,1,$B32*10^5,10,0,2,2,1))","v":5.1211106059731586},{"$f":"IF($D$2=11,[1]!HeCalc(3,0,1,$B32*10^5,43,0,1),FluidProperties($D$2,1,$B32*10^5,10,0,3,1,1))","v":91.908149503647238},{"$f":"IF($D$2=11,[1]!HeCalc(3,0,1,$B32*10^5,44,0,1),FluidProperties($D$2,1,$B32*10^5,10,0,3,2,1))","v":47.894869654329035},{"$f":"IF($D$2=11,[1]!HeCalc(7,0,1,$B32*10^5,43,0,1),FluidProperties($D$2,1,$B32*10^5,10,0,29,1,1))/1000","v":8.3493797654951862}]
[null,2.2000000000000002,{"$f":"IF($D$2=11,[1]!HeCalc(2,0,1,$B33*10^5,43,0,1),FluidProperties($D$2,1,$B33*10^5,10,0,2,2,1))","v":5.1514356680838054},{"$f":"IF($D$2=11,[1]!HeCalc(3,0,1,$B33*10^5,43,0,1),FluidProperties($D$2,1,$B33*10^5,10,0,3,1,1))","v":88.330115296016572},{"$f":"IF($D$2=11,[1]!HeCalc(3,0,1,$B33*10^5,44,0,1),FluidProperties($D$2,1,$B33*10^5,10,0,3,2,1))","v":51.389258428288493},{"$f":"IF($D$2=11,[1]!HeCalc(7,0,1,$B33*10^5,43,0,1),FluidProperties($D$2,1,$B33*10^5,10,0,29,1,1))/1000","v":6.9923869762069515}]
[null,2.25,{"$f":"IF($D$2=11,[1]!HeCalc(2,0,1,$B34*10^5,43,0,1),FluidProperties($D$2,1,$B34*10^5,10,0,2,2,1))","v":5.1810368686116242},{"$f":"IF($D$2=11,[1]!HeCalc(3,0,1,$B34*10^5,43,0,1),FluidProperties($D$2,1,$B34*10^5,10,0,3,1,1))","v":82.492654363206654},{"$f":"IF($D$2=11,[1]!HeCalc(3,0,1,$B34*10^5,44,0,1),FluidProperties($D$2,1,$B34*10^5,10,0,3,2,1))","v":57.090254217690244},{"$f":"IF($D$2=11,[1]!HeCalc(7,0,1,$B34*10^5,43,0,1),FluidProperties($D$2,1,$B34*10^5,10,0,29,1,1))/1000","v":4.7852844114155326}]
[null,2.2999999999999998,{"$f":"IF($D$2=11,[1]!HeCalc(2,0,1,$B35*10^5,43,0,1),FluidProperties($D$2,1,$B35*10^5,10,0,2,2,1))","v":"NUM"},{"$f":"IF($D$2=11,[1]!HeCalc(3,0,1,$B35*10^5,43,0,1),FluidProperties($D$2,1,$B35*10^5,10,0,3,1,1))","v":"NUM"},{"$f":"IF($D$2=11,[1]!HeCalc(3,0,1,$B35*10^5,44,0,1),FluidProperties($D$2,1,$B35*10^5,10,0,3,2,1))","v":"NUM"},{"$f":"IF($D$2=11,[1]!HeCalc(7,0,1,$B35*10^5,43,0,1),FluidProperties($D$2,1,$B35*10^5,10,0,29,1,1))/1000","v":{"$error":"#VALUE!"}}]
[null,2.3499999999999996,{"$f":"IF($D$2=11,[1]!HeCalc(2,0,1,$B36*10^5,43,0,1),FluidProperties($D$2,1,$B36*10^5,10,0,2,2,1))","v":"NUM"},{"$f":"IF($D$2=11,[1]!HeCalc(3,0,1,$B36*10^5,43,0,1),FluidProperties($D$2,1,$B36*10^5,10,0,3,1,1))","v":"NUM"},{"$f":"IF($D$2=11,[1]!HeCalc(3,0,1,$B36*10^5,44,0,1),FluidProperties($D$2,1,$B36*10^5,10,0,3,2,1))","v":"NUM"},{"$f":"IF($D$2=11,[1]!HeCalc(7,0,1,$B36*10^5,43,0,1),FluidProperties($D$2,1,$B36*10^5,10,0,29,1,1))/1000","v":{"$error":"#VALUE!"}}]
[null,2.3999999999999995,{"$f":"IF($D$2=11,[1]!HeCalc(2,0,1,$B37*10^5,43,0,1),FluidProperties($D$2,1,$B37*10^5,10,0,2,2,1))","v":"NUM"},{"$f":"IF($D$2=11,[1]!HeCalc(3,0,1,$B37*10^5,43,0,1),FluidProperties($D$2,1,$B37*10^5,10,0,3,1,1))","v":"NUM"},{"$f":"IF($D$2=11,[1]!HeCalc(3,0,1,$B37*10^5,44,0,1),FluidProperties($D$2,1,$B37*10^5,10,0,3,2,1))","v":"NUM"},{"$f":"IF($D$2=11,[1]!HeCalc(7,0,1,$B37*10^5,43,0,1),FluidProperties($D$2,1,$B37*10^5,10,0,29,1,1))/1000","v":{"$error":"#VALUE!"}}]
[null,2.4499999999999993,{"$f":"IF($D$2=11,[1]!HeCalc(2,0,1,$B38*10^5,43,0,1),FluidProperties($D$2,1,$B38*10^5,10,0,2,2,1))","v":"NUM"},{"$f":"IF($D$2=11,[1]!HeCalc(3,0,1,$B38*10^5,43,0,1),FluidProperties($D$2,1,$B38*10^5,10,0,3,1,1))","v":"NUM"},{"$f":"IF($D$2=11,[1]!HeCalc(3,0,1,$B38*10^5,44,0,1),FluidProperties($D$2,1,$B38*10^5,10,0,3,2,1))","v":"NUM"},{"$f":"IF($D$2=11,[1]!HeCalc(7,0,1,$B38*10^5,43,0,1),FluidProperties($D$2,1,$B38*10^5,10,0,29,1,1))/1000","v":{"$error":"#VALUE!"}}]
[null,2.4999999999999991,{"$f":"IF($D$2=11,[1]!HeCalc(2,0,1,$B39*10^5,43,0,1),FluidProperties($D$2,1,$B39*10^5,10,0,2,2,1))","v":"NUM"},{"$f":"IF($D$2=11,[1]!HeCalc(3,0,1,$B39*10^5,43,0,1),FluidProperties($D$2,1,$B39*10^5,10,0,3,1,1))","v":"NUM"},{"$f":"IF($D$2=11,[1]!HeCalc(3,0,1,$B39*10^5,44,0,1),FluidProperties($D$2,1,$B39*10^5,10,0,3,2,1))","v":"NUM"},{"$f":"IF($D$2=11,[1]!HeCalc(7,0,1,$B39*10^5,43,0,1),FluidProperties($D$2,1,$B39*10^5,10,0,29,1,1))/1000","v":{"$error":"#VALUE!"}}]
[null,2.5499999999999989,{"$f":"IF($D$2=11,[1]!HeCalc(2,0,1,$B40*10^5,43,0,1),FluidProperties($D$2,1,$B40*10^5,10,0,2,2,1))","v":"NUM"},{"$f":"IF($D$2=11,[1]!HeCalc(3,0,1,$B40*10^5,43,0,1),FluidProperties($D$2,1,$B40*10^5,10,0,3,1,1))","v":"NUM"},{"$f":"IF($D$2=11,[1]!HeCalc(3,0,1,$B40*10^5,44,0,1),FluidProperties($D$2,1,$B40*10^5,10,0,3,2,1))","v":"NUM"},{"$f":"IF($D$2=11,[1]!HeCalc(7,0,1,$B40*10^5,43,0,1),FluidProperties($D$2,1,$B40*10^5,10,0,29,1,1))/1000","v":{"$error":"#VALUE!"}}]
[null,2.5999999999999988,{"$f":"IF($D$2=11,[1]!HeCalc(2,0,1,$B41*10^5,43,0,1),FluidProperties($D$2,1,$B41*10^5,10,0,2,2,1))","v":"NUM"},{"$f":"IF($D$2=11,[1]!HeCalc(3,0,1,$B41*10^5,43,0,1),FluidProperties($D$2,1,$B41*10^5,10,0,3,1,1))","v":"NUM"},{"$f":"IF($D$2=11,[1]!HeCalc(3,0,1,$B41*10^5,44,0,1),FluidProperties($D$2,1,$B41*10^5,10,0,3,2,1))","v":"NUM"},{"$f":"IF($D$2=11,[1]!HeCalc(7,0,1,$B41*10^5,43,0,1),FluidProperties($D$2,1,$B41*10^5,10,0,29,1,1))/1000","v":{"$error":"#VALUE!"}}]
[null,2.6499999999999986,{"$f":"IF($D$2=11,[1]!HeCalc(2,0,1,$B42*10^5,43,0,1),FluidProperties($D$2,1,$B42*10^5,10,0,2,2,1))","v":"NUM"},{"$f":"IF($D$2=11,[1]!HeCalc(3,0,1,$B42*10^5,43,0,1),FluidProperties($D$2,1,$B42*10^5,10,0,3,1,1))","v":"NUM"},{"$f":"IF($D$2=11,[1]!HeCalc(3,0,1,$B42*10^5,44,0,1),FluidProperties($D$2,1,$B42*10^5,10,0,3,2,1))","v":"NUM"},{"$f":"IF($D$2=11,[1]!HeCalc(7,0,1,$B42*10^5,43,0,1),FluidProperties($D$2,1,$B42*10^5,10,0,29,1,1))/1000","v":{"$error":"#VALUE!"}}]
[null,2.6999999999999984,{"$f":"IF($D$2=11,[1]!HeCalc(2,0,1,$B43*10^5,43,0,1),FluidProperties($D$2,1,$B43*10^5,10,0,2,2,1))","v":"NUM"},{"$f":"IF($D$2=11,[1]!HeCalc(3,0,1,$B43*10^5,43,0,1),FluidProperties($D$2,1,$B43*10^5,10,0,3,1,1))","v":"NUM"},{"$f":"IF($D$2=11,[1]!HeCalc(3,0,1,$B43*10^5,44,0,1),FluidProperties($D$2,1,$B43*10^5,10,0,3,2,1))","v":"NUM"},{"$f":"IF($D$2=11,[1]!HeCalc(7,0,1,$B43*10^5,43,0,1),FluidProperties($D$2,1,$B43*10^5,10,0,29,1,1))/1000","v":{"$error":"#VALUE!"}}]
[null,2.7499999999999982,{"$f":"IF($D$2=11,[1]!HeCalc(2,0,1,$B44*10^5,43,0,1),FluidProperties($D$2,1,$B44*10^5,10,0,2,2,1))","v":"NUM"},{"$f":"IF($D$2=11,[1]!HeCalc(3,0,1,$B44*10^5,43,0,1),FluidProperties($D$2,1,$B44*10^5,10,0,3,1,1))","v":"NUM"},{"$f":"IF($D$2=11,[1]!HeCalc(3,0,1,$B44*10^5,44,0,1),FluidProperties($D$2,1,$B44*10^5,10,0,3,2,1))","v":"NUM"},{"$f":"IF($D$2=11,[1]!HeCalc(7,0,1,$B44*10^5,43,0,1),FluidProperties($D$2,1,$B44*10^5,10,0,29,1,1))/1000","v":{"$error":"#VALUE!"}}]
[null,2.799999999999998,{"$f":"IF($D$2=11,[1]!HeCalc(2,0,1,$B45*10^5,43,0,1),FluidProperties($D$2,1,$B45*10^5,10,0,2,2,1))","v":"NUM"},{"$f":"IF($D$2=11,[1]!HeCalc(3,0,1,$B45*10^5,43,0,1),FluidProperties($D$2,1,$B45*10^5,10,0,3,1,1))","v":"NUM"},{"$f":"IF($D$2=11,[1]!HeCalc(3,0,1,$B45*10^5,44,0,1),FluidProperties($D$2,1,$B45*10^5,10,0,3,2,1))","v":"NUM"},{"$f":"IF($D$2=11,[1]!HeCalc(7,0,1,$B45*10^5,43,0,1),FluidProperties($D$2,1,$B45*10^5,10,0,29,1,1))/1000","v":{"$error":"#VALUE!"}}]
[null,2.8499999999999979,{"$f":"IF($D$2=11,[1]!HeCalc(2,0,1,$B46*10^5,43,0,1),FluidProperties($D$2,1,$B46*10^5,10,0,2,2,1))","v":"NUM"},{"$f":"IF($D$2=11,[1]!HeCalc(3,0,1,$B46*10^5,43,0,1),FluidProperties($D$2,1,$B46*10^5,10,0,3,1,1))","v":"NUM"},{"$f":"IF($D$2=11,[1]!HeCalc(3,0,1,$B46*10^5,44,0,1),FluidProperties($D$2,1,$B46*10^5,10,0,3,2,1))","v":"NUM"},{"$f":"IF($D$2=11,[1]!HeCalc(7,0,1,$B46*10^5,43,0,1),FluidProperties($D$2,1,$B46*10^5,10,0,29,1,1))/1000","v":{"$error":"#VALUE!"}}]
[null,2.8999999999999977,{"$f":"IF($D$2=11,[1]!HeCalc(2,0,1,$B47*10^5,43,0,1),FluidProperties($D$2,1,$B47*10^5,10,0,2,2,1))","v":"NUM"},{"$f":"IF($D$2=11,[1]!HeCalc(3,0,1,$B47*10^5,43,0,1),FluidProperties($D$2,1,$B47*10^5,10,0,3,1,1))","v":"NUM"},{"$f":"IF($D$2=11,[1]!HeCalc(3,0,1,$B47*10^5,44,0,1),FluidProperties($D$2,1,$B47*10^5,10,0,3,2,1))","v":"NUM"},{"$f":"IF($D$2=11,[1]!HeCalc(7,0,1,$B47*10^5,43,0,1),FluidProperties($D$2,1,$B47*10^5,10,0,29,1,1))/1000","v":{"$error":"#VALUE!"}}]
[null,2.9499999999999975,{"$f":"IF($D$2=11,[1]!HeCalc(2,0,1,$B48*10^5,43,0,1),FluidProperties($D$2,1,$B48*10^5,10,0,2,2,1))","v":"NUM"},{"$f":"IF($D$2=11,[1]!HeCalc(3,0,1,$B48*10^5,43,0,1),FluidProperties($D$2,1,$B48*10^5,10,0,3,1,1))","v":"NUM"},{"$f":"IF($D$2=11,[1]!HeCalc(3,0,1,$B48*10^5,44,0,1),FluidProperties($D$2,1,$B48*10^5,10,0,3,2,1))","v":"NUM"},{"$f":"IF($D$2=11,[1]!HeCalc(7,0,1,$B48*10^5,43,0,1),FluidProperties($D$2,1,$B48*10^5,10,0,29,1,1))/1000","v":{"$error":"#VALUE!"}}]
[null,2.9999999999999973,{"$f":"IF($D$2=11,[1]!HeCalc(2,0,1,$B49*10^5,43,0,1),FluidProperties($D$2,1,$B49*10^5,10,0,2,2,1))","v":"NUM"},{"$f":"IF($D$2=11,[1]!HeCalc(3,0,1,$B49*10^5,43,0,1),FluidProperties($D$2,1,$B49*10^5,10,0,3,1,1))","v":"NUM"},{"$f":"IF($D$2=11,[1]!HeCalc(3,0,1,$B49*10^5,44,0,1),FluidProperties($D$2,1,$B49*10^5,10,0,3,2,1))","v":"NUM"},{"$f":"IF($D$2=11,[1]!HeCalc(7,0,1,$B49*10^5,43,0,1),FluidProperties($D$2,1,$B49*10^5,10,0,29,1,1))/1000","v":{"$error":"#VALUE!"}}]

{"sheet":"Vapour_fraction","index":4,"n_rows":10,"n_cols":9,"rows_kept":10,"cut":false,"hidden":false,"merged":[]}
[]
[null,"Fluid","Nitrogen 73",{"$f":"VLOOKUP(C2,Fluids_table,2)","v":21}]
[null,"Saturated pressure",2]
[null,"Saturated temperature",{"$f":"IF($D$2=11,[1]!HeCalc(2,0,1,$C$3*10^5,43,0,1),FluidProperties($D$2,1,$C$3*10^5,10,0,2,2,1))","v":83.644022812797175}]
[null,"Liquid density",{"$f":"IF($D$2=11,[1]!HeCalc(3,0,1,$C$3*10^5,43,0,1),FluidProperties($D$2,1,$C$3*10^5,10,0,3,1,1))","v":778.61876961404005}]
[null,"Gas density",{"$f":"IF($D$2=11,[1]!HeCalc(3,0,1,$C$3*10^5,44,0,1),FluidProperties($D$2,1,$C$3*10^5,10,0,3,2,1))","v":8.6568579593802948}]
[]
[null,"Vapour mass fraction x",0.15," =>","Density",{"$f":"1/(C8/$C$6+(1-C8)/$C$5)","v":54.291823961287271}," =>","Vapour fraction volume",{"$f":"C8*F8/$C$6","v":0.94073087861731142}]
[]
[null,"Vapour volume fraction α",0.15," =>","Density",{"$f":"C10*$C$6+(1-C10)*$C$5","v":663.12448286584106}," =>","Vapour fraction mass",{"$f":"C10*$C$6/F10","v":1.9581974839703721E-3}]

{"sheet":"Density","index":5,"n_rows":49,"n_cols":8,"rows_kept":49,"cut":false,"hidden":false,"merged":[]}
[]
[null,"Fluid","Helium",{"$f":"VLOOKUP(C2,Fluids_table,2,FALSE)","v":11}]
[null,"Critical pressure",{"$f":"IF($D$2=11,[1]!HeConst(5)/10^5,FConstant($D$2,5)/10^2)","v":2.2746230000000001}]
[null,"Max scale",{"$f":"B49","v":21}]
[]
[null,"Pressure step",0.5,null,null,"Temperature step",1]
[]
[null,"Pressure",5,10,null,"Temperature",5,15]
[null,1,{"$f":"IF($D$2=11,[1]!HeCalc(3,0,1,$B9*10^5,2,C$8,1),FluidProperties($D$2,1,$B9*10^5,2,C$8,3,0,1))","v":11.780297733711095},{"$f":"IF($D$2=11,[1]!HeCalc(3,0,1,$B9*10^5,2,D$8,1),FluidProperties($D$2,1,$B9*10^5,2,D$8,3,0,1))","v":4.9487139814227135},null,4.5,{"$f":"IF($D$2=11,[1]!HeCalc(3,0,1,G$8*10^5,2,$F9,1),FluidProperties($D$2,1,G$8*10^5,2,$F9,3,0,1))","v":136.80066356302726},{"$f":"IF($D$2=11,[1]!HeCalc(3,0,1,H$8*10^5,2,$F9,1),FluidProperties($D$2,1,H$8*10^5,2,$F9,3,0,1))","v":156.00546304012815}]
[null,{"$f":"B9+$C$6","v":1.5},{"$f":"IF($D$2=11,[1]!HeCalc(3,0,1,$B10*10^5,2,C$8,1),FluidProperties($D$2,1,$B10*10^5,2,C$8,3,0,1))","v":20.860982754647562},{"$f":"IF($D$2=11,[1]!HeCalc(3,0,1,$B10*10^5,2,D$8,1),FluidProperties($D$2,1,$B10*10^5,2,D$8,3,0,1))","v":7.5280289282437813},null,{"$f":"F9+$G$6","v":5.5},{"$f":"IF($D$2=11,[1]!HeCalc(3,0,1,G$8*10^5,2,$F10,1),FluidProperties($D$2,1,G$8*10^5,2,$F10,3,0,1))","v":118.34728238649689},{"$f":"IF($D$2=11,[1]!HeCalc(3,0,1,H$8*10^5,2,$F10,1),FluidProperties($D$2,1,H$8*10^5,2,$F10,3,0,1))","v":147.81035458049274}]
[null,2,{"$f":"IF($D$2=11,[1]!HeCalc(3,0,1,$B11*10^5,2,C$8,1),FluidProperties($D$2,1,$B11*10^5,2,C$8,3,0,1))","v":102.84908543960121},{"$f":"IF($D$2=11,[1]!HeCalc(3,0,1,$B11*10^5,2,D$8,1),FluidProperties($D$2,1,$B11*10^5,2,D$8,3,0,1))","v":10.180942582648267},null,{"$f":"F10+$G$6","v":6.5},{"$f":"IF($D$2=11,[1]!HeCalc(3,0,1,G$8*10^5,2,$F11,1),FluidProperties($D$2,1,G$8*10^5,2,$F11,3,0,1))","v":78.176073092081921},{"$f":"IF($D$2=11,[1]!HeCalc(3,0,1,H$8*10^5,2,$F11,1),FluidProperties($D$2,1,H$8*10^5,2,$F11,3,0,1))","v":137.6130673473919}]
[null,2.5,{"$f":"IF($D$2=11,[1]!HeCalc(3,0,1,$B12*10^5,2,C$8,1),FluidProperties($D$2,1,$B12*10^5,2,C$8,3,0,1))","v":112.39492063987316},{"$f":"IF($D$2=11,[1]!HeCalc(3,0,1,$B12*10^5,2,D$8,1),FluidProperties($D$2,1,$B12*10^5,2,D$8,3,0,1))","v":12.910091661118884},null,7.5,{"$f":"IF($D$2=11,[1]!HeCalc(3,0,1,G$8*10^5,2,$F12,1),FluidProperties($D$2,1,G$8*10^5,2,$F12,3,0,1))","v":48.338266754684327},{"$f":"IF($D$2=11,[1]!HeCalc(3,0,1,H$8*10^5,2,$F12,1),FluidProperties($D$2,1,H$8*10^5,2,$F12,3,0,1))","v":125.34454997646581}]
[null,3,{"$f":"IF($D$2=11,[1]!HeCalc(3,0,1,$B13*10^5,2,C$8,1),FluidProperties($D$2,1,$B13*10^5,2,C$8,3,0,1))","v":117.52937315721205},{"$f":"IF($D$2=11,[1]!HeCalc(3,0,1,$B13*10^5,2,D$8,1),FluidProperties($D$2,1,$B13*10^5,2,D$8,3,0,1))","v":15.71784249939234},null,8.5,{"$f":"IF($D$2=11,[1]!HeCalc(3,0,1,G$8*10^5,2,$F13,1),FluidProperties($D$2,1,G$8*10^5,2,$F13,3,0,1))","v":36.484393586075761},{"$f":"IF($D$2=11,[1]!HeCalc(3,0,1,H$8*10^5,2,$F13,1),FluidProperties($D$2,1,H$8*10^5,2,$F13,3,0,1))","v":111.26653223356945}]
[null,3.5,{"$f":"IF($D$2=11,[1]!HeCalc(3,0,1,$B14*10^5,2,C$8,1),FluidProperties($D$2,1,$B14*10^5,2,C$8,3,0,1))","v":121.25549792415524},{"$f":"IF($D$2=11,[1]!HeCalc(3,0,1,$B14*10^5,2,D$8,1),FluidProperties($D$2,1,$B14*10^5,2,D$8,3,0,1))","v":18.606044480997888},null,9.5,{"$f":"IF($D$2=11,[1]!HeCalc(3,0,1,G$8*10^5,2,$F14,1),FluidProperties($D$2,1,G$8*10^5,2,$F14,3,0,1))","v":30.048106229179851},{"$f":"IF($D$2=11,[1]!HeCalc(3,0,1,H$8*10^5,2,$F14,1),FluidProperties($D$2,1,H$8*10^5,2,$F14,3,0,1))","v":96.748042466571377}]
[null,4,{"$f":"IF($D$2=11,[1]!HeCalc(3,0,1,$B15*10^5,2,C$8,1),FluidProperties($D$2,1,$B15*10^5,2,C$8,3,0,1))","v":124.24525426760974},{"$f":"IF($D$2=11,[1]!HeCalc(3,0,1,$B15*10^5,2,D$8,1),FluidProperties($D$2,1,$B15*10^5,2,D$8,3,0,1))","v":21.575709640869672},null,10.5,{"$f":"IF($D$2=11,[1]!HeCalc(3,0,1,G$8*10^5,2,$F15,1),FluidProperties($D$2,1,G$8*10^5,2,$F15,3,0,1))","v":25.848736798110853},{"$f":"IF($D$2=11,[1]!HeCalc(3,0,1,H$8*10^5,2,$F15,1),FluidProperties($D$2,1,H$8*10^5,2,$F15,3,0,1))","v":83.768217569392064}]
[null,4.5,{"$f":"IF($D$2=11,[1]!HeCalc(3,0,1,$B16*10^5,2,C$8,1),FluidProperties($D$2,1,$B16*10^5,2,C$8,3,0,1))","v":126.77271248234294},{"$f":"IF($D$2=11,[1]!HeCalc(3,0,1,$B16*10^5,2,D$8,1),FluidProperties($D$2,1,$B16*10^5,2,D$8,3,0,1))","v":24.62662161450373},null,11.5,{"$f":"IF($D$2=11,[1]!HeCalc(3,0,1,G$8*10^5,2,$F16,1),FluidProperties($D$2,1,G$8*10^5,2,$F16,3,0,1))","v":22.825968675707163},{"$f":"IF($D$2=11,[1]!HeCalc(3,0,1,H$8*10^5,2,$F16,1),FluidProperties($D$2,1,H$8*10^5,2,$F16,3,0,1))","v":73.198512777702291}]
[null,5,{"$f":"IF($D$2=11,[1]!HeCalc(3,0,1,$B17*10^5,2,C$8,1),FluidProperties($D$2,1,$B17*10^5,2,C$8,3,0,1))","v":128.97927204592926},{"$f":"IF($D$2=11,[1]!HeCalc(3,0,1,$B17*10^5,2,D$8,1),FluidProperties($D$2,1,$B17*10^5,2,D$8,3,0,1))","v":27.756893919183174},null,12.5,{"$f":"IF($D$2=11,[1]!HeCalc(3,0,1,G$8*10^5,2,$F17,1),FluidProperties($D$2,1,G$8*10^5,2,$F17,3,0,1))","v":20.515720133859215},{"$f":"IF($D$2=11,[1]!HeCalc(3,0,1,H$8*10^5,2,$F17,1),FluidProperties($D$2,1,H$8*10^5,2,$F17,3,0,1))","v":64.837889871469741}]
[null,5.5,{"$f":"IF($D$2=11,[1]!HeCalc(3,0,1,$B18*10^5,2,C$8,1),FluidProperties($D$2,1,$B18*10^5,2,C$8,3,0,1))","v":130.94829904707848},{"$f":"IF($D$2=11,[1]!HeCalc(3,0,1,$B18*10^5,2,D$8,1),FluidProperties($D$2,1,$B18*10^5,2,D$8,3,0,1))","v":30.962518362801813},null,13.5,{"$f":"IF($D$2=11,[1]!HeCalc(3,0,1,G$8*10^5,2,$F18,1),FluidProperties($D$2,1,G$8*10^5,2,$F18,3,0,1))","v":18.677289312592269},{"$f":"IF($D$2=11,[1]!HeCalc(3,0,1,H$8*10^5,2,$F18,1),FluidProperties($D$2,1,H$8*10^5,2,$F18,3,0,1))","v":58.204130240074015}]
[null,6,{"$f":"IF($D$2=11,[1]!HeCalc(3,0,1,$B19*10^5,2,C$8,1),FluidProperties($D$2,1,$B19*10^5,2,C$8,3,0,1))","v":132.73343422211263},{"$f":"IF($D$2=11,[1]!HeCalc(3,0,1,$B19*10^5,2,D$8,1),FluidProperties($D$2,1,$B19*10^5,2,D$8,3,0,1))","v":34.236975269466988},null,14.5,{"$f":"IF($D$2=11,[1]!HeCalc(3,0,1,G$8*10^5,2,$F19,1),FluidProperties($D$2,1,G$8*10^5,2,$F19,3,0,1))","v":17.171069710655761},{"$f":"IF($D$2=11,[1]!HeCalc(3,0,1,H$8*10^5,2,$F19,1),FluidProperties($D$2,1,H$8*10^5,2,$F19,3,0,1))","v":52.863170475961162}]
[null,6.5,{"$f":"IF($D$2=11,[1]!HeCalc(3,0,1,$B20*10^5,2,C$8,1),FluidProperties($D$2,1,$B20*10^5,2,C$8,3,0,1))","v":134.3714020785321},{"$f":"IF($D$2=11,[1]!HeCalc(3,0,1,$B20*10^5,2,D$8,1),FluidProperties($D$2,1,$B20*10^5,2,D$8,3,0,1))","v":37.57099296173034},null,15.5,{"$f":"IF($D$2=11,[1]!HeCalc(3,0,1,G$8*10^5,2,$F20,1),FluidProperties($D$2,1,G$8*10^5,2,$F20,3,0,1))","v":15.909472574262495},{"$f":"IF($D$2=11,[1]!HeCalc(3,0,1,H$8*10^5,2,$F20,1),FluidProperties($D$2,1,H$8*10^5,2,$F20,3,0,1))","v":48.486730876073153}]
[null,7,{"$f":"IF($D$2=11,[1]!HeCalc(3,0,1,$B21*10^5,2,C$8,1),FluidProperties($D$2,1,$B21*10^5,2,C$8,3,0,1))","v":135.88854325105285},{"$f":"IF($D$2=11,[1]!HeCalc(3,0,1,$B21*10^5,2,D$8,1),FluidProperties($D$2,1,$B21*10^5,2,D$8,3,0,1))","v":40.952550265928274},null,16.5,{"$f":"IF($D$2=11,[1]!HeCalc(3,0,1,G$8*10^5,2,$F21,1),FluidProperties($D$2,1,G$8*10^5,2,$F21,3,0,1))","v":14.834256474905191},{"$f":"IF($D$2=11,[1]!HeCalc(3,0,1,H$8*10^5,2,$F21,1),FluidProperties($D$2,1,H$8*10^5,2,$F21,3,0,1))","v":44.83825489300645}]
[null,7.5,{"$f":"IF($D$2=11,[1]!HeCalc(3,0,1,$B22*10^5,2,C$8,1),FluidProperties($D$2,1,$B22*10^5,2,C$8,3,0,1))","v":137.30444752091492},{"$f":"IF($D$2=11,[1]!HeCalc(3,0,1,$B22*10^5,2,D$8,1),FluidProperties($D$2,1,$B22*10^5,2,D$8,3,0,1))","v":44.367184835964622},null,17.5,{"$f":"IF($D$2=11,[1]!HeCalc(3,0,1,G$8*10^5,2,$F22,1),FluidProperties($D$2,1,G$8*10^5,2,$F22,3,0,1))","v":13.904922054996909},{"$f":"IF($D$2=11,[1]!HeCalc(3,0,1,H$8*10^5,2,$F22,1),FluidProperties($D$2,1,H$8*10^5,2,$F22,3,0,1))","v":41.748592741403947}]
[null,8,{"$f":"IF($D$2=11,[1]!HeCalc(3,0,1,$B23*10^5,2,C$8,1),FluidProperties($D$2,1,$B23*10^5,2,C$8,3,0,1))","v":138.63411334304226},{"$f":"IF($D$2=11,[1]!HeCalc(3,0,1,$B23*10^5,2,D$8,1),FluidProperties($D$2,1,$B23*10^5,2,D$8,3,0,1))","v":47.798608107914276},null,18.5,{"$f":"IF($D$2=11,[1]!HeCalc(3,0,1,G$8*10^5,2,$F23,1),FluidProperties($D$2,1,G$8*10^5,2,$F23,3,0,1))","v":13.09228849592739},{"$f":"IF($D$2=11,[1]!HeCalc(3,0,1,H$8*10^5,2,$F23,1),FluidProperties($D$2,1,H$8*10^5,2,$F23,3,0,1))","v":39.095750560880681}]
[null,8.5,{"$f":"IF($D$2=11,[1]!HeCalc(3,0,1,$B24*10^5,2,C$8,1),FluidProperties($D$2,1,$B24*10^5,2,C$8,3,0,1))","v":139.88930075976262},{"$f":"IF($D$2=11,[1]!HeCalc(3,0,1,$B24*10^5,2,D$8,1),FluidProperties($D$2,1,$B24*10^5,2,D$8,3,0,1))","v":51.22954810031105},null,19.5,{"$f":"IF($D$2=11,[1]!HeCalc(3,0,1,G$8*10^5,2,$F24,1),FluidProperties($D$2,1,G$8*10^5,2,$F24,3,0,1))","v":12.37471307559283},{"$f":"IF($D$2=11,[1]!HeCalc(3,0,1,H$8*10^5,2,$F24,1),FluidProperties($D$2,1,H$8*10^5,2,$F24,3,0,1))","v":36.790395197558666}]
[null,9,{"$f":"IF($D$2=11,[1]!HeCalc(3,0,1,$B25*10^5,2,C$8,1),FluidProperties($D$2,1,$B25*10^5,2,C$8,3,0,1))","v":141.07941597466404},{"$f":"IF($D$2=11,[1]!HeCalc(3,0,1,$B25*10^5,2,D$8,1),FluidProperties($D$2,1,$B25*10^5,2,D$8,3,0,1))","v":54.642679451543657},null,20.5,{"$f":"IF($D$2=11,[1]!HeCalc(3,0,1,G$8*10^5,2,$F25,1),FluidProperties($D$2,1,G$8*10^5,2,$F25,3,0,1))","v":11.735753423472701},{"$f":"IF($D$2=11,[1]!HeCalc(3,0,1,H$8*10^5,2,$F25,1),FluidProperties($D$2,1,H$8*10^5,2,$F25,3,0,1))","v":34.765961083350561}]
[null,9.5,{"$f":"IF($D$2=11,[1]!HeCalc(3,0,1,$B26*10^5,2,C$8,1),FluidProperties($D$2,1,$B26*10^5,2,C$8,3,0,1))","v":142.21211057865671},{"$f":"IF($D$2=11,[1]!HeCalc(3,0,1,$B26*10^5,2,D$8,1),FluidProperties($D$2,1,$B26*10^5,2,D$8,3,0,1))","v":58.021480854078327},null,21.5,{"$f":"IF($D$2=11,[1]!HeCalc(3,0,1,G$8*10^5,2,$F26,1),FluidProperties($D$2,1,G$8*10^5,2,$F26,3,0,1))","v":11.162661792009922},{"$f":"IF($D$2=11,[1]!HeCalc(3,0,1,H$8*10^5,2,$F26,1),FluidProperties($D$2,1,H$8*10^5,2,$F26,3,0,1))","v":32.971970187077183}]
[null,10,{"$f":"IF($D$2=11,[1]!HeCalc(3,0,1,$B27*10^5,2,C$8,1),FluidProperties($D$2,1,$B27*10^5,2,C$8,3,0,1))","v":143.29369979872834},{"$f":"IF($D$2=11,[1]!HeCalc(3,0,1,$B27*10^5,2,D$8,1),FluidProperties($D$2,1,$B27*10^5,2,D$8,3,0,1))","v":61.350890521950241},null,22.5,{"$f":"IF($D$2=11,[1]!HeCalc(3,0,1,G$8*10^5,2,$F27,1),FluidProperties($D$2,1,G$8*10^5,2,$F27,3,0,1))","v":10.645381528933113},{"$f":"IF($D$2=11,[1]!HeCalc(3,0,1,H$8*10^5,2,$F27,1),FluidProperties($D$2,1,H$8*10^5,2,$F27,3,0,1))","v":31.36949862674528}]
[null,10.5,{"$f":"IF($D$2=11,[1]!HeCalc(3,0,1,$B28*10^5,2,C$8,1),FluidProperties($D$2,1,$B28*10^5,2,C$8,3,0,1))","v":144.32946199340375},{"$f":"IF($D$2=11,[1]!HeCalc(3,0,1,$B28*10^5,2,D$8,1),FluidProperties($D$2,1,$B28*10^5,2,D$8,3,0,1))","v":64.61771774220351},null,23.5,{"$f":"IF($D$2=11,[1]!HeCalc(3,0,1,G$8*10^5,2,$F28,1),FluidProperties($D$2,1,G$8*10^5,2,$F28,3,0,1))","v":10.175858532553002},{"$f":"IF($D$2=11,[1]!HeCalc(3,0,1,H$8*10^5,2,$F28,1),FluidProperties($D$2,1,H$8*10^5,2,$F28,3,0,1))","v":29.928062436574191}]
[null,11,{"$f":"IF($D$2=11,[1]!HeCalc(3,0,1,$B29*10^5,2,C$8,1),FluidProperties($D$2,1,$B29*10^5,2,C$8,3,0,1))","v":145.32385791550408},{"$f":"IF($D$2=11,[1]!HeCalc(3,0,1,$B29*10^5,2,D$8,1),FluidProperties($D$2,1,$B29*10^5,2,D$8,3,0,1))","v":67.810812331556363},null,24.5,{"$f":"IF($D$2=11,[1]!HeCalc(3,0,1,G$8*10^5,2,$F29,1),FluidProperties($D$2,1,G$8*10^5,2,$F29,3,0,1))","v":9.7475568465513707},{"$f":"IF($D$2=11,[1]!HeCalc(3,0,1,H$8*10^5,2,$F29,1),FluidProperties($D$2,1,H$8*10^5,2,$F29,3,0,1))","v":28.623445523988583}]
[null,11.5,{"$f":"IF($D$2=11,[1]!HeCalc(3,0,1,$B30*10^5,2,C$8,1),FluidProperties($D$2,1,$B30*10^5,2,C$8,3,0,1))","v":146.28069437515222},{"$f":"IF($D$2=11,[1]!HeCalc(3,0,1,$B30*10^5,2,D$8,1),FluidProperties($D$2,1,$B30*10^5,2,D$8,3,0,1))","v":70.921061739366621},null,25.5,{"$f":"IF($D$2=11,[1]!HeCalc(3,0,1,G$8*10^5,2,$F30,1),FluidProperties($D$2,1,G$8*10^5,2,$F30,3,0,1))","v":9.3551103572559207},{"$f":"IF($D$2=11,[1]!HeCalc(3,0,1,H$8*10^5,2,$F30,1),FluidProperties($D$2,1,H$8*10^5,2,$F30,3,0,1))","v":27.436160133318069}]
[null,12,{"$f":"IF($D$2=11,[1]!HeCalc(3,0,1,$B31*10^5,2,C$8,1),FluidProperties($D$2,1,$B31*10^5,2,C$8,3,0,1))","v":147.20324850657363},{"$f":"IF($D$2=11,[1]!HeCalc(3,0,1,$B31*10^5,2,D$8,1),FluidProperties($D$2,1,$B31*10^5,2,D$8,3,0,1))","v":73.941285349317099},null,26.5,{"$f":"IF($D$2=11,[1]!HeCalc(3,0,1,G$8*10^5,2,$F31,1),FluidProperties($D$2,1,G$8*10^5,2,$F31,3,0,1))","v":8.9940675043677984},{"$f":"IF($D$2=11,[1]!HeCalc(3,0,1,H$8*10^5,2,$F31,1),FluidProperties($D$2,1,H$8*10^5,2,$F31,3,0,1))","v":26.350337977781788}]
[null,12.5,{"$f":"IF($D$2=11,[1]!HeCalc(3,0,1,$B32*10^5,2,C$8,1),FluidProperties($D$2,1,$B32*10^5,2,C$8,3,0,1))","v":148.09436380148782},{"$f":"IF($D$2=11,[1]!HeCalc(3,0,1,$B32*10^5,2,D$8,1),FluidProperties($D$2,1,$B32*10^5,2,D$8,3,0,1))","v":76.866085924198217},null,27.5,{"$f":"IF($D$2=11,[1]!HeCalc(3,0,1,G$8*10^5,2,$F32,1),FluidProperties($D$2,1,G$8*10^5,2,$F32,3,0,1))","v":8.66070095831207},{"$f":"IF($D$2=11,[1]!HeCalc(3,0,1,H$8*10^5,2,$F32,1),FluidProperties($D$2,1,H$8*10^5,2,$F32,3,0,1))","v":25.352919132851493}]
[null,13,{"$f":"IF($D$2=11,[1]!HeCalc(3,0,1,$B33*10^5,2,C$8,1),FluidProperties($D$2,1,$B33*10^5,2,C$8,3,0,1))","v":148.95652378944592},{"$f":"IF($D$2=11,[1]!HeCalc(3,0,1,$B33*10^5,2,D$8,1),FluidProperties($D$2,1,$B33*10^5,2,D$8,3,0,1))","v":79.691693892292477},null,28.5,{"$f":"IF($D$2=11,[1]!HeCalc(3,0,1,G$8*10^5,2,$F33,1),FluidProperties($D$2,1,G$8*10^5,2,$F33,3,0,1))","v":8.351863561422963},{"$f":"IF($D$2=11,[1]!HeCalc(3,0,1,H$8*10^5,2,$F33,1),FluidProperties($D$2,1,H$8*10^5,2,$F33,3,0,1))","v":24.4330500035604}]
[null,13.5,{"$f":"IF($D$2=11,[1]!HeCalc(3,0,1,$B34*10^5,2,C$8,1),FluidProperties($D$2,1,$B34*10^5,2,C$8,3,0,1))","v":149.79191361708922},{"$f":"IF($D$2=11,[1]!HeCalc(3,0,1,$B34*10^5,2,D$8,1),FluidProperties($D$2,1,$B34*10^5,2,D$8,3,0,1))","v":82.415817227227464},null,29.5,{"$f":"IF($D$2=11,[1]!HeCalc(3,0,1,G$8*10^5,2,$F34,1),FluidProperties($D$2,1,G$8*10^5,2,$F34,3,0,1))","v":8.0648777897764035},{"$f":"IF($D$2=11,[1]!HeCalc(3,0,1,H$8*10^5,2,$F34,1),FluidProperties($D$2,1,H$8*10^5,2,$F34,3,0,1))","v":23.581630319386026}]
[null,14,{"$f":"IF($D$2=11,[1]!HeCalc(3,0,1,$B35*10^5,2,C$8,1),FluidProperties($D$2,1,$B35*10^5,2,C$8,3,0,1))","v":150.6024650552088},{"$f":"IF($D$2=11,[1]!HeCalc(3,0,1,$B35*10^5,2,D$8,1),FluidProperties($D$2,1,$B35*10^5,2,D$8,3,0,1))","v":85.037500201603308},null,30.5,{"$f":"IF($D$2=11,[1]!HeCalc(3,0,1,G$8*10^5,2,$F35,1),FluidProperties($D$2,1,G$8*10^5,2,$F35,3,0,1))","v":7.7974498839779374},{"$f":"IF($D$2=11,[1]!HeCalc(3,0,1,H$8*10^5,2,$F35,1),FluidProperties($D$2,1,H$8*10^5,2,$F35,3,0,1))","v":22.790967895243398}]
[null,14.5,{"$f":"IF($D$2=11,[1]!HeCalc(3,0,1,$B36*10^5,2,C$8,1),FluidProperties($D$2,1,$B36*10^5,2,C$8,3,0,1))","v":151.38989594936407},{"$f":"IF($D$2=11,[1]!HeCalc(3,0,1,$B36*10^5,2,D$8,1),FluidProperties($D$2,1,$B36*10^5,2,D$8,3,0,1))","v":87.556972792498428},null,31.5,{"$f":"IF($D$2=11,[1]!HeCalc(3,0,1,G$8*10^5,2,$F36,1),FluidProperties($D$2,1,G$8*10^5,2,$F36,3,0,1))","v":7.5476023924997584},{"$f":"IF($D$2=11,[1]!HeCalc(3,0,1,H$8*10^5,2,$F36,1),FluidProperties($D$2,1,H$8*10^5,2,$F36,3,0,1))","v":22.05451238905945}]
[null,15,{"$f":"IF($D$2=11,[1]!HeCalc(3,0,1,$B37*10^5,2,C$8,1),FluidProperties($D$2,1,$B37*10^5,2,C$8,3,0,1))","v":152.15574119025021},{"$f":"IF($D$2=11,[1]!HeCalc(3,0,1,$B37*10^5,2,D$8,1),FluidProperties($D$2,1,$B37*10^5,2,D$8,3,0,1))","v":89.975503094346479},null,32.5,{"$f":"IF($D$2=11,[1]!HeCalc(3,0,1,G$8*10^5,2,$F37,1),FluidProperties($D$2,1,G$8*10^5,2,$F37,3,0,1))","v":7.3136206352918265},{"$f":"IF($D$2=11,[1]!HeCalc(3,0,1,H$8*10^5,2,$F37,1),FluidProperties($D$2,1,H$8*10^5,2,$F37,3,0,1))","v":21.366647712318962}]
[null,15.5,{"$f":"IF($D$2=11,[1]!HeCalc(3,0,1,$B38*10^5,2,C$8,1),FluidProperties($D$2,1,$B38*10^5,2,C$8,3,0,1))","v":152.9013783752541},{"$f":"IF($D$2=11,[1]!HeCalc(3,0,1,$B38*10^5,2,D$8,1),FluidProperties($D$2,1,$B38*10^5,2,D$8,3,0,1))","v":92.295236752888371},null,33.5,{"$f":"IF($D$2=11,[1]!HeCalc(3,0,1,G$8*10^5,2,$F38,1),FluidProperties($D$2,1,G$8*10^5,2,$F38,3,0,1))","v":7.094009815471475},{"$f":"IF($D$2=11,[1]!HeCalc(3,0,1,H$8*10^5,2,$F38,1),FluidProperties($D$2,1,H$8*10^5,2,$F38,3,0,1))","v":20.722528652977015}]
[null,16,{"$f":"IF($D$2=11,[1]!HeCalc(3,0,1,$B39*10^5,2,C$8,1),FluidProperties($D$2,1,$B39*10^5,2,C$8,3,0,1))","v":153.62804907474148},{"$f":"IF($D$2=11,[1]!HeCalc(3,0,1,$B39*10^5,2,D$8,1),FluidProperties($D$2,1,$B39*10^5,2,D$8,3,0,1))","v":94.519033466547128},null,34.5,{"$f":"IF($D$2=11,[1]!HeCalc(3,0,1,G$8*10^5,2,$F39,1),FluidProperties($D$2,1,G$8*10^5,2,$F39,3,0,1))","v":6.8874603641189065},{"$f":"IF($D$2=11,[1]!HeCalc(3,0,1,H$8*10^5,2,$F39,1),FluidProperties($D$2,1,H$8*10^5,2,$F39,3,0,1))","v":20.117950155001946}]
[null,16.5,{"$f":"IF($D$2=11,[1]!HeCalc(3,0,1,$B40*10^5,2,C$8,1),FluidProperties($D$2,1,$B40*10^5,2,C$8,3,0,1))","v":154.33687658259595},{"$f":"IF($D$2=11,[1]!HeCalc(3,0,1,$B40*10^5,2,D$8,1),FluidProperties($D$2,1,$B40*10^5,2,D$8,3,0,1))","v":96.650305362720431},null,35.5,{"$f":"IF($D$2=11,[1]!HeCalc(3,0,1,G$8*10^5,2,$F40,1),FluidProperties($D$2,1,G$8*10^5,2,$F40,3,0,1))","v":6.6928197142481487},{"$f":"IF($D$2=11,[1]!HeCalc(3,0,1,H$8*10^5,2,$F40,1),FluidProperties($D$2,1,H$8*10^5,2,$F40,3,0,1))","v":19.549244401095731}]
[null,17,{"$f":"IF($D$2=11,[1]!HeCalc(3,0,1,$B41*10^5,2,C$8,1),FluidProperties($D$2,1,$B41*10^5,2,C$8,3,0,1))","v":155.02888083087532},{"$f":"IF($D$2=11,[1]!HeCalc(3,0,1,$B41*10^5,2,D$8,1),FluidProperties($D$2,1,$B41*10^5,2,D$8,3,0,1))","v":98.692864003465033},null,36.5,{"$f":"IF($D$2=11,[1]!HeCalc(3,0,1,G$8*10^5,2,$F41,1),FluidProperties($D$2,1,G$8*10^5,2,$F41,3,0,1))","v":6.5090691414042743},{"$f":"IF($D$2=11,[1]!HeCalc(3,0,1,H$8*10^5,2,$F41,1),FluidProperties($D$2,1,H$8*10^5,2,$F41,3,0,1))","v":19.013195056682328}]
[null,17.5,{"$f":"IF($D$2=11,[1]!HeCalc(3,0,1,$B42*10^5,2,C$8,1),FluidProperties($D$2,1,$B42*10^5,2,C$8,3,0,1))","v":155.7049909991415},{"$f":"IF($D$2=11,[1]!HeCalc(3,0,1,$B42*10^5,2,D$8,1),FluidProperties($D$2,1,$B42*10^5,2,D$8,3,0,1))","v":100.65078182199264},null,37.5,{"$f":"IF($D$2=11,[1]!HeCalc(3,0,1,G$8*10^5,2,$F42,1),FluidProperties($D$2,1,G$8*10^5,2,$F42,3,0,1))","v":6.3353046310946546},{"$f":"IF($D$2=11,[1]!HeCalc(3,0,1,H$8*10^5,2,$F42,1),FluidProperties($D$2,1,H$8*10^5,2,$F42,3,0,1))","v":18.506969205989702}]
[null,18,{"$f":"IF($D$2=11,[1]!HeCalc(3,0,1,$B43*10^5,2,C$8,1),FluidProperties($D$2,1,$B43*10^5,2,C$8,3,0,1))","v":156.36605623617154},{"$f":"IF($D$2=11,[1]!HeCalc(3,0,1,$B43*10^5,2,D$8,1),FluidProperties($D$2,1,$B43*10^5,2,D$8,3,0,1))","v":102.52827199883183},null,38.5,{"$f":"IF($D$2=11,[1]!HeCalc(3,0,1,G$8*10^5,2,$F43,1),FluidProperties($D$2,1,G$8*10^5,2,$F43,3,0,1))","v":6.1707209719667215},{"$f":"IF($D$2=11,[1]!HeCalc(3,0,1,H$8*10^5,2,$F43,1),FluidProperties($D$2,1,H$8*10^5,2,$F43,3,0,1))","v":18.028060771924892}]
[null,18.5,{"$f":"IF($D$2=11,[1]!HeCalc(3,0,1,$B44*10^5,2,C$8,1),FluidProperties($D$2,1,$B44*10^5,2,C$8,3,0,1))","v":157.01285482562864},{"$f":"IF($D$2=11,[1]!HeCalc(3,0,1,$B44*10^5,2,D$8,1),FluidProperties($D$2,1,$B44*10^5,2,D$8,3,0,1))","v":104.32958859122975},null,39.5,{"$f":"IF($D$2=11,[1]!HeCalc(3,0,1,G$8*10^5,2,$F44,1),FluidProperties($D$2,1,G$8*10^5,2,$F44,3,0,1))","v":6.0145984520539955},{"$f":"IF($D$2=11,[1]!HeCalc(3,0,1,H$8*10^5,2,$F44,1),FluidProperties($D$2,1,H$8*10^5,2,$F44,3,0,1))","v":17.574243876104887}]
[null,19,{"$f":"IF($D$2=11,[1]!HeCalc(3,0,1,$B45*10^5,2,C$8,1),FluidProperties($D$2,1,$B45*10^5,2,C$8,3,0,1))","v":157.6461020609251},{"$f":"IF($D$2=11,[1]!HeCalc(3,0,1,$B45*10^5,2,D$8,1),FluidProperties($D$2,1,$B45*10^5,2,D$8,3,0,1))","v":106.05894474110701},null,40.5,{"$f":"IF($D$2=11,[1]!HeCalc(3,0,1,G$8*10^5,2,$F45,1),FluidProperties($D$2,1,G$8*10^5,2,$F45,3,0,1))","v":5.8662916700692023},{"$f":"IF($D$2=11,[1]!HeCalc(3,0,1,H$8*10^5,2,$F45,1),FluidProperties($D$2,1,H$8*10^5,2,$F45,3,0,1))","v":17.143534056247013}]
[null,19.5,{"$f":"IF($D$2=11,[1]!HeCalc(3,0,1,$B46*10^5,2,C$8,1),FluidProperties($D$2,1,$B46*10^5,2,C$8,3,0,1))","v":158.26645704297079},{"$f":"IF($D$2=11,[1]!HeCalc(3,0,1,$B46*10^5,2,D$8,1),FluidProperties($D$2,1,$B46*10^5,2,D$8,3,0,1))","v":107.72045644648179},null,41.5,{"$f":"IF($D$2=11,[1]!HeCalc(3,0,1,G$8*10^5,2,$F46,1),FluidProperties($D$2,1,G$8*10^5,2,$F46,3,0,1))","v":5.7252200762917775},{"$f":"IF($D$2=11,[1]!HeCalc(3,0,1,H$8*10^5,2,$F46,1),FluidProperties($D$2,1,H$8*10^5,2,$F46,3,0,1))","v":16.734155827390676}]
[null,20,{"$f":"IF($D$2=11,[1]!HeCalc(3,0,1,$B47*10^5,2,C$8,1),FluidProperties($D$2,1,$B47*10^5,2,C$8,3,0,1))","v":158.87452847072529},{"$f":"IF($D$2=11,[1]!HeCalc(3,0,1,$B47*10^5,2,D$8,1),FluidProperties($D$2,1,$B47*10^5,2,D$8,3,0,1))","v":109.31809300056155},null,42.5,{"$f":"IF($D$2=11,[1]!HeCalc(3,0,1,G$8*10^5,2,$F47,1),FluidProperties($D$2,1,G$8*10^5,2,$F47,3,0,1))","v":5.5908599363948364},{"$f":"IF($D$2=11,[1]!HeCalc(3,0,1,H$8*10^5,2,$F47,1),FluidProperties($D$2,1,H$8*10^5,2,$F47,3,0,1))","v":16.344515399177251}]
[null,20.5,{"$f":"IF($D$2=11,[1]!HeCalc(3,0,1,$B48*10^5,2,C$8,1),FluidProperties($D$2,1,$B48*10^5,2,C$8,3,0,1))","v":159.47088022709923},{"$f":"IF($D$2=11,[1]!HeCalc(3,0,1,$B48*10^5,2,D$8,1),FluidProperties($D$2,1,$B48*10^5,2,D$8,3,0,1))","v":110.8556494013082},null,43.5,{"$f":"IF($D$2=11,[1]!HeCalc(3,0,1,G$8*10^5,2,$F48,1),FluidProperties($D$2,1,G$8*10^5,2,$F48,3,0,1))","v":5.4627374725806233},{"$f":"IF($D$2=11,[1]!HeCalc(3,0,1,H$8*10^5,2,$F48,1),FluidProperties($D$2,1,H$8*10^5,2,$F48,3,0,1))","v":15.973177610169449}]
[null,21,{"$f":"IF($D$2=11,[1]!HeCalc(3,0,1,$B49*10^5,2,C$8,1),FluidProperties($D$2,1,$B49*10^5,2,C$8,3,0,1))","v":160.05603510682354},{"$f":"IF($D$2=11,[1]!HeCalc(3,0,1,$B49*10^5,2,D$8,1),FluidProperties($D$2,1,$B49*10^5,2,D$8,3,0,1))","v":112.33672692622791},null,44.5,{"$f":"IF($D$2=11,[1]!HeCalc(3,0,1,G$8*10^5,2,$F49,1),FluidProperties($D$2,1,G$8*10^5,2,$F49,3,0,1))","v":5.3404229840102388},{"$f":"IF($D$2=11,[1]!HeCalc(3,0,1,H$8*10^5,2,$F49,1),FluidProperties($D$2,1,H$8*10^5,2,$F49,3,0,1))","v":15.618846331670447}]

{"sheet":"Cp","index":6,"n_rows":49,"n_cols":8,"rows_kept":49,"cut":false,"hidden":false,"merged":[]}
[]
[null,"Fluid","Helium",{"$f":"VLOOKUP(C2,Fluids_table,2,FALSE)","v":11}]
[null,"Critical pressure",{"$f":"IF($D$2=11,[1]!HeConst(5)/10^5,FConstant($D$2,5)/10^2)","v":2.2746230000000001}]
[null,"Max scale",{"$f":"B48","v":40}]
[]
[null,"Pressure step",1,null,null,"Temperature step",0.3]
[]
[null,"Pressure",8,20,null,"Temperature",1,5]
[null,1,{"$f":"IF($D$2=11,[1]!HeCalc(14,0,1,$B9*10^5,2,C$8,1),FluidProperties($D$2,1,$B9*10^5,2,C$8,10,0,1))","v":5574.9203499960167},{"$f":"IF($D$2=11,[1]!HeCalc(14,0,1,$B9*10^5,2,D$8,1),FluidProperties($D$2,1,$B9*10^5,2,D$8,10,0,1))","v":5249.9970871191726},null,4.5,{"$f":"IF($D$2=11,[1]!HeCalc(14,0,1,G$8*10^5,2,$F9,1),FluidProperties($D$2,1,G$8*10^5,2,$F9,10,0,1))","v":7710.1044020798618},{"$f":"IF($D$2=11,[1]!HeCalc(14,0,1,H$8*10^5,2,$F9,1),FluidProperties($D$2,1,H$8*10^5,2,$F9,10,0,1))","v":3954.6276277613861}]
[null,{"$f":"B9+$C$6","v":2},{"$f":"IF($D$2=11,[1]!HeCalc(14,0,1,$B10*10^5,2,C$8,1),FluidProperties($D$2,1,$B10*10^5,2,C$8,10,0,1))","v":6064.2009671408796},{"$f":"IF($D$2=11,[1]!HeCalc(14,0,1,$B10*10^5,2,D$8,1),FluidProperties($D$2,1,$B10*10^5,2,D$8,10,0,1))","v":5306.4424260859687},null,{"$f":"F9+$G$6","v":4.8},{"$f":"IF($D$2=11,[1]!HeCalc(14,0,1,G$8*10^5,2,$F10,1),FluidProperties($D$2,1,G$8*10^5,2,$F10,10,0,1))","v":7027.0739648978652},{"$f":"IF($D$2=11,[1]!HeCalc(14,0,1,H$8*10^5,2,$F10,1),FluidProperties($D$2,1,H$8*10^5,2,$F10,10,0,1))","v":4440.046611932059}]
[null,3,{"$f":"IF($D$2=11,[1]!HeCalc(14,0,1,$B11*10^5,2,C$8,1),FluidProperties($D$2,1,$B11*10^5,2,C$8,10,0,1))","v":6712.3389075614186},{"$f":"IF($D$2=11,[1]!HeCalc(14,0,1,$B11*10^5,2,D$8,1),FluidProperties($D$2,1,$B11*10^5,2,D$8,10,0,1))","v":5362.3268752793274},null,{"$f":"F10+$G$6","v":5.0999999999999996},{"$f":"IF($D$2=11,[1]!HeCalc(14,0,1,G$8*10^5,2,$F11,1),FluidProperties($D$2,1,G$8*10^5,2,$F11,10,0,1))","v":6618.6786745910185},{"$f":"IF($D$2=11,[1]!HeCalc(14,0,1,H$8*10^5,2,$F11,1),FluidProperties($D$2,1,H$8*10^5,2,$F11,10,0,1))","v":5084.3366300124644}]
[null,4,{"$f":"IF($D$2=11,[1]!HeCalc(14,0,1,$B12*10^5,2,C$8,1),FluidProperties($D$2,1,$B12*10^5,2,C$8,10,0,1))","v":7554.8944699453887},{"$f":"IF($D$2=11,[1]!HeCalc(14,0,1,$B12*10^5,2,D$8,1),FluidProperties($D$2,1,$B12*10^5,2,D$8,10,0,1))","v":5417.5611294601904},null,5.3999999999999995,{"$f":"IF($D$2=11,[1]!HeCalc(14,0,1,G$8*10^5,2,$F12,1),FluidProperties($D$2,1,G$8*10^5,2,$F12,10,0,1))","v":6347.0068270949942},{"$f":"IF($D$2=11,[1]!HeCalc(14,0,1,H$8*10^5,2,$F12,1),FluidProperties($D$2,1,H$8*10^5,2,$F12,10,0,1))","v":6017.9831612823318}]
[null,5,{"$f":"IF($D$2=11,[1]!HeCalc(14,0,1,$B13*10^5,2,C$8,1),FluidProperties($D$2,1,$B13*10^5,2,C$8,10,0,1))","v":8505.2515605197277},{"$f":"IF($D$2=11,[1]!HeCalc(14,0,1,$B13*10^5,2,D$8,1),FluidProperties($D$2,1,$B13*10^5,2,D$8,10,0,1))","v":5472.0379704900006},null,5.6999999999999993,{"$f":"IF($D$2=11,[1]!HeCalc(14,0,1,G$8*10^5,2,$F13,1),FluidProperties($D$2,1,G$8*10^5,2,$F13,10,0,1))","v":6154.1520559752371},{"$f":"IF($D$2=11,[1]!HeCalc(14,0,1,H$8*10^5,2,$F13,1),FluidProperties($D$2,1,H$8*10^5,2,$F13,10,0,1))","v":7513.693354050818}]
[null,6,{"$f":"IF($D$2=11,[1]!HeCalc(14,0,1,$B14*10^5,2,C$8,1),FluidProperties($D$2,1,$B14*10^5,2,C$8,10,0,1))","v":9248.9609950876984},{"$f":"IF($D$2=11,[1]!HeCalc(14,0,1,$B14*10^5,2,D$8,1),FluidProperties($D$2,1,$B14*10^5,2,D$8,10,0,1))","v":5525.6333246272925},null,5.9999999999999991,{"$f":"IF($D$2=11,[1]!HeCalc(14,0,1,G$8*10^5,2,$F14,1),FluidProperties($D$2,1,G$8*10^5,2,$F14,10,0,1))","v":6010.9485268976478},{"$f":"IF($D$2=11,[1]!HeCalc(14,0,1,H$8*10^5,2,$F14,1),FluidProperties($D$2,1,H$8*10^5,2,$F14,10,0,1))","v":10042.481795451953}]
[null,7,{"$f":"IF($D$2=11,[1]!HeCalc(14,0,1,$B15*10^5,2,C$8,1),FluidProperties($D$2,1,$B15*10^5,2,C$8,10,0,1))","v":9507.2595418836936},{"$f":"IF($D$2=11,[1]!HeCalc(14,0,1,$B15*10^5,2,D$8,1),FluidProperties($D$2,1,$B15*10^5,2,D$8,10,0,1))","v":5578.2081972248052},null,6.2999999999999989,{"$f":"IF($D$2=11,[1]!HeCalc(14,0,1,G$8*10^5,2,$F15,1),FluidProperties($D$2,1,G$8*10^5,2,$F15,10,0,1))","v":5900.9655373896703},{"$f":"IF($D$2=11,[1]!HeCalc(14,0,1,H$8*10^5,2,$F15,1),FluidProperties($D$2,1,H$8*10^5,2,$F15,10,0,1))","v":12973.558137343329}]
[null,8,{"$f":"IF($D$2=11,[1]!HeCalc(14,0,1,$B16*10^5,2,C$8,1),FluidProperties($D$2,1,$B16*10^5,2,C$8,10,0,1))","v":9323.6015975171595},{"$f":"IF($D$2=11,[1]!HeCalc(14,0,1,$B16*10^5,2,D$8,1),FluidProperties($D$2,1,$B16*10^5,2,D$8,10,0,1))","v":5629.611447172404},null,6.5999999999999988,{"$f":"IF($D$2=11,[1]!HeCalc(14,0,1,G$8*10^5,2,$F16,1),FluidProperties($D$2,1,G$8*10^5,2,$F16,10,0,1))","v":5814.2162783199201},{"$f":"IF($D$2=11,[1]!HeCalc(14,0,1,H$8*10^5,2,$F16,1),FluidProperties($D$2,1,H$8*10^5,2,$F16,10,0,1))","v":13314.83204073745}]
[null,9,{"$f":"IF($D$2=11,[1]!HeCalc(14,0,1,$B17*10^5,2,C$8,1),FluidProperties($D$2,1,$B17*10^5,2,C$8,10,0,1))","v":8852.4583495626412},{"$f":"IF($D$2=11,[1]!HeCalc(14,0,1,$B17*10^5,2,D$8,1),FluidProperties($D$2,1,$B17*10^5,2,D$8,10,0,1))","v":5679.683306991692},null,6.8999999999999986,{"$f":"IF($D$2=11,[1]!HeCalc(14,0,1,G$8*10^5,2,$F17,1),FluidProperties($D$2,1,G$8*10^5,2,$F17,10,0,1))","v":5744.2859152336823},{"$f":"IF($D$2=11,[1]!HeCalc(14,0,1,H$8*10^5,2,$F17,1),FluidProperties($D$2,1,H$8*10^5,2,$F17,10,0,1))","v":12101.052134137695}]
[null,10,{"$f":"IF($D$2=11,[1]!HeCalc(14,0,1,$B18*10^5,2,C$8,1),FluidProperties($D$2,1,$B18*10^5,2,C$8,10,0,1))","v":8248.1965604217075},{"$f":"IF($D$2=11,[1]!HeCalc(14,0,1,$B18*10^5,2,D$8,1),FluidProperties($D$2,1,$B18*10^5,2,D$8,10,0,1))","v":5728.2594988579558},null,7.1999999999999984,{"$f":"IF($D$2=11,[1]!HeCalc(14,0,1,G$8*10^5,2,$F18,1),FluidProperties($D$2,1,G$8*10^5,2,$F18,10,0,1))","v":5686.875748598376},{"$f":"IF($D$2=11,[1]!HeCalc(14,0,1,H$8*10^5,2,$F18,1),FluidProperties($D$2,1,H$8*10^5,2,$F18,10,0,1))","v":10792.55126136527}]
[null,11,{"$f":"IF($D$2=11,[1]!HeCalc(14,0,1,$B19*10^5,2,C$8,1),FluidProperties($D$2,1,$B19*10^5,2,C$8,10,0,1))","v":7645.4171078749587},{"$f":"IF($D$2=11,[1]!HeCalc(14,0,1,$B19*10^5,2,D$8,1),FluidProperties($D$2,1,$B19*10^5,2,D$8,10,0,1))","v":5775.1757527348591},null,7.4999999999999982,{"$f":"IF($D$2=11,[1]!HeCalc(14,0,1,G$8*10^5,2,$F19,1),FluidProperties($D$2,1,G$8*10^5,2,$F19,10,0,1))","v":5639.005976110524},{"$f":"IF($D$2=11,[1]!HeCalc(14,0,1,H$8*10^5,2,$F19,1),FluidProperties($D$2,1,H$8*10^5,2,$F19,10,0,1))","v":9727.4231538761887}]
[null,12,{"$f":"IF($D$2=11,[1]!HeCalc(14,0,1,$B20*10^5,2,C$8,1),FluidProperties($D$2,1,$B20*10^5,2,C$8,10,0,1))","v":7114.6354525164488},{"$f":"IF($D$2=11,[1]!HeCalc(14,0,1,$B20*10^5,2,D$8,1),FluidProperties($D$2,1,$B20*10^5,2,D$8,10,0,1))","v":5820.2724552646641},null,7.799999999999998,{"$f":"IF($D$2=11,[1]!HeCalc(14,0,1,G$8*10^5,2,$F20,1),FluidProperties($D$2,1,G$8*10^5,2,$F20,10,0,1))","v":5598.5525122917807},{"$f":"IF($D$2=11,[1]!HeCalc(14,0,1,H$8*10^5,2,$F20,1),FluidProperties($D$2,1,H$8*10^5,2,$F20,10,0,1))","v":8923.9521811750874}]
[null,13,{"$f":"IF($D$2=11,[1]!HeCalc(14,0,1,$B21*10^5,2,C$8,1),FluidProperties($D$2,1,$B21*10^5,2,C$8,10,0,1))","v":6671.3940937228444},{"$f":"IF($D$2=11,[1]!HeCalc(14,0,1,$B21*10^5,2,D$8,1),FluidProperties($D$2,1,$B21*10^5,2,D$8,10,0,1))","v":5863.399281332916},null,8.0999999999999979,{"$f":"IF($D$2=11,[1]!HeCalc(14,0,1,G$8*10^5,2,$F21,1),FluidProperties($D$2,1,G$8*10^5,2,$F21,10,0,1))","v":5563.9649983955496},{"$f":"IF($D$2=11,[1]!HeCalc(14,0,1,H$8*10^5,2,$F21,1),FluidProperties($D$2,1,H$8*10^5,2,$F21,10,0,1))","v":8324.0259298632955}]
[null,14,{"$f":"IF($D$2=11,[1]!HeCalc(14,0,1,$B22*10^5,2,C$8,1),FluidProperties($D$2,1,$B22*10^5,2,C$8,10,0,1))","v":6306.848557287346},{"$f":"IF($D$2=11,[1]!HeCalc(14,0,1,$B22*10^5,2,D$8,1),FluidProperties($D$2,1,$B22*10^5,2,D$8,10,0,1))","v":5904.4193770255142},null,8.3999999999999986,{"$f":"IF($D$2=11,[1]!HeCalc(14,0,1,G$8*10^5,2,$F22,1),FluidProperties($D$2,1,G$8*10^5,2,$F22,10,0,1))","v":5534.0884662870794},{"$f":"IF($D$2=11,[1]!HeCalc(14,0,1,H$8*10^5,2,$F22,1),FluidProperties($D$2,1,H$8*10^5,2,$F22,10,0,1))","v":7869.7539007641099}]
[null,15,{"$f":"IF($D$2=11,[1]!HeCalc(14,0,1,$B23*10^5,2,C$8,1),FluidProperties($D$2,1,$B23*10^5,2,C$8,10,0,1))","v":6006.3026998073228},{"$f":"IF($D$2=11,[1]!HeCalc(14,0,1,$B23*10^5,2,D$8,1),FluidProperties($D$2,1,$B23*10^5,2,D$8,10,0,1))","v":5943.2130431432161},null,8.6999999999999993,{"$f":"IF($D$2=11,[1]!HeCalc(14,0,1,G$8*10^5,2,$F23,1),FluidProperties($D$2,1,G$8*10^5,2,$F23,10,0,1))","v":5508.0469266645277},{"$f":"IF($D$2=11,[1]!HeCalc(14,0,1,H$8*10^5,2,$F23,1),FluidProperties($D$2,1,H$8*10^5,2,$F23,10,0,1))","v":7518.4460207640541}]
[null,16,{"$f":"IF($D$2=11,[1]!HeCalc(14,0,1,$B24*10^5,2,C$8,1),FluidProperties($D$2,1,$B24*10^5,2,C$8,10,0,1))","v":5756.0944295690915},{"$f":"IF($D$2=11,[1]!HeCalc(14,0,1,$B24*10^5,2,D$8,1),FluidProperties($D$2,1,$B24*10^5,2,D$8,10,0,1))","v":5979.6806276631678},null,9,{"$f":"IF($D$2=11,[1]!HeCalc(14,0,1,G$8*10^5,2,$F24,1),FluidProperties($D$2,1,G$8*10^5,2,$F24,10,0,1))","v":5485.1653079591606},{"$f":"IF($D$2=11,[1]!HeCalc(14,0,1,H$8*10^5,2,$F24,1),FluidProperties($D$2,1,H$8*10^5,2,$F24,10,0,1))","v":7240.8250112835194}]
[null,17,{"$f":"IF($D$2=11,[1]!HeCalc(14,0,1,$B25*10^5,2,C$8,1),FluidProperties($D$2,1,$B25*10^5,2,C$8,10,0,1))","v":5545.2312038466498},{"$f":"IF($D$2=11,[1]!HeCalc(14,0,1,$B25*10^5,2,D$8,1),FluidProperties($D$2,1,$B25*10^5,2,D$8,10,0,1))","v":6013.7445380473091},null,9.3000000000000007,{"$f":"IF($D$2=11,[1]!HeCalc(14,0,1,G$8*10^5,2,$F25,1),FluidProperties($D$2,1,G$8*10^5,2,$F25,10,0,1))","v":5464.9158809398668},{"$f":"IF($D$2=11,[1]!HeCalc(14,0,1,H$8*10^5,2,$F25,1),FluidProperties($D$2,1,H$8*10^5,2,$F25,10,0,1))","v":7017.0068349660087}]
[null,18,{"$f":"IF($D$2=11,[1]!HeCalc(14,0,1,$B26*10^5,2,C$8,1),FluidProperties($D$2,1,$B26*10^5,2,C$8,10,0,1))","v":5365.2865376833133},{"$f":"IF($D$2=11,[1]!HeCalc(14,0,1,$B26*10^5,2,D$8,1),FluidProperties($D$2,1,$B26*10^5,2,D$8,10,0,1))","v":6045.3503122985476},null,9.6000000000000014,{"$f":"IF($D$2=11,[1]!HeCalc(14,0,1,G$8*10^5,2,$F26,1),FluidProperties($D$2,1,G$8*10^5,2,$F26,10,0,1))","v":5446.8807314624337},{"$f":"IF($D$2=11,[1]!HeCalc(14,0,1,H$8*10^5,2,$F26,1),FluidProperties($D$2,1,H$8*10^5,2,$F26,10,0,1))","v":6833.3272402724715}]
[null,19,{"$f":"IF($D$2=11,[1]!HeCalc(14,0,1,$B27*10^5,2,C$8,1),FluidProperties($D$2,1,$B27*10^5,2,C$8,10,0,1))","v":5209.8878899750753},{"$f":"IF($D$2=11,[1]!HeCalc(14,0,1,$B27*10^5,2,D$8,1),FluidProperties($D$2,1,$B27*10^5,2,D$8,10,0,1))","v":6074.466762439969},null,9.9000000000000021,{"$f":"IF($D$2=11,[1]!HeCalc(14,0,1,G$8*10^5,2,$F27,1),FluidProperties($D$2,1,G$8*10^5,2,$F27,10,0,1))","v":5430.7249942662802},{"$f":"IF($D$2=11,[1]!HeCalc(14,0,1,H$8*10^5,2,$F27,1),FluidProperties($D$2,1,H$8*10^5,2,$F27,10,0,1))","v":6680.2159859475696}]
[null,20,{"$f":"IF($D$2=11,[1]!HeCalc(14,0,1,$B28*10^5,2,C$8,1),FluidProperties($D$2,1,$B28*10^5,2,C$8,10,0,1))","v":5074.2099012802701},{"$f":"IF($D$2=11,[1]!HeCalc(14,0,1,$B28*10^5,2,D$8,1),FluidProperties($D$2,1,$B28*10^5,2,D$8,10,0,1))","v":6101.0852671515222},null,10.200000000000003,{"$f":"IF($D$2=11,[1]!HeCalc(14,0,1,G$8*10^5,2,$F28,1),FluidProperties($D$2,1,G$8*10^5,2,$F28,10,0,1))","v":5416.1774476654082},{"$f":"IF($D$2=11,[1]!HeCalc(14,0,1,H$8*10^5,2,$F28,1),FluidProperties($D$2,1,H$8*10^5,2,$F28,10,0,1))","v":6550.8296728598689}]
[null,21,{"$f":"IF($D$2=11,[1]!HeCalc(14,0,1,$B29*10^5,2,C$8,1),FluidProperties($D$2,1,$B29*10^5,2,C$8,10,0,1))","v":4954.5700242361418},{"$f":"IF($D$2=11,[1]!HeCalc(14,0,1,$B29*10^5,2,D$8,1),FluidProperties($D$2,1,$B29*10^5,2,D$8,10,0,1))","v":6125.2183405855103},null,10.500000000000004,{"$f":"IF($D$2=11,[1]!HeCalc(14,0,1,G$8*10^5,2,$F29,1),FluidProperties($D$2,1,G$8*10^5,2,$F29,10,0,1))","v":5403.0162475688667},{"$f":"IF($D$2=11,[1]!HeCalc(14,0,1,H$8*10^5,2,$F29,1),FluidProperties($D$2,1,H$8*10^5,2,$F29,10,0,1))","v":6440.1744599850936}]
[null,22,{"$f":"IF($D$2=11,[1]!HeCalc(14,0,1,$B30*10^5,2,C$8,1),FluidProperties($D$2,1,$B30*10^5,2,C$8,10,0,1))","v":4848.1277037375758},{"$f":"IF($D$2=11,[1]!HeCalc(14,0,1,$B30*10^5,2,D$8,1),FluidProperties($D$2,1,$B30*10^5,2,D$8,10,0,1))","v":6146.8976379911337},null,10.800000000000004,{"$f":"IF($D$2=11,[1]!HeCalc(14,0,1,G$8*10^5,2,$F30,1),FluidProperties($D$2,1,G$8*10^5,2,$F30,10,0,1))","v":5391.0582704237831},{"$f":"IF($D$2=11,[1]!HeCalc(14,0,1,H$8*10^5,2,$F30,1),FluidProperties($D$2,1,H$8*10^5,2,$F30,10,0,1))","v":6344.536275160568}]
[null,23,{"$f":"IF($D$2=11,[1]!HeCalc(14,0,1,$B31*10^5,2,C$8,1),FluidProperties($D$2,1,$B31*10^5,2,C$8,10,0,1))","v":4752.6662825539561},{"$f":"IF($D$2=11,[1]!HeCalc(14,0,1,$B31*10^5,2,D$8,1),FluidProperties($D$2,1,$B31*10^5,2,D$8,10,0,1))","v":6166.1715689411067},null,11.100000000000005,{"$f":"IF($D$2=11,[1]!HeCalc(14,0,1,G$8*10^5,2,$F31,1),FluidProperties($D$2,1,G$8*10^5,2,$F31,10,0,1))","v":5380.1510910158977},{"$f":"IF($D$2=11,[1]!HeCalc(14,0,1,H$8*10^5,2,$F31,1),FluidProperties($D$2,1,H$8*10^5,2,$F31,10,0,1))","v":6261.1042024263143}]
[null,24,{"$f":"IF($D$2=11,[1]!HeCalc(14,0,1,$B32*10^5,2,C$8,1),FluidProperties($D$2,1,$B32*10^5,2,C$8,10,0,1))","v":4666.435529028121},{"$f":"IF($D$2=11,[1]!HeCalc(14,0,1,$B32*10^5,2,D$8,1),FluidProperties($D$2,1,$B32*10^5,2,D$8,10,0,1))","v":6183.1027209131671},null,11.400000000000006,{"$f":"IF($D$2=11,[1]!HeCalc(14,0,1,G$8*10^5,2,$F32,1),FluidProperties($D$2,1,G$8*10^5,2,$F32,10,0,1))","v":5370.1668446447575},{"$f":"IF($D$2=11,[1]!HeCalc(14,0,1,H$8*10^5,2,$F32,1),FluidProperties($D$2,1,H$8*10^5,2,$F32,10,0,1))","v":6187.7167412417539}]
[null,25,{"$f":"IF($D$2=11,[1]!HeCalc(14,0,1,$B33*10^5,2,C$8,1),FluidProperties($D$2,1,$B33*10^5,2,C$8,10,0,1))","v":4588.0377973183831},{"$f":"IF($D$2=11,[1]!HeCalc(14,0,1,$B33*10^5,2,D$8,1),FluidProperties($D$2,1,$B33*10^5,2,D$8,10,0,1))","v":6197.7651917511957},null,11.700000000000006,{"$f":"IF($D$2=11,[1]!HeCalc(14,0,1,G$8*10^5,2,$F33,1),FluidProperties($D$2,1,G$8*10^5,2,$F33,10,0,1))","v":5360.99749707316},{"$f":"IF($D$2=11,[1]!HeCalc(14,0,1,H$8*10^5,2,$F33,1),FluidProperties($D$2,1,H$8*10^5,2,$F33,10,0,1))","v":6122.6875585396383}]
[null,26,{"$f":"IF($D$2=11,[1]!HeCalc(14,0,1,$B34*10^5,2,C$8,1),FluidProperties($D$2,1,$B34*10^5,2,C$8,10,0,1))","v":4516.3449030200709},{"$f":"IF($D$2=11,[1]!HeCalc(14,0,1,$B34*10^5,2,D$8,1),FluidProperties($D$2,1,$B34*10^5,2,D$8,10,0,1))","v":6210.2420374929789},null,12.000000000000007,{"$f":"IF($D$2=11,[1]!HeCalc(14,0,1,G$8*10^5,2,$F34,1),FluidProperties($D$2,1,G$8*10^5,2,$F34,10,0,1))","v":5352.5511559112574},{"$f":"IF($D$2=11,[1]!HeCalc(14,0,1,H$8*10^5,2,$F34,1),FluidProperties($D$2,1,H$8*10^5,2,$F34,10,0,1))","v":6064.6836027956824}]
[null,27,{"$f":"IF($D$2=11,[1]!HeCalc(14,0,1,$B35*10^5,2,C$8,1),FluidProperties($D$2,1,$B35*10^5,2,C$8,10,0,1))","v":4450.4369457858647},{"$f":"IF($D$2=11,[1]!HeCalc(14,0,1,$B35*10^5,2,D$8,1),FluidProperties($D$2,1,$B35*10^5,2,D$8,10,0,1))","v":6220.6228897460705},null,12.300000000000008,{"$f":"IF($D$2=11,[1]!HeCalc(14,0,1,G$8*10^5,2,$F35,1),FluidProperties($D$2,1,G$8*10^5,2,$F35,10,0,1))","v":5344.7491719091813},{"$f":"IF($D$2=11,[1]!HeCalc(14,0,1,H$8*10^5,2,$F35,1),FluidProperties($D$2,1,H$8*10^5,2,$F35,10,0,1))","v":6012.638409856645}]
[null,28,{"$f":"IF($D$2=11,[1]!HeCalc(14,0,1,$B36*10^5,2,C$8,1),FluidProperties($D$2,1,$B36*10^5,2,C$8,10,0,1))","v":4389.5567688138535},{"$f":"IF($D$2=11,[1]!HeCalc(14,0,1,$B36*10^5,2,D$8,1),FluidProperties($D$2,1,$B36*10^5,2,D$8,10,0,1))","v":6229.0018309976895},null,12.600000000000009,{"$f":"IF($D$2=11,[1]!HeCalc(14,0,1,G$8*10^5,2,$F36,1),FluidProperties($D$2,1,G$8*10^5,2,$F36,10,0,1))","v":5337.5238395713777},{"$f":"IF($D$2=11,[1]!HeCalc(14,0,1,H$8*10^5,2,$F36,1),FluidProperties($D$2,1,H$8*10^5,2,$F36,10,0,1))","v":5965.6893978879634}]
[null,29,{"$f":"IF($D$2=11,[1]!HeCalc(14,0,1,$B37*10^5,2,C$8,1),FluidProperties($D$2,1,$B37*10^5,2,C$8,10,0,1))","v":4333.0756952571492},{"$f":"IF($D$2=11,[1]!HeCalc(14,0,1,$B37*10^5,2,D$8,1),FluidProperties($D$2,1,$B37*10^5,2,D$8,10,0,1))","v":6235.4755648547853},null,12.900000000000009,{"$f":"IF($D$2=11,[1]!HeCalc(14,0,1,G$8*10^5,2,$F37,1),FluidProperties($D$2,1,G$8*10^5,2,$F37,10,0,1))","v":5330.8165587482908},{"$f":"IF($D$2=11,[1]!HeCalc(14,0,1,H$8*10^5,2,$F37,1),FluidProperties($D$2,1,H$8*10^5,2,$F37,10,0,1))","v":5923.1318686265886}]
[null,30,{"$f":"IF($D$2=11,[1]!HeCalc(14,0,1,$B38*10^5,2,C$8,1),FluidProperties($D$2,1,$B38*10^5,2,C$8,10,0,1))","v":4280.4674732474205},{"$f":"IF($D$2=11,[1]!HeCalc(14,0,1,$B38*10^5,2,D$8,1),FluidProperties($D$2,1,$B38*10^5,2,D$8,10,0,1))","v":6240.1418941882994},null,13.20000000000001,{"$f":"IF($D$2=11,[1]!HeCalc(14,0,1,G$8*10^5,2,$F38,1),FluidProperties($D$2,1,G$8*10^5,2,$F38,10,0,1))","v":5324.5763536046488},{"$f":"IF($D$2=11,[1]!HeCalc(14,0,1,H$8*10^5,2,$F38,1),FluidProperties($D$2,1,H$8*10^5,2,$F38,10,0,1))","v":5884.3847893390412}]
[null,31,{"$f":"IF($D$2=11,[1]!HeCalc(14,0,1,$B39*10^5,2,C$8,1),FluidProperties($D$2,1,$B39*10^5,2,C$8,10,0,1))","v":4231.2882577932196},{"$f":"IF($D$2=11,[1]!HeCalc(14,0,1,$B39*10^5,2,D$8,1),FluidProperties($D$2,1,$B39*10^5,2,D$8,10,0,1))","v":6243.0984988128102},null,13.500000000000011,{"$f":"IF($D$2=11,[1]!HeCalc(14,0,1,G$8*10^5,2,$F39,1),FluidProperties($D$2,1,G$8*10^5,2,$F39,10,0,1))","v":5318.7586709374473},{"$f":"IF($D$2=11,[1]!HeCalc(14,0,1,H$8*10^5,2,$F39,1),FluidProperties($D$2,1,H$8*10^5,2,$F39,10,0,1))","v":5848.9650158372142}]
[null,32,{"$f":"IF($D$2=11,[1]!HeCalc(14,0,1,$B40*10^5,2,C$8,1),FluidProperties($D$2,1,$B40*10^5,2,C$8,10,0,1))","v":4185.161078435307},{"$f":"IF($D$2=11,[1]!HeCalc(14,0,1,$B40*10^5,2,D$8,1),FluidProperties($D$2,1,$B40*10^5,2,D$8,10,0,1))","v":6244.4419888541652},null,13.800000000000011,{"$f":"IF($D$2=11,[1]!HeCalc(14,0,1,G$8*10^5,2,$F40,1),FluidProperties($D$2,1,G$8*10^5,2,$F40,10,0,1))","v":5313.3243985556228},{"$f":"IF($D$2=11,[1]!HeCalc(14,0,1,H$8*10^5,2,$F40,1),FluidProperties($D$2,1,H$8*10^5,2,$F40,10,0,1))","v":5816.4676458710383}]
[null,33,{"$f":"IF($D$2=11,[1]!HeCalc(14,0,1,$B41*10^5,2,C$8,1),FluidProperties($D$2,1,$B41*10^5,2,C$8,10,0,1))","v":4141.7636740018988},{"$f":"IF($D$2=11,[1]!HeCalc(14,0,1,$B41*10^5,2,D$8,1),FluidProperties($D$2,1,$B41*10^5,2,D$8,10,0,1))","v":6244.2672001130504},null,14.100000000000012,{"$f":"IF($D$2=11,[1]!HeCalc(14,0,1,G$8*10^5,2,$F41,1),FluidProperties($D$2,1,G$8*10^5,2,$F41,10,0,1))","v":5308.2390582944399},{"$f":"IF($D$2=11,[1]!HeCalc(14,0,1,H$8*10^5,2,$F41,1),FluidProperties($D$2,1,H$8*10^5,2,$F41,10,0,1))","v":5786.5508818074204}]
[null,34,{"$f":"IF($D$2=11,[1]!HeCalc(14,0,1,$B42*10^5,2,C$8,1),FluidProperties($D$2,1,$B42*10^5,2,C$8,10,0,1))","v":4100.8188668057901},{"$f":"IF($D$2=11,[1]!HeCalc(14,0,1,$B42*10^5,2,D$8,1),FluidProperties($D$2,1,$B42*10^5,2,D$8,10,0,1))","v":6242.6666928295144},null,14.400000000000013,{"$f":"IF($D$2=11,[1]!HeCalc(14,0,1,G$8*10^5,2,$F42,1),FluidProperties($D$2,1,G$8*10^5,2,$F42,10,0,1))","v":5303.4721385824632},{"$f":"IF($D$2=11,[1]!HeCalc(14,0,1,H$8*10^5,2,$F42,1),FluidProperties($D$2,1,H$8*10^5,2,$F42,10,0,1))","v":5758.9242496892566}]
[null,35,{"$f":"IF($D$2=11,[1]!HeCalc(14,0,1,$B43*10^5,2,C$8,1),FluidProperties($D$2,1,$B43*10^5,2,C$8,10,0,1))","v":4062.0869617942221},{"$f":"IF($D$2=11,[1]!HeCalc(14,0,1,$B43*10^5,2,D$8,1),FluidProperties($D$2,1,$B43*10^5,2,D$8,10,0,1))","v":6239.7304143438496},null,14.700000000000014,{"$f":"IF($D$2=11,[1]!HeCalc(14,0,1,G$8*10^5,2,$F43,1),FluidProperties($D$2,1,G$8*10^5,2,$F43,10,0,1))","v":5298.9965392649056},{"$f":"IF($D$2=11,[1]!HeCalc(14,0,1,H$8*10^5,2,$F43,1),FluidProperties($D$2,1,H$8*10^5,2,$F43,10,0,1))","v":5733.3393442299275}]
[null,36,{"$f":"IF($D$2=11,[1]!HeCalc(14,0,1,$B44*10^5,2,C$8,1),FluidProperties($D$2,1,$B44*10^5,2,C$8,10,0,1))","v":4025.3594892031088},{"$f":"IF($D$2=11,[1]!HeCalc(14,0,1,$B44*10^5,2,D$8,1),FluidProperties($D$2,1,$B44*10^5,2,D$8,10,0,1))","v":6235.5454882025442},null,15.000000000000014,{"$f":"IF($D$2=11,[1]!HeCalc(14,0,1,G$8*10^5,2,$F44,1),FluidProperties($D$2,1,G$8*10^5,2,$F44,10,0,1))","v":5294.7881072938771},{"$f":"IF($D$2=11,[1]!HeCalc(14,0,1,H$8*10^5,2,$F44,1),FluidProperties($D$2,1,H$8*10^5,2,$F44,10,0,1))","v":5709.5824944101296}]
[null,37,{"$f":"IF($D$2=11,[1]!HeCalc(14,0,1,$B45*10^5,2,C$8,1),FluidProperties($D$2,1,$B45*10^5,2,C$8,10,0,1))","v":3990.4543130474476},{"$f":"IF($D$2=11,[1]!HeCalc(14,0,1,$B45*10^5,2,D$8,1),FluidProperties($D$2,1,$B45*10^5,2,D$8,10,0,1))","v":6230.1960962840385},null,15.300000000000015,{"$f":"IF($D$2=11,[1]!HeCalc(14,0,1,G$8*10^5,2,$F45,1),FluidProperties($D$2,1,G$8*10^5,2,$F45,10,0,1))","v":5290.8252464113111},{"$f":"IF($D$2=11,[1]!HeCalc(14,0,1,H$8*10^5,2,$F45,1),FluidProperties($D$2,1,H$8*10^5,2,$F45,10,0,1))","v":5687.4689034973835}]
[null,38,{"$f":"IF($D$2=11,[1]!HeCalc(14,0,1,$B46*10^5,2,C$8,1),FluidProperties($D$2,1,$B46*10^5,2,C$8,10,0,1))","v":3957.2115450610254},{"$f":"IF($D$2=11,[1]!HeCalc(14,0,1,$B46*10^5,2,D$8,1),FluidProperties($D$2,1,$B46*10^5,2,D$8,10,0,1))","v":6223.7634256516276},null,15.600000000000016,{"$f":"IF($D$2=11,[1]!HeCalc(14,0,1,G$8*10^5,2,$F46,1),FluidProperties($D$2,1,G$8*10^5,2,$F46,10,0,1))","v":5287.0885874266878},{"$f":"IF($D$2=11,[1]!HeCalc(14,0,1,H$8*10^5,2,$F46,1),FluidProperties($D$2,1,H$8*10^5,2,$F46,10,0,1))","v":5666.837931175035}]
[null,39,{"$f":"IF($D$2=11,[1]!HeCalc(14,0,1,$B47*10^5,2,C$8,1),FluidProperties($D$2,1,$B47*10^5,2,C$8,10,0,1))","v":3925.4902180094587},{"$f":"IF($D$2=11,[1]!HeCalc(14,0,1,$B47*10^5,2,D$8,1),FluidProperties($D$2,1,$B47*10^5,2,D$8,10,0,1))","v":6216.3256573761628},null,15.900000000000016,{"$f":"IF($D$2=11,[1]!HeCalc(14,0,1,G$8*10^5,2,$F47,1),FluidProperties($D$2,1,G$8*10^5,2,$F47,10,0,1))","v":5283.5607083865725},{"$f":"IF($D$2=11,[1]!HeCalc(14,0,1,H$8*10^5,2,$F47,1),FluidProperties($D$2,1,H$8*10^5,2,$F47,10,0,1))","v":5647.5492678475121}]
[null,40,{"$f":"IF($D$2=11,[1]!HeCalc(14,0,1,$B48*10^5,2,C$8,1),FluidProperties($D$2,1,$B48*10^5,2,C$8,10,0,1))","v":3895.165539482407},{"$f":"IF($D$2=11,[1]!HeCalc(14,0,1,$B48*10^5,2,D$8,1),FluidProperties($D$2,1,$B48*10^5,2,D$8,10,0,1))","v":6207.9579799825888},null,16.200000000000017,{"$f":"IF($D$2=11,[1]!HeCalc(14,0,1,G$8*10^5,2,$F48,1),FluidProperties($D$2,1,G$8*10^5,2,$F48,10,0,1))","v":5280.2258960357649},{"$f":"IF($D$2=11,[1]!HeCalc(14,0,1,H$8*10^5,2,$F48,1),FluidProperties($D$2,1,H$8*10^5,2,$F48,10,0,1))","v":5629.4798114165678}]
[null,null,null,null,null,16.500000000000018,{"$f":"IF($D$2=11,[1]!HeCalc(14,0,1,G$8*10^5,2,$F49,1),FluidProperties($D$2,1,G$8*10^5,2,$F49,10,0,1))","v":5277.069941620819},{"$f":"IF($D$2=11,[1]!HeCalc(14,0,1,H$8*10^5,2,$F49,1),FluidProperties($D$2,1,H$8*10^5,2,$F49,10,0,1))","v":5612.5211012923246}]

{"sheet":"Process_operations","index":7,"n_rows":38,"n_cols":11,"rows_kept":38,"cut":false,"hidden":false,"merged":[]}
[]
[null,"Fluid","Helium",{"$f":"VLOOKUP(C2,Fluids_table,2,FALSE)","v":11},null,null,null,null,null,"Diamètre","Surface"]
[null,"Critical pressure",{"$f":"IF($D$2=11,[1]!HeConst(5)/10^5,FConstant($D$2,5)/10^2)","v":2.2746230000000001},null,null,null,null,null,null,{"$f":"33.7-2*1.6","v":30.500000000000004},{"$f":"PI()*J3^2/4","v":730.61664150047648}]
[null,null,null,null,null,null,null,null,null,8,{"$f":"PI()*J4^2/4","v":50.26548245743669}]
[null,"Isenthalpic expansion"]
[null,"Inlet pressure",3,null,"Mixing","Fluid 1","Fluid 2","Fluid 3"]
[null,"Inlet Temperature",80.5,null,"Pressure",5,18,18]
[null,"Outlet pressure",1.3,null,"Temperature",4.55,310,80]
[null,"enthalpy",{"$f":"IF($D$2=11,[1]!HeCalc(9,0,1,$C6*10^5,2,C$7,1),FluidProperties($D$2,1,$C6*10^5,2,C$7,5,0,1))","v":434065.56365290144},null,"Mass flow",1013.669829893479,195,10]
[null,"Outlet Temperature",{"$f":"IF($D$2=11,[1]!HeCalc(2,0,1,$C8*10^5,9,C$9,1),FluidProperties($D$2,1,$C8*10^5,5,C$9,2,0,1))","v":80.581900501502901},null,"Enthalpy",{"$f":"IF($D$2=11,[1]!HeCalc(9,0,1,$F7*10^5,2,F$8,1),FluidProperties($D$2,1,$F7*10^5,2,F$8,5,0,1))","v":12673.314932116673},{"$f":"IF($D$2=11,[1]!HeCalc(9,0,1,$G7*10^5,2,G$8,1),FluidProperties($D$2,1,$G7*10^5,2,G$8,5,0,1))","v":1630923.2014422703},{"$f":"IF($D$2=11,[1]!HeCalc(9,0,1,$G7*10^5,2,H$8,1),FluidProperties($D$2,1,$G7*10^5,2,H$8,5,0,1))","v":435200.67345154297}]
[null,"Outlet vapour fraction",{"$f":"IF($D$2=11,[1]!HeCalc(0,0,1,$C8*10^5,9,C$9,1),FluidProperties($D$2,1,$C8*10^5,5,C$9,0,0,1))","v":2}]
[null,null,null,null,"Outlet Pressure",1.3]
[null,null,null,null,"enthalpie sortie",{"$f":"(F9*F10+G9*G10+H9*H10)/(F9+G9+H9)","v":275077.44902200863}]
[null,null,null,null,"Mixing Temperature",{"$f":"IF($D$2=11,[1]!HeCalc(2,0,1,$F12*10^5,9,F$13,1),FluidProperties($D$2,1,$F12*10^5,5,F$13,2,0,1))","v":50.000003935812266}]
[]
[]
[]
[]
[null,"Valeur cible mélange",50]
[]
[]
[]
[]
[]
[null,null,null,null,null,"HX1100 outlet","HX1100 intlet","HX1300 intlet","HX1400 intlet"]
[null,null,null,null,"Pressure",1.1000000000000001,1.1000000000000001,1.1000000000000001,1.1000000000000001]
[null,null,null,null,"Temperature 1",4.5,300,300,300]
[null,null,null,null,"Temperature 2",310,75,30,20]
[null,null,null,null,"Mass flow 1",300,{"$f":"F29","v":300},{"$f":"G29","v":300},300]
[null,null,null,null,"Mas flow 2",1000,{"$f":"F30","v":1000},{"$f":"G30","v":1000},1000]
[null,null,null,null,"Enthalpy 1",{"$f":"IF($D$2=11,[1]!HeCalc(9,0,1,F$26*10^5,2,F27,1),FluidProperties($D$2,1,F$26*10^5,2,F27,5,0,1))","v":32395.007204951202},{"$f":"IF($D$2=11,[1]!HeCalc(9,0,1,G$26*10^5,2,G27,1),FluidProperties($D$2,1,G$26*10^5,2,G27,5,0,1))","v":1573546.861778626},{"$f":"IF($D$2=11,[1]!HeCalc(9,0,1,H$26*10^5,2,H27,1),FluidProperties($D$2,1,H$26*10^5,2,H27,5,0,1))","v":1573546.861778626},{"$f":"IF($D$2=11,[1]!HeCalc(9,0,1,I$26*10^5,2,I27,1),FluidProperties($D$2,1,I$26*10^5,2,I27,5,0,1))","v":1573546.861778626}]
[null,null,null,null,"Enthalpy 2",{"$f":"IF($D$2=11,[1]!HeCalc(9,0,1,F$26*10^5,2,F28,1),FluidProperties($D$2,1,F$26*10^5,2,F28,5,0,1))","v":1625476.6232843562},{"$f":"IF($D$2=11,[1]!HeCalc(9,0,1,G$26*10^5,2,G28,1),FluidProperties($D$2,1,G$26*10^5,2,G28,5,0,1))","v":405012.3703293071},{"$f":"IF($D$2=11,[1]!HeCalc(9,0,1,H$26*10^5,2,H28,1),FluidProperties($D$2,1,H$26*10^5,2,H28,5,0,1))","v":170885.10702787587},{"$f":"IF($D$2=11,[1]!HeCalc(9,0,1,I$26*10^5,2,I28,1),FluidProperties($D$2,1,I$26*10^5,2,I28,5,0,1))","v":118542.43100144752}]
[null,null,null,null,"enthalpie sortie",{"$f":"(F29*F31+F30*F32)/(F29+F30)","v":1257842.4041891089},{"$f":"(G29*G31+G30*G32)/(G29+G30)","v":674674.17604838067},494576.28120112594,454312.68425771949]
[null,null,null,null,"Mixing Temperature",{"$f":"IF($D$2=11,[1]!HeCalc(2,0,1,$F26*10^5,9,F$33,1),FluidProperties($D$2,1,$F26*10^5,5,F$33,2,0,1))","v":239.20574662576209},{"$f":"IF($D$2=11,[1]!HeCalc(2,0,1,$F26*10^5,9,G$33,1),FluidProperties($D$2,1,$F26*10^5,5,G$33,2,0,1))","v":126.91197985997927},{"$f":"IF($D$2=11,[1]!HeCalc(2,0,1,$F26*10^5,9,H$33,1),FluidProperties($D$2,1,$F26*10^5,5,H$33,2,0,1))","v":92.238936408155183},{"$f":"IF($D$2=11,[1]!HeCalc(2,0,1,$F26*10^5,9,I$33,1),FluidProperties($D$2,1,$F26*10^5,5,I$33,2,0,1))","v":84.48860242681269}]
[null,null,null,null,"Nominal temperature",{"$f":"F28","v":310},{"$f":"G28","v":75},30,20]
[null,null,null,null,"Delta T",{"$f":"F35-F34","v":70.794253374237911},{"$f":"G35-G34","v":-51.911979859979269},-62.238936408155183,-64.48860242681269]
[]
[null,null,null,null,null,"Ok avec design flex à 223 K","almost ok ALPEMA","pas de contraction différentielle en dessous de 80 K","pas de contraction différentielle en dessous de 80 K"]