{"text_format":"1","workbook":"xlsx","n_sheets":8,"sheets":["Turbines_JT60SA (3)","Turbines_JT60SA","Turbines_JT60SA_serial_indep","Turbines_JT60SA_serial","Turbines_JT60SA_serial_Frein T1","Turbines_JT60SA (2)","Fluides","Turbines_Hefei"],"not_rendered":{"charts":37,"images":6,"macros":1,"external_links":3,"defined_names":189,"comments":0,"pivot_tables":0},"unopened":[],"bounds":{"document_bytes":16777216,"sheet_cells":100000,"rows_first":2000,"rows_last":500,"rows_between":2000,"halvings":0,"cell_chars":16384,"cell_head_chars":4096},"cells_cut":0,"cells_raw":0,"read":"whole","date_system":"1900"}

{"sheet":"Turbines_JT60SA (3)","index":0,"n_rows":162,"n_cols":15,"rows_kept":162,"cut":false,"hidden":false,"merged":[]}
[]
[]
[]
[]
[null,null,null,null,"Vitesse de la roue ajustée en fonction de la puissance du frein",null,null,null,null,null,null,{"$f":"D57*0.3","v":448.8}]
[]
[]
[null,"Relation entre la puissance et la vitesse de rotation",null,null,null,null,null,null,null,null,null,null,"²"]
[]
[null,"TURBINE 1"]
[]
[null,null,null,"DESIGN",null,"D3","STS","test",{"$f":"L43","v":"BAKING"}]
[]
[null,"m","g/s",191.5,null,67.345417854776343,69.557935752536167,0.90845978090574331,61.809582811214575]
[null,"Pin","Bara",14.77,null,14.77,12.39,8,9.25]
[null,"Tin","K",40.03,null,50.44,40.729999999999997,55,37.119999999999997]
[null,"Pout","Bara",6.36,null,6.4169999999999998,5.242,1.35,4.0599999999999996]
[null,"Tout","K",{"$f":"[2]!T2_turb(11,D15,D16,D17,D19)","v":31.094586910112792},null,{"$f":"[2]!T2_turb(11,F15,F16,F17,F19)","v":41.7925989903474},{"$f":"[2]!T2_turb(11,G15,G16,G17,G19)","v":32.514839363849774},{"$f":"[2]!T2_turb(11,H15,H16,H17,H19)","v":46.315036459366233},{"$f":"[2]!T2_turb(11,I15,I16,I17,I19)","v":29.372250640597315}]
[null,"Efficacity","%",0.78,null,{"$f":"(0.321*F42^4-1.6098*F42^3+1.316*F42^2+0.9448*F42)*($D$19/0.97215493)","v":0.60962117374688851},{"$f":"(0.321*G42^4-1.6098*G42^3+1.316*G42^2+0.9448*G42)*($D$19/0.97215493)","v":0.69285540878309548},{"$f":"(0.321*H42^4-1.6098*H42^3+1.316*H42^2+0.9448*H42)*($D$19/0.97215493)","v":0.31442797350118995},{"$f":"(0.321*I42^4-1.6098*I42^3+1.316*I42^2+0.9448*I42)*($D$19/0.97215493)","v":0.74204227260897582}]
[null,"Power","W",{"$f":"+D14*(D32-D33)","v":9122.4436160855366},null,3130.6846988691836,3033.7444400124818,41.979063361782089,2521.1033032527048]
[null,"Speed","Hz",1995,null,1391.6843277296848,1498.3350869984386,1000,1578.7177791475433]
[null,"Speed calculated from P=K.rho.N^3",null,null,null,{"$f":"(F20/$D20*$D25/F25)^(1/3)*$D21","v":1391.6843277597441},{"$f":"(G20/$D20*$D25/G25)^(1/3)*$D21","v":1498.3350870075271},{"$f":"(H20/$D20*$D25/H25)^(1/3)*$D21","v":999.99999950152608},{"$f":"(I20/$D20*$D25/I25)^(1/3)*$D21","v":1578.7177788178424}]
[null,null,null,null,null,{"$f":"(F21-F22)^2","v":9.0355878956924354E-16},{"$f":"(G21-G22)^2","v":8.2602296501395359E-17},2.4847625238103619E-13,1.0870269951045536E-13]
[null,null,null,null,null,{"$f":"[2]!MinimizeNonnegative(F23,F14,10)","v":"<<Minimize F23 by changing F14 (nonnegative)>>"},{"$f":"[2]!MinimizeNonnegative(G23,G14,10)","v":"<<Minimize G23 by changing G14 (nonnegative)>>"},{"$f":"[2]!MinimizeNonnegative(H23,H14,10)","v":"<<Minimize H23 by changing H14 (nonnegative)>>"},{"$f":"[2]!MinimizeNonnegative(I23,I14,10)","v":"<<Minimize I23 by changing I14 (nonnegative)>>"}]
[null,"Brake Pressure",null,5.2,null,{"$f":"($D25-$D17)+F17","v":5.2569999999999997},{"$f":"($D25-$D17)+G17","v":4.0819999999999999},{"$f":"($D25-$D17)+H17","v":0.18999999999999995},{"$f":"($D25-$D17)+I17","v":2.8999999999999995}]
[null,"Rho (brake)",null,{"$f":"[2]!rho_(11,D25,330)","v":0.75697464940773784},null,{"$f":"[2]!rho_(11,F25,330)","v":0.76525440749261975},{"$f":"[2]!rho_(11,G25,330)","v":0.59449703414110489},{"$f":"[2]!rho_(11,H25,330)","v":2.7715477303010091E-2},{"$f":"[2]!rho_(11,I25,330)","v":0.42255652641901498}]
[null,"Wheel","mm",35.799999999999997,null,{"$f":"$D$27","v":35.799999999999997},{"$f":"$D$27","v":35.799999999999997},{"$f":"$D$27","v":35.799999999999997},{"$f":"$D$27","v":35.799999999999997}]
[null,"a = mÖT/P",null,{"$f":"D14*D16^0.5/D15","v":82.031580287488268},null,{"$f":"+$D$28","v":82.031580287488268},{"$f":"+$D$28","v":82.031580287488268},{"$f":"+$D$28","v":82.031580287488268},{"$f":"+$D$28","v":82.031580287488268}]
[null,"Rho (in)","kg/m3",{"$f":"[2]!rho_(11,D15,D16)","v":17.087672541642732},null,{"$f":"[2]!rho_(11,F15,F16)","v":13.60304093359863},{"$f":"[2]!rho_(11,G15,G16)","v":14.178141597167654},{"$f":"[2]!rho_(11,H15,H16)","v":6.8737083497099274},{"$f":"[2]!rho_(11,I15,I16)","v":11.708162912666104}]
[null,"Sound Speed @inlet",null,{"$f":"[2]!Sound_speed(11,D15,D16)","v":391.2334216977045},null,{"$f":"[2]!Sound_speed(11,F15,F16)","v":435.3518858856504},{"$f":"[2]!Sound_speed(11,G15,G16)","v":391.28919888209964},{"$f":"[2]!Sound_speed(11,H15,H16)","v":445.49229392998768},{"$f":"[2]!Sound_speed(11,I15,I16)","v":370.51577371924787}]
[null,"S=Q/(rho*V) = cte",null,{"$f":"D14/(D29*D30)","v":2.8645071953707371E-2},null,1.1371862945007798E-2,1.2538036099885838E-2,2.96670530276763E-4,1.4248211523941401E-2]
[null,"Hin",null,{"$f":"[2]!H_(11,D15,D16)","v":223.57106614117126},null,{"$f":"[2]!H_(11,F15,F16)","v":279.05861768841004},{"$f":"[2]!H_(11,G15,G16)","v":227.21274224322462},{"$f":"[2]!H_(11,H15,H16)","v":302.11378504089129},{"$f":"[2]!H_(11,I15,I16)","v":207.89085729231627}]
[null,"Hout",null,{"$f":"[2]!H_(11,D17,D18)","v":175.9342848561293},null,{"$f":"[2]!H_(11,F17,F18)","v":232.57164353940124},{"$f":"[2]!H_(11,G17,G18)","v":183.59810061835628},{"$f":"[2]!H_(11,H17,H18)","v":255.90473512573868},{"$f":"[2]!H_(11,I17,I18)","v":167.10263015037086}]
[null,"Sin = Sout",null,{"$f":"[2]!S_(11,D15,D16)","v":15.488244062210457},null,{"$f":"[2]!S_(11,F15,F16)","v":16.720664436151374},{"$f":"[2]!S_(11,G15,G16)","v":15.956591869557485},{"$f":"[2]!S_(11,H15,H16)","v":18.465694482536527},{"$f":"[2]!S_(11,I15,I16)","v":16.084358655112414}]
[null,"Tout(iso)",null,{"$f":"[1]!HeCalc(2,0,1,D17*10^5,8,D34*1000,1)","v":28.580768861485691},null,{"$f":"[1]!HeCalc(2,0,1,F17*10^5,8,F34*1000,1)","v":36.153868894880652},{"$f":"[1]!HeCalc(2,0,1,G17*10^5,8,G34*1000,1)","v":28.875086473743544},{"$f":"[1]!HeCalc(2,0,1,H17*10^5,8,H34*1000,1)","v":26.999291724623038},{"$f":"[1]!HeCalc(2,0,1,I17*10^5,8,I34*1000,1)","v":26.699737772795068}]
[null,"Hout(iso)",null,{"$f":"[2]!H_(11,D17,D35)","v":162.49826962188638},null,{"$f":"[2]!H_(11,F17,F35)","v":202.80310664162681},{"$f":"[2]!H_(11,G17,G35)","v":164.26361740133086},{"$f":"[2]!H_(11,H17,H35)","v":155.15151129466645},{"$f":"[2]!H_(11,I17,I35)","v":152.92333233105427}]
[null,"ΔHs",null,{"$f":"D32-D36","v":61.072796519284879},null,76.255511046783226,62.949124841893763,146.96227374622484,54.967524961262001]
[null,"u1","m/s",{"$f":"(2*52.7%*D37*1000*D19)^0.5","v":224.07402231056255},null,{"$f":"PI()*$D$39*F21","v":156.31092987516874},{"$f":"PI()*$D$39*G21","v":168.28970912921642},{"$f":"PI()*$D$39*H21","v":112.3178056694549},{"$f":"PI()*$D$39*I21","v":177.31811672520718}]
[null,"D1",null,{"$f":"D38/PI()/D21","v":3.5751867939057311E-2},null,null,null,null,null,null,null,null,"T1"]
[null,"Co = (2*ΔHs)^0,5",null,{"$f":"(2000*D37)^0.5","v":349.49333761685608},null,390.52659588505168,354.82143351802682,542.14808631263259,331.56454865157707,null,null,"MAX",{"$f":"ROUND(F14,0)&\"g/s @ \"&F15&\" b ; \"&F16&\"K\"","v":"67g/s @ 14,77 b ; 50,44K"}]
[null,"u1/Co",null,{"$f":"D38/D40","v":0.64113961038138956},null,0.40025681098855964,0.4742940905813865,0.20717181984976377,0.53479214664635644,null,null,"MIN",{"$f":"ROUND(G14,0)&\"g/s @ \"&G15&\" b ; \"&G16&\"K\"","v":"70g/s @ 12,39 b ; 40,73K"}]
[null,"U1/C0 off de / U1/C0 nom",null,{"$f":"D41/$D$41","v":1},null,{"$f":"F41/$D41","v":0.62428963131830539},{"$f":"G41/$D41","v":0.73976725646267116},{"$f":"H41/$D41","v":0.32313058886897528},{"$f":"I41/$D41","v":0.83412744741855671},null,null,"STS",{"$f":"ROUND(H14,0)&\"g/s @ \"&H15&\" b ; \"&H16&\"K\"","v":"1g/s @ 8 b ; 55K"}]
[null,"Rdt",null,{"$f":"(0.321*D42^4-1.6098*D42^3+1.316*D42^2+0.9448*D42)*($D19/0.97215493)","v":0.77987569327041328},null,{"$f":"(0.321*F42^4-1.6098*F42^3+1.316*F42^2+0.9448*F42)*($D19/0.97215493)","v":0.60962117374688851},{"$f":"(0.321*G42^4-1.6098*G42^3+1.316*G42^2+0.9448*G42)*($D19/0.97215493)","v":0.69285540878309548},{"$f":"(0.321*H42^4-1.6098*H42^3+1.316*H42^2+0.9448*H42)*($D19/0.97)","v":0.31512649955576411},{"$f":"(0.321*I42^4-1.6098*I42^3+1.316*I42^2+0.9448*I42)*($D19/0.97215493)","v":0.74204227260897582},null,null,"BAKING",{"$f":"ROUND(I14,0)&\"g/s @ \"&I15&\" b ; \"&I16&\"K\"","v":"62g/s @ 9,25 b ; 37,12K"}]
[]
[]
[null,"TURBINE 2"]
[]
[null,null,null,"DESIGN",null,{"$f":"F12","v":"D3"},{"$f":"G12","v":"STS"},{"$f":"H12","v":"test"},{"$f":"I12","v":"BAKING"}]
[]
[null,"m","g/s",191.20000000000002,null,147.65576392196238,139.78651051088491,3607.1978289590434,106.84599326263165]
[null,"Pin","Bara",6.3070000000000004,null,6.4169999999999998,5.242,1.35,4.0599999999999996]
[null,"Tin","K",18.21,null,22.92,17.75,30,17.170000000000002]
[null,"Pout","Bara",1.35,null,1.35,1.29,1.3,1.35]
[null,"Tout","K",{"$f":"[2]!T2_turb(11,D51,D52,D53,D55)","v":11.618357475588732},null,{"$f":"[2]!T2_turb(11,F51,F52,F53,F55)","v":14.934394415965505},{"$f":"[2]!T2_turb(11,G51,G52,G53,G55)","v":11.85507099059971},{"$f":"[2]!T2_turb(11,H51,H52,H53,H55)","v":29.775889818722707},{"$f":"[2]!T2_turb(11,I51,I52,I53,I55)","v":12.550937597957923}]
[null,"Efficacity","%",0.76,null,{"$f":"(0.321*F78^4-1.6098*F78^3+1.316*F78^2+0.9448*F78)*($D$55/0.97215493)","v":0.73617440710513871},{"$f":"(0.321*G78^4-1.6098*G78^3+1.316*G78^2+0.9448*G78)*($D$55/0.97215493)","v":0.74840735754157472},{"$f":"(0.321*H78^4-1.6098*H78^3+1.316*H78^2+0.9448*H78)*($D$55/0.97215493)","v":0.49670786028564828},{"$f":"(0.321*I78^4-1.6098*I78^3+1.316*I78^2+0.9448*I78)*($D$55/0.97215493)","v":0.73148870755398121}]
[null,"Power","W",{"$f":"+D50*(D68-D69)","v":6144.650345780522},null,5952.7771431597212,4033.0904576676608,4195.0329095947209,2429.8013634683612]
[null,"Speed","Hz",1496,null,1480.2636567352852,1303.3718922863225,1320.034490255443,1098.0517093965677]
[null,null,null,null,null,{"$f":"(F56/$D56*$D61/F61)^(1/3)*$D57","v":1480.2636568438188},{"$f":"(G56/$D56*$D61/G61)^(1/3)*$D57","v":1303.371892286425},{"$f":"(H56/$D56*$D61/H61)^(1/3)*$D57","v":1320.0344902585687},{"$f":"(I56/$D56*$D61/I61)^(1/3)*$D57","v":1098.0517093987837}]
[null,null,null,null,null,{"$f":"(F57-F58)^2","v":1.1779551172576904E-14},{"$f":"(G57-G58)^2","v":1.0515585235868649E-20},{"$f":"(H57-H58)^2","v":9.7700374753060427E-18},{"$f":"(I57-I58)^2","v":4.9105843829958036E-18}]
[null,null,null,null,null,{"$f":"[2]!MinimizeNonnegative(F59,F50,10)","v":"<<Minimize F59 by changing F50 (nonnegative)>>"},{"$f":"[2]!MinimizeNonnegative(G59,G50,10)","v":"<<Minimize G59 by changing G50 (nonnegative)>>"},{"$f":"[2]!MinimizeNonnegative(H59,H50,10)","v":"<<Minimize H59 by changing H50 (nonnegative)>>"},{"$f":"[2]!MinimizeNonnegative(I59,I50,10)","v":"<<Minimize I59 by changing I50 (nonnegative)>>"}]
[null,"Brake Pressure",null,8,null,{"$f":"($D61-$D53)+F53","v":8},{"$f":"($D61-$D53)+G53","v":7.94},{"$f":"($D61-$D53)+H53","v":7.95},{"$f":"($D61-$D53)+I53","v":8}]
[null,"Rho (brake)",null,{"$f":"[2]!rho_(11,D61,330)","v":1.1632432504804469},null,{"$f":"[2]!rho_(11,F61,330)","v":1.1632432504804469},{"$f":"[2]!rho_(11,G61,330)","v":1.1545472550104166},{"$f":"[2]!rho_(11,H61,330)","v":1.1559966172478962},{"$f":"[2]!rho_(11,I61,330)","v":1.1632432504804469}]
[null,"Wheel","mm",39.5,null,{"$f":"$D$27","v":35.799999999999997},{"$f":"$D$27","v":35.799999999999997},{"$f":"$D$27","v":35.799999999999997},{"$f":"$D$27","v":35.799999999999997}]
[null,"a = mÖT/P",null,{"$f":"D50*D52^0.5/D51","v":129.36596422035444},null,{"$f":"$D$64","v":129.36596422035444},{"$f":"$D$64","v":129.36596422035444},129.36596422035444,129.36596422035444]
[null,"Rho (in)","kg/m3",{"$f":"[2]!rho_(11,D51,D52)","v":16.817250243896773},null,{"$f":"[2]!rho_(11,F51,F52)","v":13.375291153857948},{"$f":"[2]!rho_(11,G51,G52)","v":14.359191477750651},{"$f":"[2]!rho_(11,H51,H52)","v":2.159549883675286},{"$f":"[2]!rho_(11,I51,I52)","v":11.505933047185708}]
[null,"Sound Speed",null,{"$f":"[2]!Sound_speed(11,D51,D52)","v":258.39146376447951},null,{"$f":"[2]!Sound_speed(11,F51,F52)","v":290.04823018762818},{"$f":"[2]!Sound_speed(11,G51,G52)","v":253.64425936604641},{"$f":"[2]!Sound_speed(11,H51,H52)","v":324.04409152255937},{"$f":"[2]!Sound_speed(11,I51,I52)","v":247.92823053689861}]
[null,"S=Q/(rho*V) = cte",null,{"$f":"D50/(D65*D66)","v":4.4000208975996838E-2},null,3.8060714814528475E-2,3.8380465640558796E-2,5.1546907273289992,3.7455053117586443E-2]
[null,"Hin",null,{"$f":"[2]!H_(11,D51,D52)","v":105.90220745591094},null,{"$f":"[2]!H_(11,F51,F52)","v":131.89535213089164},{"$f":"[2]!H_(11,G51,G52)","v":103.97945828770561},{"$f":"[2]!H_(11,H51,H52)","v":170.84491042210561},{"$f":"[2]!H_(11,I51,I52)","v":101.54892418840952}]
[null,"Hout",null,{"$f":"[2]!H_(11,D53,D54)","v":73.764914852456329},null,{"$f":"[2]!H_(11,F53,F54)","v":91.580114953250359},{"$f":"[2]!H_(11,G53,G54)","v":75.12767249716174},{"$f":"[2]!H_(11,H53,H54)","v":169.68194872482457},{"$f":"[2]!H_(11,I53,I54)","v":78.807768537436118}]
[null,"Sin = Sout",null,{"$f":"[2]!S_(11,D51,D52)","v":13.041567593259808},null,{"$f":"[2]!S_(11,F51,F52)","v":14.275813975533033},{"$f":"[2]!S_(11,G51,G52)","v":13.315255392328808},{"$f":"[2]!S_(11,H51,H52)","v":19.01686410394105},{"$f":"[2]!S_(11,I51,I52)","v":13.701310752755484}]
[null,"Tout(iso)",null,{"$f":"[1]!HeCalc(2,0,1,D53*10^5,8,D70*1000,1)","v":9.7639107105745424},null,{"$f":"[1]!HeCalc(2,0,1,F53*10^5,8,F70*1000,1)","v":12.240423559213966},{"$f":"[1]!HeCalc(2,0,1,G53*10^5,8,G70*1000,1)","v":10.073861840183332},{"$f":"[1]!HeCalc(2,0,1,H53*10^5,8,H70*1000,1)","v":29.550386617947556},{"$f":"[1]!HeCalc(2,0,1,I53*10^5,8,I70*1000,1)","v":11.010714114185083}]
[null,"Hout(iso)",null,{"$f":"[2]!H_(11,D53,D71)","v":63.616296135548602},null,{"$f":"[2]!H_(11,F53,F71)","v":77.132191677960307},{"$f":"[2]!H_(11,G53,G71)","v":65.428546809061586},{"$f":"[2]!H_(11,H53,H71)","v":168.50357099451483},{"$f":"[2]!H_(11,I53,I71)","v":70.460056491444234}]
[null,"ΔHs",null,{"$f":"D68-D72","v":42.285911320362338},null,54.763160452931331,38.550911478644025,2.341339427590782,31.088867696965281]
[null,"u1","m/s",{"$f":"(2*52.7%*D73*1000*D55)^0.5","v":184.04539223806461},null,{"$f":"PI()*$D$75*F57","v":182.10942868957045},{"$f":"PI()*$D$75*G57","v":160.34732028603256},162.39723631473041,135.08780585131595]
[null,"D1",null,{"$f":"D74/PI()/D57","v":3.9160072096222902E-2},null,null,null,null,null,null,null,null,"T2"]
[null,"Co = (2*ΔHs)^0,5",null,{"$f":"(2000*D73)^0.5","v":290.81234953269205},null,330.94761051541474,277.67215012904705,68.430101966762876,249.35463780313083,null,null,"MAX",{"$f":"ROUND(F50,0)&\"g/s @ \"&F51&\" b ; \"&F52&\"K\"","v":"148g/s @ 6,417 b ; 22,92K"}]
[null,"u1/Co",null,{"$f":"D74/D76","v":0.6328664946100403},null,0.55026663708480905,0.57746994148139008,2.3731841930267503,0.54174972256970721,null,null,"MIN",{"$f":"ROUND(G50,0)&\"g/s @ \"&G51&\" b ; \"&G52&\"K\"","v":"140g/s @ 5,242 b ; 17,75K"}]
[null,"U1/C0 off de / U1/C0 nom",null,{"$f":"D77/$D$41","v":0.98709623358564935},null,{"$f":"F77/$D77","v":0.86948296642544232},{"$f":"G77/$D77","v":0.9124672366123846},{"$f":"H77/$D77","v":3.7498970371137426},{"$f":"I77/$D77","v":0.85602528682375989},null,null,"STS",{"$f":"ROUND(H50,0)&\"g/s @ \"&H51&\" b ; \"&H52&\"K\"","v":"3607g/s @ 1,35 b ; 30K"}]
[null,"Rdt",null,{"$f":"(0.321*D78^4-1.6098*D78^3+1.316*D78^2+0.9448*D78)*($D55/0.97215493)","v":0.75935604730996153},null,{"$f":"(0.321*F78^4-1.6098*F78^3+1.316*F78^2+0.9448*F78)*($D55/0.97215493)","v":0.73617440710513871},{"$f":"(0.321*G78^4-1.6098*G78^3+1.316*G78^2+0.9448*G78)*($D55/0.97215493)","v":0.74840735754157472},{"$f":"(0.321*H78^4-1.6098*H78^3+1.316*H78^2+0.9448*H78)*($D55/0.97215493)","v":0.49670786028564828},{"$f":"(0.321*I78^4-1.6098*I78^3+1.316*I78^2+0.9448*I78)*($D55/0.97215493)","v":0.73148870755398121},null,null,"BAKING",{"$f":"ROUND(I50,0)&\"g/s @ \"&I51&\" b ; \"&I52&\"K\"","v":"107g/s @ 4,06 b ; 17,17K"}]
[]
[null,"TURBINE 3"]
[]
[null,null,null,"DESIGN",null,{"$f":"F48","v":"D3"},{"$f":"G48","v":"STS"},{"$f":"H48","v":"test"},{"$f":"I48","v":"BAKING"}]
[]
[null,"m","g/s",399.8,null,161.47618406628206,95.080419991445567,{"$f":"H99/(H88*H87)^0.5*H86","v":{"$error":"#DIV/0!"}},117.10102843091981]
[null,"Pin","Bara",13.07,null,13.07,7.3689999999999998,null,10.48]
[null,"Tin","K",7.2919999999999998,null,9.16,7.9119999999999999,null,10.55]
[null,"Pout","Bara",4.88,null,4.88,5.18,null,5.18]
[null,"Tout","K",{"$f":"[2]!T2_turb(11,D86,D87,D88,D90)","v":6.1198408797506243},null,{"$f":"[2]!T2_turb(11,F86,F87,F88,F90)","v":7.0494463059442776},{"$f":"[2]!T2_turb(11,G86,G87,G88,G90)","v":7.1447253899950391},{"$f":"[2]!T2_turb(11,H86,H87,H88,H90)","v":{"$error":"#VALUE!"}},{"$f":"[2]!T2_turb(11,I86,I87,I88,I90)","v":8.6903815136344829}]
[null,"Efficacity","%",0.72,null,{"$f":"(0.321*F113^4-1.6098*F113^3+1.316*F113^2+0.9448*F113)*($D$90/0.97215493)","v":0.58179731360313081},{"$f":"(0.321*G113^4-1.6098*G113^3+1.316*G113^2+0.9448*G113)*($D$90/0.97215493)","v":0.582724483494652},{"$f":"(0.321*H113^4-1.6098*H113^3+1.316*H113^2+0.9448*H113)*($D$90/0.97215493)","v":{"$error":"#VALUE!"}},{"$f":"(0.321*I113^4-1.6098*I113^3+1.316*I113^2+0.9448*I113)*($D$90/0.97215493)","v":0.50201641458397539}]
[null,"Power","W",{"$f":"+D85*(D103-D104)","v":2075.5404202052005},null,954.74185473887155,182.51410423953638,{"$error":"#DIV/0!"},610.67834924716556]
[null,"Speed","Hz",2076,null,1602.552519659416,914.20818650847264,862.66257848011605,1367.3629344539765]
[null,null,null,null,null,{"$f":"(F91/$D91*$D96/F96)^(1/3)*$D92","v":1602.5525195994408},{"$f":"(G91/$D91*$D96/G96)^(1/3)*$D92","v":914.20818644693759},{"$f":"(H91/$D91*$D96/H96)^(1/3)*$D92","v":{"$error":"#DIV/0!"}},{"$f":"(I91/$D91*$D96/I96)^(1/3)*$D92","v":1367.3629344528813}]
[null,null,null,null,null,{"$f":"(F92-F93)^2","v":3.5970322758398785E-15},{"$f":"(G92-G93)^2","v":3.7865620437399795E-15},{"$f":"(H92-H93)^2","v":{"$error":"#DIV/0!"}},{"$f":"(I92-I93)^2","v":1.199592265274215E-18}]
[null,null,null,null,null,{"$f":"[2]!MinimizeNonnegative(F94,F85,10)","v":"<<Minimize F94 by changing F85 (nonnegative)>>"},{"$f":"[2]!MinimizeNonnegative(G94,G85,10)","v":"<<Minimize G94 by changing G85 (nonnegative)>>"},{"$f":"[2]!MinimizeNonnegative(H94,H85,10)","v":"Error.  The first parameter \"H94\" references a cell with an error."},{"$f":"[2]!MinimizeNonnegative(I94,I85,10)","v":"<<Minimize I94 by changing I85 (nonnegative)>>"}]
[null,"Brake Pressure",null,10.1,null,{"$f":"($D96-$D88)+F88","v":10.1},{"$f":"($D96-$D88)+G88","v":10.399999999999999},{"$f":"($D96-$D88)+H88","v":5.22},{"$f":"($D96-$D88)+I88","v":10.399999999999999}]
[null,"Rho (brake)",null,{"$f":"[2]!rho_(11,D96,330)","v":1.4673342046153373},null,{"$f":"[2]!rho_(11,F96,330)","v":1.4673342046153373},{"$f":"[2]!rho_(11,G96,330)","v":1.5107331217743123},{"$f":"[2]!rho_(11,H96,330)","v":0.75987987169063398},{"$f":"[2]!rho_(11,I96,330)","v":1.5107331217743123}]
[null,"Wheel","mm",29.5,null,{"$f":"$D$98","v":29.5},{"$f":"$D$98","v":29.5},{"$f":"$D$98","v":29.5},{"$f":"$D$98","v":29.5}]
[null,"a = mÖT/P",null,{"$f":"D85*D87^0.5/D86","v":82.601994178997316},null,{"$f":"$D$99","v":82.601994178997316},{"$f":"$D$99","v":82.601994178997316},82.601994178997316,82.601994178997316]
[null,"Rho (in)","kg/m3",{"$f":"[2]!rho_(11,D86,D87)","v":122.0413850208848},null,{"$f":"[2]!rho_(11,F86,F87)","v":92.042022544510019},{"$f":"[2]!rho_(11,G86,G87)","v":70.649649504414128},{"$f":"[2]!rho_(11,H86,H87)","v":"NUM"},{"$f":"[2]!rho_(11,I86,I87)","v":58.789985568547117}]
[null,"Sound Speed",null,{"$f":"[2]!Sound_speed(11,D86,D87)","v":249.05671288435045},null,{"$f":"[2]!Sound_speed(11,F86,F87)","v":219.03534618547846},{"$f":"[2]!Sound_speed(11,G86,G87)","v":170.78644408370695},{"$f":"[2]!Sound_speed(11,H86,H87)","v":"NUM"},{"$f":"[2]!Sound_speed(11,I86,I87)","v":204.26692373410398}]
[null,"S=Q/(rho*V) = cte",null,{"$f":"D85/(D100*D101)","v":1.3153381307708404E-2},null,8.0095500761739168E-3,7.8800266007113106E-3,{"$error":"#DIV/0!"},9.7512279128772247E-3]
[null,"Hin",null,{"$f":"[2]!H_(11,D86,D87)","v":28.150884578454882},null,{"$f":"[2]!H_(11,F86,F87)","v":40.890140453818937},{"$f":"[2]!H_(11,G86,G87)","v":36.811643961665368},{"$f":"[2]!H_(11,H86,H87)","v":{"$error":"#VALUE!"}},{"$f":"[2]!H_(11,I86,I87)","v":54.059832308617963}]
[null,"Hout",null,{"$f":"[2]!H_(11,D88,D89)","v":22.959437804554931},null,{"$f":"[2]!H_(11,F88,F89)","v":34.977554271159498},{"$f":"[2]!H_(11,G88,G89)","v":34.892067835939827},{"$f":"[2]!H_(11,H88,H89)","v":{"$error":"#VALUE!"}},{"$f":"[2]!H_(11,I88,I89)","v":48.844862317065612}]
[null,"Sin = Sout",null,{"$f":"[2]!S_(11,D86,D87)","v":5.0600046690749361},null,{"$f":"[2]!S_(11,F86,F87)","v":6.606972813997622},{"$f":"[2]!S_(11,G86,G87)","v":6.9458302073485418},{"$f":"[2]!S_(11,H86,H87)","v":{"$error":"#VALUE!"}},{"$f":"[2]!S_(11,I86,I87)","v":8.3000204511344844}]
[null,"Tout(iso)",null,{"$f":"[1]!HeCalc(2,0,1,D88*10^5,8,D105*1000,1)","v":5.9351387842537191},null,{"$f":"[1]!HeCalc(2,0,1,F88*10^5,8,F105*1000,1)","v":6.6999950291002683},{"$f":"[1]!HeCalc(2,0,1,G88*10^5,8,G105*1000,1)","v":7.0241819850115181},{"$f":"[1]!HeCalc(2,0,1,H88*10^5,8,H105*1000,1)","v":{"$error":"#VALUE!"}},{"$f":"[1]!HeCalc(2,0,1,I88*10^5,8,I105*1000,1)","v":8.0488946725573083}]
[null,"Hout(iso)",null,{"$f":"[2]!H_(11,D88,D106)","v":20.940541836947467},null,{"$f":"[2]!H_(11,F88,F106)","v":30.727518437529557},{"$f":"[2]!H_(11,G88,G106)","v":33.517503797489027},{"$f":"[2]!H_(11,H88,H106)","v":{"$error":"#VALUE!"}},{"$f":"[2]!H_(11,I88,I106)","v":43.671785543492518}]
[null,"ΔHs",null,{"$f":"D103-D107","v":7.2103427415074144},null,10.162622016289379,3.2941401641763406,{"$error":"#VALUE!"},10.388046765125445]
[null,"u1","m/s",{"$f":"(2*52.7%*D108*1000*D90)^0.5","v":73.971514109656738},null,{"$f":"PI()*$D$110*F92","v":57.101751598965535},{"$f":"PI()*$D$110*G92","v":32.574838038282842},30.738177791866459,48.72153497060885]
[null,"D1",null,{"$f":"D109/PI()/D92","v":1.1341938457171245E-2},null,null,null,null,null,null,null,null,"T3"]
[null,"Co = (2*ΔHs)^0,5",null,{"$f":"(2000*D108)^0.5","v":120.0861585821398},null,142.56663015088333,81.16822240478524,{"$error":"#VALUE!"},144.13914641848999,null,null,"MAX",{"$f":"ROUND(F85,0)&\"g/s @ \"&F86&\" b ; \"&F87&\"K\"","v":"161g/s @ 13,07 b ; 9,16K"}]
[null,"u1/Co",null,{"$f":"D109/D111","v":0.61598701285010871},null,0.40052676799986592,0.40132501455843644,{"$error":"#VALUE!"},0.33801736850273811,null,null,"MIN",{"$f":"ROUND(G85,0)&\"g/s @ \"&G86&\" b ; \"&G87&\"K\"","v":"95g/s @ 7,369 b ; 7,912K"}]
[null,"U1/C0 off de / U1/C0 nom",null,{"$f":"D112/$D$41","v":0.96076892283052273},null,{"$f":"F112/$D112","v":0.65021950080841751},{"$f":"G112/$D112","v":0.65151538293242062},{"$f":"H112/$D112","v":{"$error":"#VALUE!"}},{"$f":"I112/$D112","v":0.54874106344996854},null,null,"STS",{"$f":"ROUND(H85,0)&\"g/s @ \"&H86&\" b ; \"&H87&\"K\"","v":{"$error":"#DIV/0!"}}]
[null,"Rdt",null,{"$f":"(0.321*D113^4-1.6098*D113^3+1.316*D113^2+0.9448*D113)*($D90/0.97215493)","v":0.7171786087866604},null,{"$f":"(0.321*F113^4-1.6098*F113^3+1.316*F113^2+0.9448*F113)*($D90/0.97215493)","v":0.58179731360313081},{"$f":"(0.321*G113^4-1.6098*G113^3+1.316*G113^2+0.9448*G113)*($D90/0.97215493)","v":0.582724483494652},{"$f":"(0.321*H113^4-1.6098*H113^3+1.316*H113^2+0.9448*H113)*($D90/0.97215493)","v":{"$error":"#VALUE!"}},{"$f":"(0.321*I113^4-1.6098*I113^3+1.316*I113^2+0.9448*I113)*($D90/0.97215493)","v":0.50201641458397539},null,null,"BAKING",{"$f":"ROUND(I85,0)&\"g/s @ \"&I86&\" b ; \"&I87&\"K\"","v":"117g/s @ 10,48 b ; 10,55K"}]
[]
[null,null,null,null,null,null,null,null,null,null,null,null,{"$f":"M39","v":"T1"},{"$f":"M110","v":"T3"},"T1+T2"]
[null,"Courbe de rendement TC3",null,null,null,null,null,null,null,null,null,{"$f":"L111","v":"MAX"},{"$f":"M40","v":"67g/s @ 14,77 b ; 50,44K"},{"$f":"M111","v":"161g/s @ 13,07 b ; 9,16K"},{"$f":"F85+F50","v":309.13194798824441}]
[null,null,null,null,null,null,null,null,null,null,null,{"$f":"L112","v":"MIN"},{"$f":"M41","v":"70g/s @ 12,39 b ; 40,73K"},{"$f":"M112","v":"95g/s @ 7,369 b ; 7,912K"},{"$f":"G85+G50","v":234.86693050233049}]
[null,null,null,null,null,null,null,null,null,null,null,{"$f":"L113","v":"STS"},{"$f":"M42","v":"1g/s @ 8 b ; 55K"},{"$f":"M113","v":{"$error":"#DIV/0!"}},{"$f":"H85+H50","v":{"$error":"#DIV/0!"}}]
[null,null,null,null,null,null,null,null,null,null,null,{"$f":"L114","v":"BAKING"},{"$f":"M43","v":"62g/s @ 9,25 b ; 37,12K"},{"$f":"M114","v":"117g/s @ 10,48 b ; 10,55K"},{"$f":"I85+I50","v":223.94702169355145}]
[null,null,null,null,"d : mm"]
[null,null,null,null,"N : Hz"]
[null,null,null,null,"H : J/kG"]
[]
[]
[]
[]
[]
[null,"rendement=(0,321*rap^4 - 1,6098*rap^3 + 1,316*rap^2 + 0,9448*rap)*(ETAgar/0,97)",null,null,null,null,null,null,"U1/CO _nom",0.64]
[null,null,null,null,null,null,null,null,"Eta_gar",0.8]
[null,"U1/C0",{"$f":"D19","v":0.78},{"$f":"D55","v":0.76},{"$f":"D90","v":0.72}]
[null,0,{"$f":"(0.321*B132^4-1.6098*B132^3+1.316*B132^2+0.9448*B132)*$D$19/0.97215493","v":0}]
[null,{"$f":"B132+0.05","v":0.05},{"$f":"(0.321*$B133^4-1.6098*$B133^3+1.316*$B133^2+0.9448*$B133)*$C$131/0.97215493","v":4.0382461852042459E-2},{"$f":"(0.321*$B133^4-1.6098*$B133^3+1.316*$B133^2+0.9448*$B133)*$D$131/0.97215493","v":3.9347014112246496E-2},{"$f":"(0.321*$B133^4-1.6098*$B133^3+1.316*$B133^2+0.9448*$B133)*$E$131/0.97215493","v":3.7276118632654578E-2}]
[null,0.1,{"$f":"(0.321*$B134^4-1.6098*$B134^3+1.316*$B134^2+0.9448*$B134)*$C$131/0.97215493","v":8.5098158171146673E-2},{"$f":"(0.321*$B134^4-1.6098*$B134^3+1.316*$B134^2+0.9448*$B134)*$D$131/0.97215493","v":8.2916154115476232E-2},{"$f":"(0.321*$B134^4-1.6098*$B134^3+1.316*$B134^2+0.9448*$B134)*$E$131/0.97215493","v":7.8552146004135376E-2}]
[null,0.15000000000000002,0.13323633134792623,0.12982001515951785,0.12298738278270113]
[null,0.2,0.18392485650409657,0.17920883454245307,0.16977679061916603]
[null,0.25,0.23633024149247489,0.23027049171061653,0.21815099214689987]
[null,0.3,0.28965762689698032,0.28223050825859619,0.26737627098182798]
[null,0.35,0.34315078603263366,0.33435204792923284,0.3167545717224311]
[null,0.39999999999999997,0.39609212494555779,0.38593591661362037,0.36562349994974563]
[null,0.44999999999999996,0.4478026824129771,0.43632056235110589,0.41335632222736346]
[null,0.49999999999999994,0.49764212994321799,0.48488207532928934,0.45936196610143198]
[null,0.54999999999999993,0.54500877177570861,0.53103418788402379,0.50308502010065403]
[null,0.6,0.58933954488097895,0.57422827449941549,0.54400573373628835]
[null,0.65,0.63011001896066099,0.61395335180782351,0.58164001750214867]
[null,0.70000000000000007,0.66683439644748832,0.64973607858986027,0.61553944287460449]
[null,0.75000000000000011,0.69906551250529614,0.68114075577439104,0.64529124231258095]
[null,0.80000000000000016,0.7263948350290218,0.70776932643853407,0.67051830925755851]
[null,0.8500000000000002,0.74845246464470438,0.72926137580766071,0.69087919813357312]
[null,0.90000000000000024,0.76490713470948513,0.74529413125539579,0.70606812434721711]
[null,0.95000000000000029,0.77546621131160665,0.7555824623036167,0.71581496428763691]
[null,1.0000000000000002,0.77987569327041351,0.75987888062245412,0.71988525532653547]
[null,1.0500000000000003,0.77792021213635165,0.75797354003029138,0.71808019581817073]
[null,1.1000000000000003,0.76942303219096997,0.74969423649376565,0.7102366450993568]
[null,1.1500000000000004,0.75424605044691839,0.73490640812776653,0.69622712348946292]
[null,1.2000000000000004,0.7322897966479478,0.71351313519543635,0.67595981229041324,null,"F Let u be the peripheral speed of the wheel : u = p . Æ . N / 60                      (in m/s)"]
[null,1.2500000000000004,0.70349343326891334,0.68545514010817188,0.64937855378668918,null,"F Let n, be the speed ratio of the turbine : n =  u / [ 2 . (H1 - H2S ) ] 0.5       (dimensionless number)"]
[null,1.3000000000000005,0.66783475551576954,0.65071078742562172,0.61646285124532574,null,null,"N = speed of rotation of the turbine (in rpm)"]
[null,1.3500000000000005,0.62533019132557388,0.60929608385568745,0.57722786891591438,null,null,"Æ = diameter of the wheel of the turbine (in m)"]
[null,1.4000000000000006,0.57603480136648577,0.56126467825452464,0.53172443203060227]
[null,1.4500000000000006,0.5200422790377659,0.50670786162654113,0.48003902680409161]
[null,1.5000000000000007,0.45748495046977738,0.44575456712439848,0.42229380043364062]

{"sheet":"Turbines_JT60SA","index":1,"n_rows":211,"n_cols":32,"rows_kept":211,"cut":false,"hidden":false,"merged":[]}
[1,2,3,4,5,6,7,8,9,10,11,12,13,14,15,16,17,18,19,20,21,22,23,24,25,26,27,28]
[null,null,null,null,null,null,null,null,null,null,null,null,null,null,null,null,null,null,null,null,null,null,null,null,null,null,null,null,null,null,null,{"$f":"1-1/3","v":0.66666666666666674}]
[]
[]
[null,null,null,null,"Vitesse de la roue ajustée en fonction de la puissance du frein",null,null,null,null,null,null,{"$f":"D66*0.3","v":448.8}]
[]
[]
[null,"Relation entre la puissance et la vitesse de rotation",null,null,null,null,null,null,null,null,null,null,"²"]
[]
[null,"CV310"]
[null,"Pin","Bara",15,null,15,15,15,15]
[null,"Tin","K",{"$f":"[2]!T_P_H_(11,D11,[2]!H_(11,D25,D26))","v":40.028139559593733},null,{"$f":"[2]!T_P_H_(11,F11,[2]!H_(11,F25,F26))","v":39.998153474620565},{"$f":"[2]!T_P_H_(11,G11,[2]!H_(11,G25,G26))","v":40.706438486736495},{"$f":"+H26","v":66},{"$f":"[2]!T_P_H_(11,I11,[2]!H_(11,I25,I26))","v":37.117477759090328},{"$f":"[2]!H_(11,F25,F26)","v":223.40997502124421}]
[null,"Rho",null,{"$f":"[2]!rho_(11,D11,D12)","v":17.34400697294025},null,{"$f":"[2]!rho_(11,F11,F12)","v":17.356911323083132},{"$f":"[2]!rho_(11,G11,G12)","v":17.057330367388428},{"$f":"[2]!rho_(11,H11,H12)","v":10.611040911436882},{"$f":"[2]!rho_(11,I11,I12)","v":18.697255902414604}]
[null,"dP",null,{"$f":"(D11-D25)*1000","v":230.00000000000043},null,{"$f":"(F11-F25)*1000","v":230.00000000000043},{"$f":"(G11-G25)*1000","v":2609.9999999999995},{"$f":"(H11-H25)*1000","v":4699.9999999999991},{"$f":"(I11-I25)*1000","v":5750}]
[null,"Cvs",null,30,null,30,30,30,30]
[null,"Range",null,100,null,100,100,100,100]
[null,"Flow",null,{"$f":"IF(D11/2>D25,\"S\",\"SS\")","v":"SS"},null,{"$f":"IF(F11/2>F25,\"S\",\"SS\")","v":"SS"},{"$f":"IF(G11/2>G25,\"S\",\"SS\")","v":"SS"},{"$f":"IF(H11/2>H25,\"S\",\"SS\")","v":"SS"},{"$f":"IF(I11/2>I25,\"S\",\"SS\")","v":"SS"}]
[null,"Cv",null,{"$f":"[2]!Cv_Simple(D12,D11,D11-D25,D13,D24,D17)","v":12.717086074964683},null,{"$f":"[2]!Cv_Simple(F12,F11,F11-F25,F13,F24,F17)","v":12.717124047985015},{"$f":"[2]!Cv_Simple(G12,G11,G11-G25,G13,G24,G17)","v":3.4564593995925352},{"$f":"[2]!Cv_Simple(H12,H11,H11-H25,H13,H24,H17)","v":2.3390931496728955},{"$f":"[2]!Cv_Simple(I12,I11,I11-I25,I13,I24,I17)","v":2.0131346322269512}]
[null,"Trim",null,{"$f":"[2]!Trim_From_Cv(D18/D15,D16)","v":0.81363317803938628},null,{"$f":"[2]!Trim_From_Cv(F18/F15,F16)","v":0.81363382643668702},{"$f":"[2]!Trim_From_Cv(G18/G15,G16)","v":0.53075510260040271},{"$f":"[2]!Trim_From_Cv(H18/H15,H16)","v":0.44596313116839037},{"$f":"[2]!Trim_From_Cv(I18/I15,I16)","v":0.41337578270696501}]
[null,"TURBINE 1"]
[null,null,null,null,null,{"$f":"IF(ISERROR(F24),\"\",\"X\")","v":"X"},"X",{"$f":"IF(ISERROR(H24),\"\",\"X\")","v":"X"},{"$f":"IF(ISERROR(I24),\"\",\"X\")","v":"X"}]
[null,null,null,"DESIGN",null,"D3","STS","start-up",{"$f":"L52","v":"BAKING"}]
[]
[null,"m","g/s",191.5,null,{"$f":"F37*F25/F26^0.5","v":191.57179904020322},{"$f":"G37*G25/G26^0.5","v":159.25577115548938},104.00311210727105,124.54285781489148]
[null,"Pin","Bara",14.77,null,14.77,12.39,10.3,9.25]
[null,"Tin","K",40.03,null,40,40.729999999999997,66,37.119999999999997]
[null,"Pout","Bara",6.36,null,6.36,5.242,4.97,4.0599999999999996]
[null,"Tout","K",{"$f":"[2]!T2_turb(11,D25,D26,D27,D29)","v":31.094586910112792},null,{"$f":"[2]!T2_turb(11,F25,F26,F27,F29)","v":31.072480290122712},{"$f":"[2]!T2_turb(11,G25,G26,G27,G29)","v":31.480397677666186},{"$f":"[2]!T2_turb(11,H25,H26,H27,H29)","v":53.652309914495696},{"$f":"[2]!T2_turb(11,I25,I26,I27,I29)","v":29.02550360261921}]
[null,"Efficacity","%",0.78,null,{"$f":"(0.321*F51^4-1.6098*F51^3+1.316*F51^2+0.9448*F51)*($D$29/0.97215493)","v":0.77988067524056548},{"$f":"(0.321*G51^4-1.6098*G51^3+1.316*G51^2+0.9448*G51)*($D$29/0.97215493)","v":0.77997500789580099},{"$f":"(0.321*H51^4-1.6098*H51^3+1.316*H51^2+0.9448*H51)*($D$29/0.97215493)","v":0.74361368355275526},{"$f":"(0.321*I51^4-1.6098*I51^3+1.316*I51^2+0.9448*I51)*($D$29/0.97215493)","v":0.77545089983196192}]
[null,"Power","W",{"$f":"+D24*(D41-D42)","v":9122.4436160855366},null,{"$f":"+F24*(F41-F42)","v":9117.5840976273284},7819.2583616719676,6815.9556286983398,5308.5915761789647]
[null,"Speed","Hz",1995,null,1994.6457024390911,2054.3335818379674,2008.0485375105288,2023.4884710633389]
[null,"Speed calculated from P=K.rho.N^3",null,null,null,{"$f":"(F30/$D30*$D34/F34)^(1/3)*$D31","v":1994.6456921083206},{"$f":"(G30/$D30*$D34/G34)^(1/3)*$D31","v":2054.3344051006825},{"$f":"(H30/$D30*$D34/H34)^(1/3)*$D31","v":2008.0485627691696},{"$f":"(I30/$D30*$D34/I34)^(1/3)*$D31","v":2023.4884224043594}]
[null,"Converge brake Power",null,{"$f":"D27-D34","v":1.1600000000000001},null,{"$f":"F31-F32","v":1.0330770464861416E-5},{"$f":"G31-G32","v":-8.2326271513011307E-4},{"$f":"H31-H32","v":-2.5258640789616038E-5},{"$f":"I31-I32","v":4.865897949457576E-5}]
[null,"Brake Pressure",null,5.2,null,{"$f":"($D34-$D27)+F27","v":5.2},{"$f":"($D34-$D27)+G27","v":4.0819999999999999},{"$f":"($D34-$D27)+H27","v":3.8099999999999996},{"$f":"($D34-$D27)+I27","v":2.8999999999999995}]
[null,"Rho (brake)",null,{"$f":"[2]!rho_(11,D34,330)","v":0.75697464940773784},null,{"$f":"[2]!rho_(11,F34,330)","v":0.75697464940773784},{"$f":"[2]!rho_(11,G34,330)","v":0.59449703414110489},{"$f":"[2]!rho_(11,H34,330)","v":0.5549450942419436},{"$f":"[2]!rho_(11,I34,330)","v":0.42255652641901498}]
[null,"Wheel","mm",35.799999999999997,null,{"$f":"$D$36","v":35.799999999999997},{"$f":"$D$36","v":35.799999999999997},{"$f":"$D$36","v":35.799999999999997},{"$f":"$D$36","v":35.799999999999997}]
[null,"a = mÖT/P",null,{"$f":"D24*D26^0.5/D25","v":82.031580287488268},null,{"$f":"+$D$37","v":82.031580287488268},{"$f":"+$D$37","v":82.031580287488268},{"$f":"+$D$37","v":82.031580287488268},{"$f":"+$D$37","v":82.031580287488268}]
[null,"Rho (in)","kg/m3",{"$f":"[2]!rho_(11,D25,D26)","v":17.087672541642732},null,{"$f":"[2]!rho_(11,F25,F26)","v":17.10039396440353},{"$f":"[2]!rho_(11,G25,G26)","v":14.178141597167654},{"$f":"[2]!rho_(11,H25,H26)","v":7.3557574001558121},{"$f":"[2]!rho_(11,I25,I26)","v":11.708162912666104}]
[null,"Sound Speed @inlet",null,{"$f":"[2]!Sound_speed(11,D25,D26)","v":391.2334216977045},null,{"$f":"[2]!Sound_speed(11,F25,F26)","v":391.09834434464432},{"$f":"[2]!Sound_speed(11,G25,G26)","v":391.28919888209964},{"$f":"[2]!Sound_speed(11,H25,H26)","v":488.85573725029269},{"$f":"[2]!Sound_speed(11,I25,I26)","v":370.51577371924787}]
[null,"S=Q/(rho*V) = cte",null,{"$f":"D24/(D38*D39)","v":2.8645071953707371E-2},null,2.8644383814516974E-2,2.8706352284036545E-2,2.892265925996227E-2,2.8709350576958899E-2]
[null,"Hin",null,{"$f":"[2]!H_(11,D25,D26)","v":223.57106614117126},null,{"$f":"[2]!H_(11,F25,F26)","v":223.40997502124421},{"$f":"[2]!H_(11,G25,G26)","v":227.21274224322462},{"$f":"[2]!H_(11,H25,H26)","v":360.14220393657763},{"$f":"[2]!H_(11,I25,I26)","v":207.89085729231627}]
[null,"Hout",null,{"$f":"[2]!H_(11,D27,D28)","v":175.9342848561293},null,{"$f":"[2]!H_(11,F27,F28)","v":175.8164140518976},{"$f":"[2]!H_(11,G27,G28)","v":178.11399809763486},{"$f":"[2]!H_(11,H27,H28)","v":294.60613015382182},{"$f":"[2]!H_(11,I27,I28)","v":165.26624059956987}]
[null,"Sin = Sout",null,{"$f":"[2]!S_(11,D25,D26)","v":15.488244062210457},null,{"$f":"[2]!S_(11,F25,F26)","v":15.484218293673475},{"$f":"[2]!S_(11,G25,G26)","v":15.956591869557485},{"$f":"[2]!S_(11,H25,H26)","v":18.892034584941154},{"$f":"[2]!S_(11,I25,I26)","v":16.084358655112414}]
[null,"Tout(iso)",null,{"$f":"[1]!HeCalc(2,0,1,D27*10^5,8,D43*1000,1)","v":28.580768861485691},null,{"$f":"[1]!HeCalc(2,0,1,F27*10^5,8,F43*1000,1)","v":28.559307375961168},{"$f":"[1]!HeCalc(2,0,1,G27*10^5,8,G43*1000,1)","v":28.875086473743544},{"$f":"[1]!HeCalc(2,0,1,H27*10^5,8,H43*1000,1)","v":49.330781375480868},{"$f":"[1]!HeCalc(2,0,1,I27*10^5,8,I43*1000,1)","v":26.699737772795068}]
[null,"Hout(iso)",null,{"$f":"[2]!H_(11,D27,D44)","v":162.49826962188638},null,{"$f":"[2]!H_(11,F27,F44)","v":162.38325326709131},{"$f":"[2]!H_(11,G27,G44)","v":164.26361740133086},{"$f":"[2]!H_(11,H27,H44)","v":272.01032143860527},{"$f":"[2]!H_(11,I27,I44)","v":152.92333233105427}]
[null,"ΔHs",null,{"$f":"D41-D45","v":61.072796519284879},null,61.026721754152902,62.949124841893763,88.131882497972356,54.967524961262001]
[null,"u1","m/s",{"$f":"(2*52.7%*D46*1000*D29)^0.5","v":224.07402231056255},null,{"$f":"PI()*$D$48*F31","v":224.0342283859672},{"$f":"PI()*$D$48*G31","v":230.73824002511205},{"$f":"PI()*$D$48*H31","v":225.53960541094071},{"$f":"PI()*$D$48*I31","v":227.27378486727451}]
[null,"D1",null,{"$f":"D47/PI()/D31","v":3.5751867939057311E-2},null,null,null,null,null,null,null,null,"T1"]
[null,"Co = (2*ΔHs)^0,5",null,{"$f":"(2000*D46)^0.5","v":349.49333761685608},null,349.36147971450117,354.82143351802682,419.83778414519185,331.56454865157707,null,null,"MAX",{"$f":"ROUND(F24,0)&\"g/s @ \"&F25&\" b ; \"&F26&\"K\"","v":"192g/s @ 14,77 b ; 40K"}]
[null,"u1/Co",null,{"$f":"D47/D49","v":0.64113961038138956},null,0.64126768803775491,0.65029397389374255,0.53720654483290309,0.68545864083347474,null,null,"MIN",{"$f":"ROUND(G24,0)&\"g/s @ \"&G25&\" b ; \"&G26&\"K\"","v":"159g/s @ 12,39 b ; 40,73K"}]
[null,"U1/C0 off de / U1/C0 nom",null,{"$f":"D50/$D$50","v":1},null,{"$f":"F50/$D50","v":1.0001997656271606},{"$f":"G50/$D50","v":1.014278268514571},{"$f":"H50/$D50","v":0.8378932390612075},{"$f":"I50/$D50","v":1.0691253975490946},null,null,"STS",{"$f":"ROUND(H24,0)&\"g/s @ \"&H25&\" b ; \"&H26&\"K\"","v":"104g/s @ 10,3 b ; 66K"}]
[null,"Rdt",null,{"$f":"(0.321*D51^4-1.6098*D51^3+1.316*D51^2+0.9448*D51)*($D29/0.97215493)","v":0.77987569327041328},null,{"$f":"(0.321*F51^4-1.6098*F51^3+1.316*F51^2+0.9448*F51)*($D29/0.97215493)","v":0.77988067524056548},{"$f":"(0.321*G51^4-1.6098*G51^3+1.316*G51^2+0.9448*G51)*($D29/0.97215493)","v":0.77997500789580099},{"$f":"(0.321*H51^4-1.6098*H51^3+1.316*H51^2+0.9448*H51)*($D29/0.97)","v":0.74526567884667116},{"$f":"(0.321*I51^4-1.6098*I51^3+1.316*I51^2+0.9448*I51)*($D29/0.97215493)","v":0.77545089983196192},null,null,"BAKING",{"$f":"ROUND(I24,0)&\"g/s @ \"&I25&\" b ; \"&I26&\"K\"","v":"125g/s @ 9,25 b ; 37,12K"}]
[null,null,null,null,null,{"$f":"F27-F60","v":-0.72955301539572748}]
[]
[null,"TURBINE 2"]
[null,null,null,null,null,{"$f":"IF(ISERROR(F59),\"\",\"X\")","v":"X"},"X",{"$f":"IF(ISERROR(H59),\"\",\"X\")","v":"X"},{"$f":"IF(ISERROR(I59),\"\",\"X\")","v":"X"}]
[null,null,null,"DESIGN",null,{"$f":"F22","v":"D3"},{"$f":"G22","v":"STS"},{"$f":"H22","v":"start-up"},{"$f":"I22","v":"BAKING"},null,null,null,null,null,null,null,null,null,"K.rho"]
[null,null,null,null,null,null,null,18,null,null,null,null,null,null,null,null,838,2075,{"$f":"R58/Q58^(3)","v":3.5260303420909438E-6}]
[null,"m","g/s",191.20000000000002,null,{"$f":"F24","v":191.57179904020322},{"$f":"G24","v":159.25577115548938},{"$f":"H72/(H62*H61)^0.5*H60","v":81.081246965655069},{"$f":"I24","v":124.54285781489148},null,null,null,null,null,null,null,650,{"$f":"S58*Q59^3","v":968.33608269672538}]
[null,"Pin","Bara",6.3070000000000004,null,{"$f":"F59*F61^0.5/F72","v":7.0895530153957278},{"$f":"G59*G61^0.5/G72","v":5.1864993550897074},4.87,{"$f":"I59*I61^0.5/I72","v":3.9891828634251576},null,null,null,null,null,null,null,{"$f":"Q59/Q58","v":0.77565632458233891},{"$f":"R59/R58","v":0.46666799166107248}]
[null,"Tin","K",18.21,null,22.92,17.75,52.5,17.170000000000002]
[null,"Pout","Bara",1.35,null,1.35,1.29,1.1499999999999999,1.35]
[null,"Tout","K",{"$f":"[2]!T2_turb(11,D60,D61,D62,D64)","v":11.618357475588732},null,{"$f":"[2]!T2_turb(11,F60,F61,F62,F64)","v":14.353162721294536},{"$f":"[2]!T2_turb(11,G60,G61,G62,G64)","v":11.83202915557009},{"$f":"[2]!T2_turb(11,H60,H61,H62,H64)","v":39.874221337384164},{"$f":"[2]!T2_turb(11,I60,I61,I62,I64)","v":12.519734519973788}]
[null,"Efficacity","%",0.76,null,{"$f":"(0.321*F86^4-1.6098*F86^3+1.316*F86^2+0.9448*F86)*($D$64/0.97215493)","v":0.75554921612079051},{"$f":"(0.321*G86^4-1.6098*G86^3+1.316*G86^2+0.9448*G86)*($D$64/0.97215493)","v":0.75659090727601686},{"$f":"(0.321*H86^4-1.6098*H86^3+1.316*H86^2+0.9448*H86)*($D$64/0.97215493)","v":0.54982027946255951},{"$f":"(0.321*I86^4-1.6098*I86^3+1.316*I86^2+0.9448*I86)*($D$64/0.97215493)","v":0.74766480719833905}]
[null,"Power","W",{"$f":"+D59*(D76-D77)","v":6144.650345780522},null,8272.8502767732716,4620.2521665713566,5368.5537360267244,2859.2910221938323]
[null,"Speed","Hz",1496,null,1651.9019947043778,1363.7798086169835,1442.2816810178781,1159.2719329618999]
[null,null,null,null,null,{"$f":"(F65/$D65*$D69/F69)^(1/3)*$D66","v":1651.9019152993508},{"$f":"(G65/$D65*$D69/G69)^(1/3)*$D66","v":1363.7798095830935},{"$f":"(H65/$D65*$D69/H69)^(1/3)*$D66","v":1442.2817167384678},{"$f":"(I65/$D65*$D69/I69)^(1/3)*$D66","v":1159.2719350560176}]
[null,null,null,null,null,{"$f":"F66-F67","v":7.9405027008760953E-5},{"$f":"G66-G67","v":-9.6611006483726669E-7},{"$f":"H66-H67","v":-3.5720589721677243E-5},{"$f":"I66-I67","v":-2.0941176899214042E-6}]
[null,"Brake Pressure",null,8,null,{"$f":"($D69-$D62)+F62","v":8},{"$f":"($D69-$D62)+G62","v":7.94},{"$f":"($D69-$D62)+H62","v":7.8000000000000007},{"$f":"($D69-$D62)+I62","v":8}]
[null,"Rho (brake)",null,{"$f":"[2]!rho_(11,D69,330)","v":1.1632432504804469},null,{"$f":"[2]!rho_(11,F69,330)","v":1.1632432504804469},{"$f":"[2]!rho_(11,G69,330)","v":1.1545472550104166},{"$f":"[2]!rho_(11,H69,330)","v":1.1342549379241607},{"$f":"[2]!rho_(11,I69,330)","v":1.1632432504804469}]
[null,"Wheel","mm",39.5,null,{"$f":"$D$36","v":35.799999999999997},{"$f":"$D$36","v":35.799999999999997},{"$f":"$D$36","v":35.799999999999997},{"$f":"$D$36","v":35.799999999999997}]
[null,"a = mÖT/P",null,{"$f":"D59*D61^0.5/D60","v":129.36596422035444},null,{"$f":"$D$72","v":129.36596422035444},{"$f":"$D$72","v":129.36596422035444},129.36596422035444,129.36596422035444]
[null,"Rho (in)","kg/m3",{"$f":"[2]!rho_(11,D60,D61)","v":16.817250243896773},null,{"$f":"[2]!rho_(11,F60,F61)","v":14.761991867494102},{"$f":"[2]!rho_(11,G60,G61)","v":14.206104134803351},{"$f":"[2]!rho_(11,H60,H61)","v":4.414094182882728},{"$f":"[2]!rho_(11,I60,I61)","v":11.303481216223014}]
[null,"Sound Speed",null,{"$f":"[2]!Sound_speed(11,D60,D61)","v":258.39146376447951},null,{"$f":"[2]!Sound_speed(11,F60,F61)","v":290.99468709181559},{"$f":"[2]!Sound_speed(11,G60,G61)","v":253.57359884744159},{"$f":"[2]!Sound_speed(11,H60,H61)","v":431.99130225370175},{"$f":"[2]!Sound_speed(11,I60,I61)","v":247.84624436705576},null,null,null,null,null,null,null,null,null,null,"T2"]
[null,"S=Q/(rho*V) = cte",null,{"$f":"D59/(D73*D74)","v":4.4000208975996838E-2},null,4.4596580113662042E-2,4.4209555779872886E-2,4.2521034402427542E-2,4.4455373936698343E-2,null,null,null,null,null,null,null,null,null,"MAX",{"$f":"ROUND(F59,0)&\"g/s @ \"&F60&\" b ; \"&F61&\"K\"","v":"192g/s @ 7,08955301539573 b ; 22,92K"}]
[null,"Hin",null,{"$f":"[2]!H_(11,D60,D61)","v":105.90220745591094},null,{"$f":"[2]!H_(11,F60,F61)","v":131.66181240452588},{"$f":"[2]!H_(11,G60,G61)","v":104.01463032579005},{"$f":"[2]!H_(11,H60,H61)","v":288.57025422464784},{"$f":"[2]!H_(11,I60,I61)","v":101.59782795413123},null,null,null,null,null,null,null,null,null,"MIN",{"$f":"ROUND(G59,0)&\"g/s @ \"&G60&\" b ; \"&G61&\"K\"","v":"159g/s @ 5,18649935508971 b ; 17,75K"}]
[null,"Hout",null,{"$f":"[2]!H_(11,D62,D63)","v":73.764914852456329},null,{"$f":"[2]!H_(11,F62,F63)","v":88.477740854218339},{"$f":"[2]!H_(11,G62,G63)","v":75.003109217017339},{"$f":"[2]!H_(11,H62,H63)","v":222.35822694415015},{"$f":"[2]!H_(11,I62,I63)","v":78.639538154457554},null,null,null,null,null,null,null,null,null,"STS",{"$f":"ROUND(H59,0)&\"g/s @ \"&H60&\" b ; \"&H61&\"K\"","v":"81g/s @ 4,87 b ; 52,5K"}]
[null,"Sin = Sout",null,{"$f":"[2]!S_(11,D60,D61)","v":13.041567593259808},null,{"$f":"[2]!S_(11,F60,F61)","v":14.056886047632458},{"$f":"[2]!S_(11,G60,G61)","v":13.339129404270436},{"$f":"[2]!S_(11,H60,H61)","v":19.260113557237521},{"$f":"[2]!S_(11,I60,I61)","v":13.740324547348552},null,null,null,null,null,null,null,null,null,"BAKING",{"$f":"ROUND(I59,0)&\"g/s @ \"&I60&\" b ; \"&I61&\"K\"","v":"125g/s @ 3,98918286342516 b ; 17,17K"}]
[null,"Tout(iso)",null,{"$f":"[1]!HeCalc(2,0,1,D62*10^5,8,D78*1000,1)","v":9.7639107105745424},null,{"$f":"[1]!HeCalc(2,0,1,F62*10^5,8,F78*1000,1)","v":11.755015460684973},{"$f":"[1]!HeCalc(2,0,1,G62*10^5,8,G78*1000,1)","v":10.117751770975012},{"$f":"[1]!HeCalc(2,0,1,H62*10^5,8,H78*1000,1)","v":29.476863341337229},{"$f":"[1]!HeCalc(2,0,1,I62*10^5,8,I78*1000,1)","v":11.089799959344971}]
[null,"Hout(iso)",null,{"$f":"[2]!H_(11,D62,D79)","v":63.616296135548602},null,{"$f":"[2]!H_(11,F62,F79)","v":74.505944025725256},{"$f":"[2]!H_(11,G62,G79)","v":65.669573796850287},{"$f":"[2]!H_(11,H62,H79)","v":168.14539949717414},{"$f":"[2]!H_(11,I62,I79)","v":70.891166922833037}]
[null,"ΔHs",null,{"$f":"D76-D80","v":42.285911320362338},null,57.155868378800619,38.345056528939764,120.4248547274737,30.706661031298196]
[null,"u1","m/s",{"$f":"(2*52.7%*D81*1000*D64)^0.5","v":184.04539223806461},null,{"$f":"PI()*$D$83*F66","v":203.22523432767952},{"$f":"PI()*$D$83*G66","v":167.77900387918811},177.43669632400437,142.61942353780228]
[null,"D1",null,{"$f":"D82/PI()/D66","v":3.9160072096222902E-2}]
[null,"Co = (2*ΔHs)^0,5",null,{"$f":"(2000*D81)^0.5","v":290.81234953269205},null,338.10018745573217,276.92979806781273,490.76441339500911,247.81711414387101]
[null,"u1/Co",null,{"$f":"D82/D84","v":0.6328664946100403},null,0.60107992206980965,0.60585392055969178,0.36155167628502877,0.57550272115187384]
[null,"U1/C0 off de / U1/C0 nom",null,{"$f":"D85/$D$50","v":0.98709623358564935},null,{"$f":"F85/$D85","v":0.94977365240386613},{"$f":"G85/$D85","v":0.95731710513922352},{"$f":"H85/$D85","v":0.5712921751495309},{"$f":"I85/$D85","v":0.90935880798443458}]
[null,"Rdt",null,{"$f":"(0.321*D86^4-1.6098*D86^3+1.316*D86^2+0.9448*D86)*($D64/0.97215493)","v":0.75935604730996153},null,{"$f":"(0.321*F86^4-1.6098*F86^3+1.316*F86^2+0.9448*F86)*($D64/0.97215493)","v":0.75554921612079051},{"$f":"(0.321*G86^4-1.6098*G86^3+1.316*G86^2+0.9448*G86)*($D64/0.97215493)","v":0.75659090727601686},{"$f":"(0.321*H86^4-1.6098*H86^3+1.316*H86^2+0.9448*H86)*($D64/0.97215493)","v":0.54982027946255951},{"$f":"(0.321*I86^4-1.6098*I86^3+1.316*I86^2+0.9448*I86)*($D64/0.97215493)","v":0.74766480719833905}]
[]
[]
[null,"CV330"]
[null,"Pin","Bara",13.15,null,13.15,13.25,13.5,12.25,13.15,13.15,13.15,13.15,13.15,13.15,13.15,13.15,13.15,13.15,13.15,13.15,13.15,13.15,13.15,13.15,13.15,13.15,13.15]
[null,"Tin","K",{"$f":"[2]!T_P_H_(11,D91,[2]!H_(11,D106,D107))","v":7.2906635679049048},null,{"$f":"[2]!T_P_H_(11,F91,[2]!H_(11,F106,F107))","v":9.1661496679837366},{"$f":"[2]!T_P_H_(11,G91,[2]!H_(11,G106,G107))","v":8.6223146254179426},{"$f":"+H107","v":8.8279999999999994},{"$f":"[2]!T_P_H_(11,I91,[2]!H_(11,I106,I107))","v":10.795640526772669},{"$f":"[2]!T_P_H_(11,J91,[2]!H_(11,J106,J107))","v":7.289570189226823},{"$f":"[2]!T_P_H_(11,K91,[2]!H_(11,K106,K107))","v":7.2875494761866335},{"$f":"[2]!T_P_H_(11,L91,[2]!H_(11,L106,L107))","v":7.286091223216423},{"$f":"[2]!T_P_H_(11,M91,[2]!H_(11,M106,M107))","v":7.2817678358976652},{"$f":"[2]!T_P_H_(11,N91,[2]!H_(11,N106,N107))","v":7.2801751232542466},{"$f":"[2]!T_P_H_(11,O91,[2]!H_(11,O106,O107))","v":7.2808852270882953},{"$f":"[2]!T_P_H_(11,P91,[2]!H_(11,P106,P107))","v":7.2835767670375562},{"$f":"[2]!T_P_H_(11,Q91,[2]!H_(11,Q106,Q107))","v":7.2929775419785274},{"$f":"[2]!T_P_H_(11,R91,[2]!H_(11,R106,R107))","v":7.309641747149449},{"$f":"[2]!T_P_H_(11,S91,[2]!H_(11,S106,S107))","v":7.3351707676476412},{"$f":"[2]!T_P_H_(11,T91,[2]!H_(11,T106,T107))","v":7.3715975333960877},{"$f":"[2]!T_P_H_(11,U91,[2]!H_(11,U106,U107))","v":7.4214865443397402},{"$f":"[2]!T_P_H_(11,V91,[2]!H_(11,V106,V107))","v":7.4880009996514749},{"$f":"[2]!T_P_H_(11,W91,[2]!H_(11,W106,W107))","v":7.574845195653733},{"$f":"[2]!T_P_H_(11,X91,[2]!H_(11,X106,X107))","v":7.6859260832822134},{"$f":"[2]!T_P_H_(11,Y91,[2]!H_(11,Y106,Y107))","v":7.8246161009732589},{"$f":"[2]!T_P_H_(11,Z91,[2]!H_(11,Z106,Z107))","v":7.9928254087617381},{"$f":"[2]!T_P_H_(11,AA91,[2]!H_(11,AA106,AA107))","v":8.190438152641093},{"$f":"[2]!T_P_H_(11,AB91,[2]!H_(11,AB106,AB107))","v":8.414996515030289}]
[null,"Rho",null,{"$f":"[2]!rho_(11,D91,D92)","v":122.33933382974966},null,{"$f":"[2]!rho_(11,F91,F92)","v":92.385436868539188},{"$f":"[2]!rho_(11,G91,G92)","v":101.58811590421918},{"$f":"[2]!rho_(11,H91,H92)","v":99.5385923004863},{"$f":"[2]!rho_(11,I91,I92)","v":66.476961067945879},{"$f":"[2]!rho_(11,J91,J92)","v":122.3554602961871},{"$f":"[2]!rho_(11,K91,K92)","v":122.38525605267236},{"$f":"[2]!rho_(11,L91,L92)","v":122.40675166263661},{"$f":"[2]!rho_(11,M91,M92)","v":122.47044880873382},{"$f":"[2]!rho_(11,N91,N92)","v":122.4939022601133},{"$f":"[2]!rho_(11,O91,O92)","v":122.48344645754396},{"$f":"[2]!rho_(11,P91,P92)","v":122.44380344539697},{"$f":"[2]!rho_(11,Q91,Q92)","v":122.30519433940992},{"$f":"[2]!rho_(11,R91,R92)","v":122.05892824408417},{"$f":"[2]!rho_(11,S91,S92)","v":121.68027091130101},{"$f":"[2]!rho_(11,T91,T92)","v":121.13709609048141},{"$f":"[2]!rho_(11,U91,U92)","v":120.3877662475066},{"$f":"[2]!rho_(11,V91,V92)","v":119.37920067123139},{"$f":"[2]!rho_(11,W91,W92)","v":118.04655161202567},{"$f":"[2]!rho_(11,X91,X92)","v":116.31729006265563},{"$f":"[2]!rho_(11,Y91,Y92)","v":114.12277996026393},{"$f":"[2]!rho_(11,Z91,Z92)","v":111.41624187103298},{"$f":"[2]!rho_(11,AA91,AA92)","v":108.18992422198602},{"$f":"[2]!rho_(11,AB91,AB92)","v":104.49208532283211}]
[null,"dP",null,{"$f":"(D91-D106)*1000","v":80.000000000000071},null,{"$f":"(F91-F106)*1000","v":80.000000000000071},5881,429.99999999999972,1769.9999999999995,25.000000000000355,150.00000000000034,{"$f":"(L91-L106)*1000","v":250},650.00000000000034,1150.0000000000005,1349.9999999999995,1650.0000000000005,{"$f":"(Q91-Q106)*1000","v":2150.0000000000005},2650.0000000000005,3150.0000000000005,3650.0000000000005,{"$f":"(U91-U106)*1000","v":4150},4650,5150,5650,6150,6650,7150,7650]
[null,"Cvs",null,30,null,30,30,30,30,30,30,30,30,30,30,30,30,30,30,30,30,30,30,30,30,30,30,30]
[null,"Range",null,250,null,250,250,250,250,250,250,250,250,250,250,250,250,250,250,250,250,250,250,250,250,250,250,250]
[null,"Flow",null,{"$f":"IF(D91/2>D106,\"S\",\"SS\")","v":"SS"},null,{"$f":"IF(F91/2>F106,\"S\",\"SS\")","v":"SS"},"SS","SS","SS","SS","SS",{"$f":"IF(L91/2>L106,\"S\",\"SS\")","v":"SS"},"SS","SS","SS","SS",{"$f":"IF(Q91/2>Q106,\"S\",\"SS\")","v":"SS"},"SS","SS","SS",{"$f":"IF(U91/2>U106,\"S\",\"SS\")","v":"SS"},"SS","SS","SS","SS","S","S","S"]
[null,"Cv",null,{"$f":"[2]!Cv_Simple(D92,D91,D91-D106,D93,D105,D97)","v":16.871042195072768},null,{"$f":"[2]!Cv_Simple(F92,F91,F91-F106,F93,F105,F97)","v":17.322031941151611},{"$f":"[2]!Cv_Simple(G92,G91,G91-G106,G93,G105,G97)","v":1.5624808374172479},{"$f":"[2]!Cv_Simple(H92,H91,H91-H106,H93,H105,H97)","v":7.429099260262916},{"$f":"[2]!Cv_Simple(I92,I91,I91-I106,I93,I105,I97)","v":3.4961726331618523},{"$f":"[2]!Cv_Simple(J92,J91,J91-J106,J93,J105,J97)","v":30.245428055789461},{"$f":"[2]!Cv_Simple(K92,K91,K91-K106,K93,K105,K97)","v":12.28720817350716},{"$f":"[2]!Cv_Simple(L92,L91,L91-L106,L93,L105,L97)","v":9.4801213608492336},{"$f":"[2]!Cv_Simple(M92,M91,M91-M106,M93,M105,M97)","v":5.7859463929682278},{"$f":"[2]!Cv_Simple(N92,N91,N91-N106,N93,N105,N97)","v":4.2616344960325527},{"$f":"[2]!Cv_Simple(O92,O91,O91-O106,O93,O105,O97)","v":3.9005616644361947},{"$f":"[2]!Cv_Simple(P92,P91,P91-P106,P93,P105,P97)","v":3.4836158662443446},{"$f":"[2]!Cv_Simple(Q92,Q91,Q91-Q106,Q93,Q105,Q97)","v":2.9863890993599553},{"$f":"[2]!Cv_Simple(R92,R91,R91-R106,R93,R105,R97)","v":2.630744465022449},{"$f":"[2]!Cv_Simple(S92,S91,S91-S106,S93,S105,S97)","v":2.3584483314793547},{"$f":"[2]!Cv_Simple(T92,T91,T91-T106,T93,T105,T97)","v":2.1402697639426709},{"$f":"[2]!Cv_Simple(U92,U91,U91-U106,U93,U105,U97)","v":1.959736796033311},{"$f":"[2]!Cv_Simple(V92,V91,V91-V106,V93,V105,V97)","v":1.8068011657336551},{"$f":"[2]!Cv_Simple(W92,W91,W91-W106,W93,W105,W97)","v":1.6749676160697717},{"$f":"[2]!Cv_Simple(X92,X91,X91-X106,X93,X105,X97)","v":1.5598250905333353},{"$f":"[2]!Cv_Simple(Y92,Y91,Y91-Y106,Y93,Y105,Y97)","v":1.4581987435700463},{"$f":"[2]!Cv_Simple(Z92,Z91,Z91-Z106,Z93,Z105,Z97)","v":1.1023921012824629},{"$f":"[2]!Cv_Simple(AA92,AA91,AA91-AA106,AA93,AA105,AA97)","v":1.0326492805600551},{"$f":"[2]!Cv_Simple(AB92,AB91,AB91-AB106,AB93,AB105,AB97)","v":0.96320334593709034}]
[null,"Cv",null,{"$f":"[2]!cv_gaz(11,D105,D91,D106,D92,0.87)","v":16.857057297506717},null,{"$f":"[2]!cv_gaz(11,F105,F91,F106,F92,0.87)","v":17.302955116963208},{"$f":"[2]!cv_gaz(11,G105,G91,G106,G92,0.87)","v":1.2850555873141412},{"$f":"[2]!cv_gaz(11,H105,H91,H106,H92,0.87)","v":7.3638646416797888},{"$f":"[2]!cv_gaz(11,I105,I91,I106,I92,0.87)","v":3.3403810050483655},{"$f":"[2]!cv_gaz(11,J105,J91,J106,J92,0.87)","v":30.25240627564261},{"$f":"[2]!cv_gaz(11,K105,K91,K106,K92,0.87)","v":12.260354477870131},{"$f":"[2]!cv_gaz(11,L105,L91,L106,L92,0.87)","v":9.4408521094022362},{"$f":"[2]!cv_gaz(11,M105,M91,M106,M92,0.87)","v":5.7154136154724302},{"$f":"[2]!cv_gaz(11,N105,N91,N106,N92,0.87)","v":4.1645346012301401},{"$f":"[2]!cv_gaz(11,O105,O91,O106,O92,0.87)","v":3.7944571772544613},{"$f":"[2]!cv_gaz(11,P105,P91,P106,P92,0.87)","v":3.3650453285884003},{"$f":"[2]!cv_gaz(11,Q105,Q91,Q106,Q92,0.87)","v":2.8489393533777028},{"$f":"[2]!cv_gaz(11,R105,R91,R106,R92,0.87)","v":2.4759432117871807},{"$f":"[2]!cv_gaz(11,S105,S91,S106,S92,0.87)","v":2.1872308538645551},{"$f":"[2]!cv_gaz(11,T105,T91,T106,T92,0.87)","v":1.953179582352998},{"$f":"[2]!cv_gaz(11,U105,U91,U106,U92,0.87)","v":1.7570226609442032},{"$f":"[2]!cv_gaz(11,V105,V91,V106,V92,0.87)","v":1.5884689711778408},{"$f":"[2]!cv_gaz(11,W105,W91,W106,W92,0.87)","v":1.4408179949032274},{"$f":"[2]!cv_gaz(11,X105,X91,X106,X92,0.87)","v":1.3095035400868011},{"$f":"[2]!cv_gaz(11,Y105,Y91,Y106,Y92,0.87)","v":1.1912858725689055},{"$f":"[2]!cv_gaz(11,Z105,Z91,Z106,Z92,0.87)","v":1.0837682217377131},{"$f":"[2]!cv_gaz(11,AA105,AA91,AA106,AA92,0.87)","v":0.98507438943257353},{"$f":"[2]!cv_gaz(11,AB105,AB91,AB106,AB92,0.87)","v":0.89363044681285264}]
[null,"Trim",null,{"$f":"[2]!Trim_From_Cv(D98/D95,D96)","v":0.89575246161070277},null,{"$f":"[2]!Trim_From_Cv(F99/F95,F96)","v":0.90033071193964909},{"$f":"[2]!Trim_From_Cv(G99/G95,G96)","v":0.42942720187538397},{"$f":"[2]!Trim_From_Cv(H99/H95,H96)","v":0.74560854084783068},{"$f":"[2]!Trim_From_Cv(I99/I95,I96)","v":0.60243990848321904},{"$f":"[2]!Trim_From_Cv(J99/J95,J96)","v":1.0015174146983792},{"$f":"[2]!Trim_From_Cv(K99/K95,K96)","v":0.83793663461222467},{"$f":"[2]!Trim_From_Cv(L99/L95,L96)","v":0.79060774730619998},{"$f":"[2]!Trim_From_Cv(M99/M95,M96)","v":0.69971159118242865},{"$f":"[2]!Trim_From_Cv(N99/N95,N96)","v":0.64237855124541821},{"$f":"[2]!Trim_From_Cv(O99/O95,O96)","v":0.62552374306357472},{"$f":"[2]!Trim_From_Cv(P99/P95,P96)","v":0.60377226596444622},{"$f":"[2]!Trim_From_Cv(Q99/Q95,Q96)","v":0.57361816946987154},{"$f":"[2]!Trim_From_Cv(R99/R95,R96)","v":0.54820363674071715},{"$f":"[2]!Trim_From_Cv(S99/S95,S96)","v":0.5257485062070264},{"$f":"[2]!Trim_From_Cv(T99/T95,T96)","v":0.50525072574398844},{"$f":"[2]!Trim_From_Cv(U99/U95,U96)","v":0.48608226749559114},{"$f":"[2]!Trim_From_Cv(V99/V95,V96)","v":0.46781716211559959},{"$f":"[2]!Trim_From_Cv(W99/W95,W96)","v":0.45014799117440163},{"$f":"[2]!Trim_From_Cv(X99/X95,X96)","v":0.43284044931274046},{"$f":"[2]!Trim_From_Cv(Y99/Y95,Y96)","v":0.41570462224802307},{"$f":"[2]!Trim_From_Cv(Z99/Z95,Z96)","v":0.39857342676297042},{"$f":"[2]!Trim_From_Cv(AA99/AA95,AA96)","v":0.38128050693873894},{"$f":"[2]!Trim_From_Cv(AB99/AB95,AB96)","v":0.36363574900613271}]
[null,"TURBINE 3"]
[null,null,null,null,null,{"$f":"IF(ISERROR(F105),\"\",\"X\")","v":"X"},"X","X",{"$f":"IF(ISERROR(I105),\"\",\"X\")","v":"X"},"X",{"$f":"IF(ISERROR(K105),\"\",\"X\")","v":"X"},"X","X","X","X","X",{"$f":"IF(ISERROR(Q105),\"\",\"X\")","v":"X"},"X","X","X",{"$f":"IF(ISERROR(U105),\"\",\"X\")","v":"X"},"X","X","X","X","X","X","X"]
[null,null,null,"DESIGN",null,{"$f":"F57","v":"D3"},{"$f":"G57","v":"STS"},"D",{"$f":"I57","v":"BAKING"},"Lamin 1","Lamin 2","Lamin 3","Lamin 4","Lamin 5","Lamin 6","Lamin 7","Lamin 8","Lamin 9","Lamin 10","Lamin 11","Lamin 12","Lamin 13","Lamin 14","Lamin 15","Lamin 16","Lamin 17","Lamin 18","Lamin 19"]
[]
[null,"m","g/s",399.8,null,356.71257208390125,216.39937052398969,363.35819311360677,266.51741339684168,401.53749797627933,397.71329363307916,394.65397216831809,382.41663907517284,367.1199729433124,361.00130368976448,351.82329621015924,336.52664085522974,321.22997446718233,305.93330775890797,290.63664095539815,275.3399717325492,260.04330075702649,244.74662432210812,229.44993050352153,214.15316828800741,198.85665156812763,183.55914743906956,168.26332147527293]
[null,"Pin","Bara",13.07,null,13.07,7.3689999999999998,13.07,10.48,13.125,13,12.9,12.5,12,11.8,11.5,11,10.5,10,{"$f":"S106-0.5","v":9.5},{"$f":"T106-0.5","v":9},8.5,8,7.5,7,6.5,6,5.5]
[null,"Tin","K",7.2919999999999998,null,9.16,7.9119999999999999,8.8279999999999994,10.55,7.29,7.29,7.29,7.29,7.29,7.29,7.29,7.29,7.29,7.29,7.29,7.29,7.29,7.29,7.29,7.29,7.29,7.29,7.29]
[null,"Pout","Bara",4.88,null,4.88,5.18,4.88,5.18,4.88,4.88,4.88,4.88,4.88,4.88,4.88,4.88,4.88,4.88,4.88,4.88,4.88,4.88,4.88,4.88,4.88,4.88,4.88]
[null,"Tout","K",{"$f":"[2]!T2_turb(11,D106,D107,D108,D110)","v":6.1198408797506243},null,{"$f":"[2]!T2_turb(11,F106,F107,F108,F110)","v":6.9395281603085568},{"$f":"[2]!T2_turb(11,G106,G107,G108,G110)","v":7.1075335045223715},{"$f":"[2]!T2_turb(11,H106,H107,H108,H110)","v":6.7708056613683949},{"$f":"[2]!T2_turb(11,I106,I107,I108,I110)","v":8.46896187247307},{"$f":"[2]!T2_turb(11,J106,J107,J108,J110)","v":6.1172513186493243},{"$f":"[2]!T2_turb(11,K106,K107,K108,K110)","v":6.1214390141230322},{"$f":"[2]!T2_turb(11,L106,L107,L108,L110)","v":6.1248607471513985},{"$f":"[2]!T2_turb(11,M106,M107,M108,M110)","v":6.1392195787982295},{"$f":"[2]!T2_turb(11,N106,N107,N108,N110)","v":6.158826113210722},{"$f":"[2]!T2_turb(11,O106,O107,O108,O110)","v":6.1672421632945564},{"$f":"[2]!T2_turb(11,P106,P107,P108,P110)","v":6.1805470970806349},{"$f":"[2]!T2_turb(11,Q106,Q107,Q108,Q110)","v":6.2047526974301581},{"$f":"[2]!T2_turb(11,R106,R107,R108,R110)","v":6.2319264417931368},{"$f":"[2]!T2_turb(11,S106,S107,S108,S110)","v":6.2627111829370881},{"$f":"[2]!T2_turb(11,T106,T107,T108,T110)","v":6.2979759285408319},{"$f":"[2]!T2_turb(11,U106,U107,U108,U110)","v":6.3389109658375542},{"$f":"[2]!T2_turb(11,V106,V107,V108,V110)","v":6.3871567819321973},{"$f":"[2]!T2_turb(11,W106,W107,W108,W110)","v":6.4449610902836341},{"$f":"[2]!T2_turb(11,X106,X107,X108,X110)","v":6.5153344148095558},{"$f":"[2]!T2_turb(11,Y106,Y107,Y108,Y110)","v":6.6021628445177249},{"$f":"[2]!T2_turb(11,Z106,Z107,Z108,Z110)","v":6.7103154003617895},{"$f":"[2]!T2_turb(11,AA106,AA107,AA108,AA110)","v":6.8459383643535094},{"$f":"[2]!T2_turb(11,AB106,AB107,AB108,AB110)","v":7.0187257691663865}]
[null,"Efficacity","%",0.72,null,{"$f":"(0.321*F133^4-1.6098*F133^3+1.316*F133^2+0.9448*F133)*($D$110/0.97215493)","v":0.70696991088814909},0.70961038411638022,0.7108555917631959,0.66763502805420782,0.71989836028184095,0.71986980117622079,{"$f":"(0.321*L133^4-1.6098*L133^3+1.316*L133^2+0.9448*L133)*($D$110/0.97215493)","v":0.71984435296740734},0.71971922063953186,0.71950979052459352,0.71940947033393243,0.71924137708570512,{"$f":"(0.321*Q133^4-1.6098*Q133^3+1.316*Q133^2+0.9448*Q133)*($D$110/0.97215493)","v":0.71891523694471871},0.71853472213737135,0.71810640915833424,0.71764195407852505,{"$f":"(0.321*U133^4-1.6098*U133^3+1.316*U133^2+0.9448*U133)*($D$110/0.97215493)","v":0.71716136644333373},0.71669908250021996,0.71631565208875514,0.71611984124278449,0.7163050778533675,0.71717909205057673,0.71897590016613477,0.7]
[null,"Power","W",{"$f":"+D105*(D123-D124)","v":2075.5404202052005},null,2562.8613951580796,505.8456615123539,2455.6474840408473,1848.4112283619368,{"$f":"+J105*(J123-J124)","v":2094.5216222770541},2050.0059968393484,{"$f":"+L105*(L123-L124)","v":2014.6946136523991},1876.1372285633333,1709.0379655651191,1644.111770275618,1548.7886475413382,{"$f":"+Q105*(Q123-Q124)","v":1395.4675149539503},1249.1463322107404,1109.8844682822325,977.71586507749942,{"$f":"+U105*(U123-U124)","v":852.62595935221066},734.5082322112803,623.087349228726,517.79612956006883,417.61340624023256,320.91012330521102,225.32065880540506,124.0516286143888]
[null,"Speed","Hz",838,null,899.03236545200411,518.36496558823876,886.31675848463021,798.41587659968297,840.54680702237465,834.54930007153769,829.72981338767113,810.25518802528688,785.4481545459854,775.37310539717589,760.08881015013503,734.1309444714999,707.51892199107192,680.18368622749267,652.03539865530593,622.94992412705847,592.74219325621345,561.11248411331167,527.53735823288378,491.04930133342305,449.77442726562066,399.76118544893671,327.64316327287037]
[null,null,null,null,null,{"$f":"(F111/$D111*$D116/F116)^(1/3)*$D112","v":899.03236505097857},518.36496560212197,886.31675843526898,798.41587648634606,840.5468071698723,834.54930019144001,{"$f":"(L111/$D111*$D116/L116)^(1/3)*$D112","v":829.72981348272822},810.25518820900413,785.4481545417608,775.37310535528559,760.08881018317174,{"$f":"(Q111/$D111*$D116/Q116)^(1/3)*$D112","v":734.1309444710987},707.51892196921528,680.18368622443859,652.03539907474101,{"$f":"(U111/$D111*$D116/U116)^(1/3)*$D112","v":622.94992402773596},592.74219310812794,561.11248411578117,527.53735811314516,491.04930132245369,449.77442732775171,399.7611854232249,327.64316327257023]
[null,null,null,null,null,{"$f":"(F112-F113)^2","v":1.6082148791564267E-13},{"$f":"(G112-G113)^2","v":1.9274349904841781E-16},2.4365313551674065E-15,1.284525508563684E-14,2.1755555080107877E-14,1.437656742374839E-14,9.0358502282818131E-15,3.3752027079353427E-14,1.7847269575959439E-17,1.754797467177823E-15,1.0914244006163282E-15,1.6096212229715642E-19,4.7771252029733426E-16,9.3274242447683988E-18,1.7592578819836867E-13,9.8649601535222135E-15,2.1929320925177544E-14,6.0984573601465204E-18,1.4337336034005123E-14,1.203268314885331E-16,3.8602674395462831E-15,6.610973340747854E-16,9.0079968707024714E-20]
[null,null,null,null,null,{"$f":"[2]!MinimizeNonnegative(F114,F105,100)","v":"<<Minimize F114 by changing F105 (nonnegative)>>"},{"$f":"[2]!MinimizeNonnegative(G114,G105,100)","v":"<<Minimize G114 by changing G105 (nonnegative)>>"},{"$f":"[2]!MinimizeNonnegative(H114,H105,100)","v":"<<Minimize H114 by changing H105 (nonnegative)>>"},{"$f":"[2]!MinimizeNonnegative(I114,I105,100)","v":"<<Minimize I114 by changing I105 (nonnegative)>>"},{"$f":"[2]!MinimizeNonnegative(J114,J105,100)","v":"<<Minimize J114 by changing J105 (nonnegative)>>"},{"$f":"[2]!MinimizeNonnegative(K114,K105,100)","v":"<<Minimize K114 by changing K105 (nonnegative)>>"},{"$f":"[2]!MinimizeNonnegative(L114,L105,100)","v":"<<Minimize L114 by changing L105 (nonnegative)>>"},{"$f":"[2]!MinimizeNonnegative(M114,M105,100)","v":"<<Minimize M114 by changing M105 (nonnegative)>>"},{"$f":"[2]!MinimizeNonnegative(N114,N105,100)","v":"<<Minimize N114 by changing N105 (nonnegative)>>"},{"$f":"[2]!MinimizeNonnegative(O114,O105,100)","v":"<<Minimize O114 by changing O105 (nonnegative)>>"},{"$f":"[2]!MinimizeNonnegative(P114,P105,100)","v":"<<Minimize P114 by changing P105 (nonnegative)>>"},{"$f":"[2]!MinimizeNonnegative(Q114,Q105,100)","v":"<<Minimize Q114 by changing Q105 (nonnegative)>>"},{"$f":"[2]!MinimizeNonnegative(R114,R105,100)","v":"<<Minimize R114 by changing R105 (nonnegative)>>"},{"$f":"[2]!MinimizeNonnegative(S114,S105,100)","v":"<<Minimize S114 by changing S105 (nonnegative)>>"},{"$f":"[2]!MinimizeNonnegative(T114,T105,100)","v":"<<Minimize T114 by changing T105 (nonnegative)>>"},{"$f":"[2]!MinimizeNonnegative(U114,U105,100)","v":"<<Minimize U114 by changing U105 (nonnegative)>>"},{"$f":"[2]!MinimizeNonnegative(V114,V105,100)","v":"<<Minimize V114 by changing V105 (nonnegative)>>"},{"$f":"[2]!MinimizeNonnegative(W114,W105,100)","v":"<<Minimize W114 by changing W105 (nonnegative)>>"},{"$f":"[2]!MinimizeNonnegative(X114,X105,100)","v":"<<Minimize X114 by changing X105 (nonnegative)>>"},{"$f":"[2]!MinimizeNonnegative(Y114,Y105,100)","v":"<<Minimize Y114 by changing Y105 (nonnegative)>>"},{"$f":"[2]!MinimizeNonnegative(Z114,Z105,100)","v":"<<Minimize Z114 by changing Z105 (nonnegative)>>"},{"$f":"[2]!MinimizeNonnegative(AA114,AA105,100)","v":"<<Minimize AA114 by changing AA105 (nonnegative)>>"},{"$f":"[2]!MinimizeNonnegative(AB114,AB105,100)","v":"<<Minimize AB114 by changing AB105 (nonnegative)>>"}]
[null,"Brake Pressure",null,10.1,null,{"$f":"($D116-$D108)+F108","v":10.1},10.399999999999999,10.1,10.399999999999999,10.1,10.1,{"$f":"($D116-$D108)+L108","v":10.1},10.1,10.1,10.1,10.1,{"$f":"($D116-$D108)+Q108","v":10.1},10.1,10.1,10.1,{"$f":"($D116-$D108)+U108","v":10.1},10.1,10.1,10.1,10.1,10.1,10.1,10.1]
[null,"Rho (brake)",null,{"$f":"[2]!rho_(11,D116,330)","v":1.4673342046153373},null,{"$f":"[2]!rho_(11,F116,330)","v":1.4673342046153373},{"$f":"[2]!rho_(11,G116,330)","v":1.5107331217743123},{"$f":"[2]!rho_(11,H116,330)","v":1.4673342046153373},{"$f":"[2]!rho_(11,I116,330)","v":1.5107331217743123},{"$f":"[2]!rho_(11,J116,330)","v":1.4673342046153373},{"$f":"[2]!rho_(11,K116,330)","v":1.4673342046153373},{"$f":"[2]!rho_(11,L116,330)","v":1.4673342046153373},{"$f":"[2]!rho_(11,M116,330)","v":1.4673342046153373},{"$f":"[2]!rho_(11,N116,330)","v":1.4673342046153373},{"$f":"[2]!rho_(11,O116,330)","v":1.4673342046153373},{"$f":"[2]!rho_(11,P116,330)","v":1.4673342046153373},{"$f":"[2]!rho_(11,Q116,330)","v":1.4673342046153373},{"$f":"[2]!rho_(11,R116,330)","v":1.4673342046153373},{"$f":"[2]!rho_(11,S116,330)","v":1.4673342046153373},{"$f":"[2]!rho_(11,T116,330)","v":1.4673342046153373},{"$f":"[2]!rho_(11,U116,330)","v":1.4673342046153373},{"$f":"[2]!rho_(11,V116,330)","v":1.4673342046153373},{"$f":"[2]!rho_(11,W116,330)","v":1.4673342046153373},{"$f":"[2]!rho_(11,X116,330)","v":1.4673342046153373},{"$f":"[2]!rho_(11,Y116,330)","v":1.4673342046153373},{"$f":"[2]!rho_(11,Z116,330)","v":1.4673342046153373},{"$f":"[2]!rho_(11,AA116,330)","v":1.4673342046153373},{"$f":"[2]!rho_(11,AB116,330)","v":1.4673342046153373}]
[null,"Wheel","mm",29.5,null,{"$f":"$D$118","v":29.5},29.5,29.5,29.5,29.5,29.5,{"$f":"$D$118","v":29.5},29.5,29.5,29.5,29.5,29.5,29.5,29.5,29.5,29.5,29.5,29.5,29.5,29.5,29.5,29.5,29.5]
[null,"a = mÖT/P",null,{"$f":"D105*D107^0.5/D106","v":82.601994178997316},null,{"$f":"$D$119","v":82.601994178997316},{"$f":"$D$119","v":82.601994178997316},82.601994178997316,82.601994178997316,{"$f":"$D$119","v":82.601994178997316},{"$f":"$D$119","v":82.601994178997316},{"$f":"$D$119","v":82.601994178997316},82.601994178997316,82.601994178997316,82.601994178997316,82.601994178997316,82.601994178997316,82.601994178997316,82.601994178997316,82.601994178997316,82.601994178997316,82.601994178997316,82.601994178997316,82.601994178997316,82.601994178997316,82.601994178997316,82.601994178997316,82.601994178997316]
[null,"Rho (in)","kg/m3",{"$f":"[2]!rho_(11,D106,D107)","v":122.0413850208848},null,{"$f":"[2]!rho_(11,F106,F107)","v":92.042022544510019},{"$f":"[2]!rho_(11,G106,G107)","v":70.649649504414128},{"$f":"[2]!rho_(11,H106,H107)","v":97.31015974976988},{"$f":"[2]!rho_(11,I106,I107)","v":58.789985568547117},{"$f":"[2]!rho_(11,J106,J107)","v":122.26254459716908},{"$f":"[2]!rho_(11,K106,K107)","v":121.82541276463277},{"$f":"[2]!rho_(11,L106,L107)","v":121.47048985373},{"$f":"[2]!rho_(11,M106,M107)","v":120.00158449336017},{"$f":"[2]!rho_(11,N106,N107)","v":118.04323398198385},{"$f":"[2]!rho_(11,O106,O107)","v":117.21740392188151},{"$f":"[2]!rho_(11,P106,P107)","v":115.92807252113009},{"$f":"[2]!rho_(11,Q106,Q107)","v":113.62831271086438},{"$f":"[2]!rho_(11,R106,R107)","v":111.10900572556152},{"$f":"[2]!rho_(11,S106,S107)","v":108.32592568043771},{"$f":"[2]!rho_(11,T106,T107)","v":105.22304974584799},{"$f":"[2]!rho_(11,U106,U107)","v":101.73006429167778},{"$f":"[2]!rho_(11,V106,V107)","v":97.761229789013782},{"$f":"[2]!rho_(11,W106,W107)","v":93.218746356413405},{"$f":"[2]!rho_(11,X106,X107)","v":88.006090815095931},{"$f":"[2]!rho_(11,Y106,Y107)","v":82.056091491693806},{"$f":"[2]!rho_(11,Z106,Z107)","v":75.368306411917857},{"$f":"[2]!rho_(11,AA106,AA107)","v":68.036211882297849},{"$f":"[2]!rho_(11,AB106,AB107)","v":60.256067667110017}]
[null,"Sound Speed",null,{"$f":"[2]!Sound_speed(11,D106,D107)","v":249.05671288435045},null,{"$f":"[2]!Sound_speed(11,F106,F107)","v":219.03534618547846},{"$f":"[2]!Sound_speed(11,G106,G107)","v":170.78644408370695},{"$f":"[2]!Sound_speed(11,H106,H107)","v":221.8649954478073},{"$f":"[2]!Sound_speed(11,I106,I107)","v":204.26692373410398},{"$f":"[2]!Sound_speed(11,J106,J107)","v":249.66480346852958},{"$f":"[2]!Sound_speed(11,K106,K107)","v":248.37992500152339},{"$f":"[2]!Sound_speed(11,L106,L107)","v":247.34215523540456},{"$f":"[2]!Sound_speed(11,M106,M107)","v":243.10023780227394},{"$f":"[2]!Sound_speed(11,N106,N107)","v":237.58176599011068},{"$f":"[2]!Sound_speed(11,O106,O107)","v":235.30303786825937},{"$f":"[2]!Sound_speed(11,P106,P107)","v":231.80443938215453},{"$f":"[2]!Sound_speed(11,Q106,Q107)","v":225.74814791917015},{"$f":"[2]!Sound_speed(11,R106,R107)","v":219.39459429677927},{"$f":"[2]!Sound_speed(11,S106,S107)","v":212.73080772596771},{"$f":"[2]!Sound_speed(11,T106,T107)","v":205.75546145318614},{"$f":"[2]!Sound_speed(11,U106,U107)","v":198.4897054969922},{"$f":"[2]!Sound_speed(11,V106,V107)","v":190.99426898824163},{"$f":"[2]!Sound_speed(11,W106,W107)","v":183.39236114735928},{"$f":"[2]!Sound_speed(11,X106,X107)","v":175.88971297032288},{"$f":"[2]!Sound_speed(11,Y106,Y107)","v":168.76799821216045},{"$f":"[2]!Sound_speed(11,Z106,Z107)","v":162.32650860903618},{"$f":"[2]!Sound_speed(11,AA106,AA107)","v":156.80049650025103},{"$f":"[2]!Sound_speed(11,AB106,AB107)","v":152.34946477870031}]
[null,"S=Q/(rho*V) = cte",null,{"$f":"D105/(D120*D121)","v":1.3153381307708404E-2},null,1.7693675543720006E-2,1.7934636766009687E-2,1.683014991629956E-2,2.2193417731734496E-2,{"$f":"J105/(J120*J121)","v":1.3154530621734974E-2},1.3143642090021732E-2,{"$f":"L105/(L120*L121)","v":1.3135528610854928E-2},1.3108844631578215E-2,1.3090426823819539E-2,1.3088477704548513E-2,1.3092248170118217E-2,{"$f":"Q105/(Q120*Q121)","v":1.3119240595440387E-2},1.3177738320573465E-2,1.3275899752007037E-2,1.342419056869717E-2,{"$f":"U105/(U120*U121)","v":1.3635841899436354E-2},1.3927035348373853E-2,1.431634680618557E-2,1.4822953970874074E-2,1.5464061850082297E-2,1.6254062229119477E-2,1.7206338931040416E-2,1.8329378465978329E-2]
[null,"Hin",null,{"$f":"[2]!H_(11,D106,D107)","v":28.150884578454882},null,{"$f":"[2]!H_(11,F106,F107)","v":40.890140453818937},{"$f":"[2]!H_(11,G106,G107)","v":36.811643961665368},{"$f":"[2]!H_(11,H106,H107)","v":38.395688158328092},{"$f":"[2]!H_(11,I106,I107)","v":54.059832308617963},{"$f":"[2]!H_(11,J106,J107)","v":28.14464519231036},{"$f":"[2]!H_(11,K106,K107)","v":28.133117975105385},{"$f":"[2]!H_(11,L106,L107)","v":28.124802568427114},{"$f":"[2]!H_(11,M106,M107)","v":28.100165246427569},{"$f":"[2]!H_(11,N106,N107)","v":28.091095004662005},{"$f":"[2]!H_(11,O106,O107)","v":28.095138531510841},{"$f":"[2]!H_(11,P106,P107)","v":28.110470745453465},{"$f":"[2]!H_(11,Q106,Q107)","v":28.164094353340676},{"$f":"[2]!H_(11,R106,R107)","v":28.259427461742323},{"$f":"[2]!H_(11,S106,S107)","v":28.406164507567226},{"$f":"[2]!H_(11,T106,T107)","v":28.616989129337512},{"$f":"[2]!H_(11,U106,U107)","v":28.908501436419211},{"$f":"[2]!H_(11,V106,V107)","v":29.302162143566285},{"$f":"[2]!H_(11,W106,W107)","v":29.824768459584782},{"$f":"[2]!H_(11,X106,X107)","v":30.50745846200121},{"$f":"[2]!H_(11,Y106,Y107)","v":31.382100647825098},{"$f":"[2]!H_(11,Z106,Z107)","v":32.475425675748092},{"$f":"[2]!H_(11,AA106,AA107)","v":33.803432781577705},{"$f":"[2]!H_(11,AB106,AB107)","v":35.365048561567498}]
[null,"Hout",null,{"$f":"[2]!H_(11,D108,D109)","v":22.959437804554931},null,{"$f":"[2]!H_(11,F108,F109)","v":33.705472472575828},{"$f":"[2]!H_(11,G108,G109)","v":34.474087894438838},{"$f":"[2]!H_(11,H108,H109)","v":31.637487763840028},{"$f":"[2]!H_(11,I108,I109)","v":47.124408447177167},{"$f":"[2]!H_(11,J108,J109)","v":22.928391086944622},{"$f":"[2]!H_(11,K108,K109)","v":22.978636016223128},{"$f":"[2]!H_(11,L108,L109)","v":23.019837825304901},{"$f":"[2]!H_(11,M108,M109)","v":23.194162115652354},{"$f":"[2]!H_(11,N108,N109)","v":23.435837618736521},{"$f":"[2]!H_(11,O108,O109)","v":23.540828745171325},{"$f":"[2]!H_(11,P108,P109)","v":23.708293106209872},{"$f":"[2]!H_(11,Q108,Q109)","v":24.01741665968888},{"$f":"[2]!H_(11,R108,R109)","v":24.370791806608725},{"$f":"[2]!H_(11,S108,S109)","v":24.778300394265507},{"$f":"[2]!H_(11,T108,T109)","v":25.252940254207751},{"$f":"[2]!H_(11,U108,U109)","v":25.81187164457625},{"$f":"[2]!H_(11,V108,V109)","v":26.477600887525416},{"$f":"[2]!H_(11,W108,W109)","v":27.278921909281852},{"$f":"[2]!H_(11,X108,X109)","v":28.250773840551208},{"$f":"[2]!H_(11,Y108,Y109)","v":29.432031874251791},{"$f":"[2]!H_(11,Z108,Z109)","v":30.861649517019661},{"$f":"[2]!H_(11,AA108,AA109)","v":32.575922946470207},{"$f":"[2]!H_(11,AB108,AB109)","v":34.627801563667134}]
[null,"Sin = Sout",null,{"$f":"[2]!S_(11,D106,D107)","v":5.0600046690749361},null,{"$f":"[2]!S_(11,F106,F107)","v":6.606972813997622},{"$f":"[2]!S_(11,G106,G107)","v":6.9458302073485418},{"$f":"[2]!S_(11,H106,H107)","v":6.3296128173799451},{"$f":"[2]!S_(11,I106,I107)","v":8.3000204511344844},{"$f":"[2]!S_(11,J106,J107)","v":5.0529733672692334},{"$f":"[2]!S_(11,K106,K107)","v":5.0654417470037325},{"$f":"[2]!S_(11,L106,L107)","v":5.0755773865215996},{"$f":"[2]!S_(11,M106,M107)","v":5.1176417880347849},{"$f":"[2]!S_(11,N106,N107)","v":5.1740184148189101},{"$f":"[2]!S_(11,O106,O107)","v":5.1978956859755527},{"$f":"[2]!S_(11,P106,P107)","v":5.2352994367007346},{"$f":"[2]!S_(11,Q106,Q107)","v":5.3024047191748664},{"$f":"[2]!S_(11,R106,R107)","v":5.3765112439126437},{"$f":"[2]!S_(11,S106,S107)","v":5.4591418721637179},{"$f":"[2]!S_(11,T106,T107)","v":5.5522839217210835},{"$f":"[2]!S_(11,U106,U107)","v":5.6585379719602162},{"$f":"[2]!S_(11,V106,V107)","v":5.7812790786999493},{"$f":"[2]!S_(11,W106,W107)","v":5.9247681165450805},{"$f":"[2]!S_(11,X106,X107)","v":6.0940797015742083},{"$f":"[2]!S_(11,Y106,Y107)","v":6.294692674085951},{"$f":"[2]!S_(11,Z106,Z107)","v":6.531792268753704},{"$f":"[2]!S_(11,AA106,AA107)","v":6.8096366775627946},{"$f":"[2]!S_(11,AB106,AB107)","v":7.1308608379485277}]
[null,"Tout(iso)",null,{"$f":"[1]!HeCalc(2,0,1,D108*10^5,8,D125*1000,1)","v":5.9351387842537191},null,{"$f":"[1]!HeCalc(2,0,1,F108*10^5,8,F125*1000,1)","v":6.6999950291002683},{"$f":"[1]!HeCalc(2,0,1,G108*10^5,8,G125*1000,1)","v":7.0241819850115181},{"$f":"[1]!HeCalc(2,0,1,H108*10^5,8,H125*1000,1)","v":6.5619829946977015},{"$f":"[1]!HeCalc(2,0,1,I108*10^5,8,I125*1000,1)","v":8.0488946725573083},{"$f":"[1]!HeCalc(2,0,1,J108*10^5,8,J125*1000,1)","v":5.9309053922662232},{"$f":"[1]!HeCalc(2,0,1,K108*10^5,8,K125*1000,1)","v":5.9384010068296593},{"$f":"[1]!HeCalc(2,0,1,L108*10^5,8,L125*1000,1)","v":5.944456168329987},{"$f":"[1]!HeCalc(2,0,1,M108*10^5,8,M125*1000,1)","v":5.9692285958188567},{"$f":"[1]!HeCalc(2,0,1,N108*10^5,8,N125*1000,1)","v":6.001560455371191},{"$f":"[1]!HeCalc(2,0,1,O108*10^5,8,O125*1000,1)","v":6.0149678507872988},{"$f":"[1]!HeCalc(2,0,1,P108*10^5,8,P125*1000,1)","v":6.035645284943814},{"$f":"[1]!HeCalc(2,0,1,Q108*10^5,8,Q125*1000,1)","v":6.0718071256425254},{"$f":"[1]!HeCalc(2,0,1,R108*10^5,8,R125*1000,1)","v":6.1104767799272244},{"$f":"[1]!HeCalc(2,0,1,S108*10^5,8,S125*1000,1)","v":6.1522386175176109},{"$f":"[1]!HeCalc(2,0,1,T108*10^5,8,T125*1000,1)","v":6.1979006550766433},{"$f":"[1]!HeCalc(2,0,1,U108*10^5,8,U125*1000,1)","v":6.2485979727804208},{"$f":"[1]!HeCalc(2,0,1,V108*10^5,8,V125*1000,1)","v":6.3059395805685625},{"$f":"[1]!HeCalc(2,0,1,W108*10^5,8,W125*1000,1)","v":6.3722004271630208},{"$f":"[1]!HeCalc(2,0,1,X108*10^5,8,X125*1000,1)","v":6.4505371594073715},{"$f":"[1]!HeCalc(2,0,1,Y108*10^5,8,Y125*1000,1)","v":6.5451882609877448},{"$f":"[1]!HeCalc(2,0,1,Z108*10^5,8,Z125*1000,1)","v":6.6616840821189891},{"$f":"[1]!HeCalc(2,0,1,AA108*10^5,8,AA125*1000,1)","v":6.8072433072756411},{"$f":"[1]!HeCalc(2,0,1,AB108*10^5,8,AB125*1000,1)","v":6.9913024076350263}]
[null,"Hout(iso)",null,{"$f":"[2]!H_(11,D108,D126)","v":20.940541836947467},null,{"$f":"[2]!H_(11,F108,F126)","v":30.727518437529557},{"$f":"[2]!H_(11,G108,G126)","v":33.517503797489027},{"$f":"[2]!H_(11,H108,H126)","v":28.888552710608689},{"$f":"[2]!H_(11,I108,I126)","v":43.671785543492518},{"$f":"[2]!H_(11,J108,J126)","v":20.89882495832201},{"$f":"[2]!H_(11,K108,K126)","v":20.972820445679236},{"$f":"[2]!H_(11,L108,L126)","v":21.033040686749398},{"$f":"[2]!H_(11,M108,M126)","v":21.283613749559883},{"$f":"[2]!H_(11,N108,N126)","v":21.621054644955287},{"$f":"[2]!H_(11,O108,O126)","v":21.76451602215565},{"$f":"[2]!H_(11,P108,P126)","v":21.989886225505693},{"$f":"[2]!H_(11,Q108,Q126)","v":22.396129683012887},{"$f":"[2]!H_(11,R108,R126)","v":22.847530739478753},{"$f":"[2]!H_(11,S108,S126)","v":23.354177689129866},{"$f":"[2]!H_(11,T108,T126)","v":23.929346697015806},{"$f":"[2]!H_(11,U108,U126)","v":24.590603210318516},{"$f":"[2]!H_(11,V108,V126)","v":25.361092138646899},{"$f":"[2]!H_(11,W108,W126)","v":26.270683686903297},{"$f":"[2]!H_(11,X108,X126)","v":27.35619174227045},{"$f":"[2]!H_(11,Y108,Y126)","v":28.659700884036013},{"$f":"[2]!H_(11,Z108,Z126)","v":30.225253888769931},{"$f":"[2]!H_(11,AA108,AA126)","v":32.096129609294515},{"$f":"[2]!H_(11,AB108,AB126)","v":34.311838516653928}]
[null,"ΔHs",null,{"$f":"D123-D127","v":7.2103427415074144},null,10.162622016289379,3.2941401641763406,9.5071354477194028,10.388046765125445,{"$f":"J123-J127","v":7.2458202339883506},7.1602975294261491,{"$f":"L123-L127","v":7.0917618816777157},6.8165514968676852,6.4700403597067186,6.3306225093551909,6.1205845199477729,{"$f":"Q123-Q127","v":5.7679646703277889},5.4118967222635703,5.05198681843736,4.6876424323217059,{"$f":"U123-U127","v":4.3178982261006951},3.9410700049193856,3.5540847726814846,3.15126671973076,2.7223997637890847,2.2501717869781608,1.70730317228319,1.0532100449135697]
[null,"u1","m/s",{"$f":"(2*52.7%*D128*1000*D110)^0.5","v":73.971514109656738},null,{"$f":"PI()*$D$130*F112","v":79.358932346146773},{"$f":"PI()*$D$130*G112","v":45.756851272031192},78.236506689583592,70.477364297455139,{"$f":"PI()*$D$130*J112","v":74.196324576948101},{"$f":"PI()*$D$130*K112","v":73.666915662823286},{"$f":"PI()*$D$130*L112","v":73.241492360631227},71.522438035125404,69.332684064919107,68.443344398729792,67.094176783547638,{"$f":"PI()*$D$130*Q112","v":64.802837132827193},62.453754082233537,60.040831912810631,57.556140443468522,{"$f":"PI()*$D$130*U112","v":54.988722078966951},52.322240467590547,49.530238706076823,46.566512097726502,43.345656708976598,39.702261805061625,35.287518102540723,28.921552356768139]
[null,"D1",null,{"$f":"D129/PI()/D112","v":2.8097690020390816E-2}]
[null,"Co = (2*ΔHs)^0,5",null,{"$f":"(2000*D128)^0.5","v":120.0861585821398},null,142.56663015088333,81.16822240478524,137.89224378274076,144.13914641848999,{"$f":"(2000*J128)^0.5","v":120.38122971616755},119.66868871535401,{"$f":"(2000*L128)^0.5","v":119.0946000595973},116.76087955190887,113.75447560168099,112.52219789317299,110.63981670219607,{"$f":"(2000*Q128)^0.5","v":107.40544371983934},104.03746173627623,100.5185238494613,96.826054678704182,{"$f":"(2000*U128)^0.5","v":92.928986071092964},88.781417029909875,84.309961127751507,79.3884968963484,73.788884851162848,67.08460012518762,58.434633091740892,45.895752415960445]
[null,"u1/Co",null,{"$f":"D129/D131","v":0.61598701285010871},null,0.55664451254938407,0.56372863562099662,0.56737423761738826,0.48895366767909759,{"$f":"J129/J131","v":0.61634463073592705},0.61559056469690809,{"$f":"L129/L131","v":0.61498583751051461},0.61255480696621833,0.60949412054513086,0.60826526392338121,0.60641981145125934,{"$f":"Q129/Q131","v":0.60334779028390317},0.60030063248320187,0.59731111852308005,0.59442823147608181,{"$f":"U129/U131","v":0.59172841977312896},0.58933774902425273,0.58747789755264668,0.58656498004395907,0.58742799537366241,0.59182378267102453,0.6038802031517887,0.63015749463365467]
[null,"U1/C0 off de / U1/C0 nom",null,{"$f":"D132/$D$50","v":0.96076892283052273},null,{"$f":"F132/$D132","v":0.90366274115723155},0.91516318341304315,0.9210814932480571,0.79377268916232369,1.0005805607559219,0.99935640176670881,{"$f":"L132/$D132","v":0.99837468109114547},0.99442811972932688,0.98945936818548186,0.98746442901287845,0.98446850144683584,{"$f":"Q132/$D132","v":0.97948134895291838},0.97453455991819116,0.96968135051968518,0.96500124040882518,{"$f":"U132/$D132","v":0.96061833679782027},0.9567372959657825,0.95371799290775094,0.95223595271917028,0.95363698116895901,0.96077314996093277,0.98034567377921977,1.0230045138743764]
[null,"Rdt",null,{"$f":"(0.321*D133^4-1.6098*D133^3+1.316*D133^2+0.9448*D133)*($D110/0.97215493)","v":0.7171786087866604},null,{"$f":"(0.321*F133^4-1.6098*F133^3+1.316*F133^2+0.9448*F133)*($D110/0.97215493)","v":0.70696991088814909},0.70961038411638022,0.7108555917631959,0.66763502805420782,0.71989836028184095,0.71986980117622079,{"$f":"(0.321*L133^4-1.6098*L133^3+1.316*L133^2+0.9448*L133)*($D110/0.97215493)","v":0.71984435296740734},0.71971922063953186,0.71950979052459352,0.71940947033393243,0.71924137708570512,{"$f":"(0.321*Q133^4-1.6098*Q133^3+1.316*Q133^2+0.9448*Q133)*($D110/0.97215493)","v":0.71891523694471871},0.71853472213737135,0.71810640915833424,0.71764195407852505,{"$f":"(0.321*U133^4-1.6098*U133^3+1.316*U133^2+0.9448*U133)*($D110/0.97215493)","v":0.71716136644333373},0.71669908250021996,0.71631565208875514,0.71611984124278449,0.7163050778533675,0.71717909205057673,0.71897590016613477,0.71979519638868261]
[]
[null,"CV220A"]
[null,"flow",null,{"$f":"$D$105-D105","v":0},null,{"$f":"$D$105-F105","v":43.087427916098761},183.40062947601032,36.441806886393238,133.28258660315834,-1.7374979762793146,2.0867063669208505,5.1460278316819199,17.383360924827173,32.680027056687607,38.798696310235528,47.976703789840769,{"$f":"$D$105-Q105","v":63.273359144770268},78.570025532817681,93.866692241092039,109.16335904460186,{"$f":"$D$105-U105","v":124.46002826745081},139.75669924297353,155.05337567789189,170.35006949647848,185.6468317119926,200.94334843187238,216.24085256093045,231.53667852472708]
[null,"Pin","Bara",13.5,null,13.5,13.5,13.5,13.5,13.5,13.5,13.5,13.5,13.5,13.5,13.5,13.5,13.5,13.5,13.5,13.5,13.5,13.5,13.5,13.5,13.5,13.5,13.5]
[null,"Tin","K",100,null,100,100,100,100,100,100,100,100,100,100,100,100,100,100,100,100,100,100,100,100,100,100,100]
[null,"Rho",null,{"$f":"[2]!rho_(11,D138,D139)","v":6.3733311238230197},null,{"$f":"[2]!rho_(11,F138,F139)","v":6.3733311238230197},{"$f":"[2]!rho_(11,G138,G139)","v":6.3733311238230197},{"$f":"[2]!rho_(11,H138,H139)","v":6.3733311238230197},{"$f":"[2]!rho_(11,I138,I139)","v":6.3733311238230197},{"$f":"[2]!rho_(11,J138,J139)","v":6.3733311238230197},{"$f":"[2]!rho_(11,K138,K139)","v":6.3733311238230197},{"$f":"[2]!rho_(11,L138,L139)","v":6.3733311238230197},{"$f":"[2]!rho_(11,M138,M139)","v":6.3733311238230197},{"$f":"[2]!rho_(11,N138,N139)","v":6.3733311238230197},{"$f":"[2]!rho_(11,O138,O139)","v":6.3733311238230197},{"$f":"[2]!rho_(11,P138,P139)","v":6.3733311238230197},{"$f":"[2]!rho_(11,Q138,Q139)","v":6.3733311238230197},{"$f":"[2]!rho_(11,R138,R139)","v":6.3733311238230197},{"$f":"[2]!rho_(11,S138,S139)","v":6.3733311238230197},{"$f":"[2]!rho_(11,T138,T139)","v":6.3733311238230197},{"$f":"[2]!rho_(11,U138,U139)","v":6.3733311238230197},{"$f":"[2]!rho_(11,V138,V139)","v":6.3733311238230197},{"$f":"[2]!rho_(11,W138,W139)","v":6.3733311238230197},{"$f":"[2]!rho_(11,X138,X139)","v":6.3733311238230197},{"$f":"[2]!rho_(11,Y138,Y139)","v":6.3733311238230197},{"$f":"[2]!rho_(11,Z138,Z139)","v":6.3733311238230197},{"$f":"[2]!rho_(11,AA138,AA139)","v":6.3733311238230197},{"$f":"[2]!rho_(11,AB138,AB139)","v":6.3733311238230197}]
[null,"Pout",null,{"$f":"1.15","v":1.1499999999999999},null,{"$f":"1.15","v":1.1499999999999999},1.1499999999999999,1.1499999999999999,1.1499999999999999,1.1499999999999999,1.1499999999999999,1.1499999999999999,1.1499999999999999,1.1499999999999999,1.1499999999999999,1.1499999999999999,1.1499999999999999,1.1499999999999999,1.1499999999999999,1.1499999999999999,1.1499999999999999,1.1499999999999999,1.1499999999999999,1.1499999999999999,1.1499999999999999,1.1499999999999999,1.1499999999999999,1.1499999999999999]
[null,"Cvs",null,35,null,35,35,35,35,35,35,35,35,35,35,35,35,35,35,35,35,35,35,35,35,35,35,35]
[null,"Range",null,100,null,100,100,100,100,100,100,100,100,100,100,100,100,100,100,100,100,100,100,100,100,100,100,100]
[null,"Flow",null,{"$f":"IF(D138/2>D141,\"S\",\"SS\")","v":"S"},null,{"$f":"IF(F138/2>F141,\"S\",\"SS\")","v":"S"},"S","S","S","S","S","S","S","S","S","S",{"$f":"IF(Q138/2>Q141,\"S\",\"SS\")","v":"S"},"S","S","S",{"$f":"IF(U138/2>U141,\"S\",\"SS\")","v":"S"},"S","S","S","S","S","S","S"]
[null,"Cv",null,{"$f":"[2]!Cv_Simple(D139,D138,D141/1000,D140,D137,D144)","v":0},{"$f":"[2]!Cv_Simple(E139,E138,E141/1000,E140,E137,E144)","v":0},{"$f":"[2]!Cv_Simple(F139,F138,F141/1000,F140,F137,F144)","v":0.98567455144042038},{"$f":"[2]!Cv_Simple(G139,G138,G141/1000,G140,G137,G144)","v":4.195500681652776},{"$f":"[2]!Cv_Simple(H139,H138,H141/1000,H140,H137,H144)","v":0.83364831445423482},{"$f":"[2]!Cv_Simple(I139,I138,I141/1000,I140,I137,I144)","v":3.0489927136217401},{"$f":"[2]!Cv_Simple(J139,J138,J141/1000,J140,J137,J144)","v":-3.9747267851137379E-2},{"$f":"[2]!Cv_Simple(K139,K138,K141/1000,K140,K137,K144)","v":4.7735812084389734E-2},{"$f":"[2]!Cv_Simple(L139,L138,L141/1000,L140,L137,L144)","v":0.11772131501026144},{"$f":"[2]!Cv_Simple(M139,M138,M141/1000,M140,M137,M144)","v":0.39766440724822311},{"$f":"[2]!Cv_Simple(N139,N138,N141/1000,N140,N137,N144)","v":0.74759326717959029},{"$f":"[2]!Cv_Simple(O139,O138,O141/1000,O140,O137,O144)","v":0.88756487522374938},{"$f":"[2]!Cv_Simple(P139,P138,P141/1000,P140,P137,P144)","v":1.0975223696277416},{"$f":"[2]!Cv_Simple(Q139,Q138,Q141/1000,Q140,Q137,Q144)","v":1.4474509830243982},{"$f":"[2]!Cv_Simple(R139,R138,R141/1000,R140,R137,R144)","v":1.7973798488163379},{"$f":"[2]!Cv_Simple(S139,S138,S141/1000,S140,S137,S144)","v":2.1473087219338374},{"$f":"[2]!Cv_Simple(T139,T138,T141/1000,T140,T137,T144)","v":2.4972375972299585},{"$f":"[2]!Cv_Simple(U139,U138,U141/1000,U140,U137,U144)","v":2.8471665278712486},{"$f":"[2]!Cv_Simple(V139,V138,V141/1000,V140,V137,V144)","v":3.19709549860697},{"$f":"[2]!Cv_Simple(W139,W138,W141/1000,W140,W137,W144)","v":3.5470245942326577},{"$f":"[2]!Cv_Simple(X139,X138,X141/1000,X140,X137,X144)","v":3.8969540875297812},{"$f":"[2]!Cv_Simple(Y139,Y138,Y141/1000,Y140,Y137,Y144)","v":4.2468851454854173},{"$f":"[2]!Cv_Simple(Z139,Z138,Z141/1000,Z140,Z137,Z144)","v":4.5968105874456011},{"$f":"[2]!Cv_Simple(AA139,AA138,AA141/1000,AA140,AA137,AA144)","v":4.9467586175282587},{"$f":"[2]!Cv_Simple(AB139,AB138,AB141/1000,AB140,AB137,AB144)","v":5.2966682576472701}]
[null,"Trim",null,{"$f":"IF(D145=0,0,[2]!Trim_From_Cv(D145/D142,D143))","v":0},null,{"$f":"IF(F145=0,0,[2]!Trim_From_Cv(F145/F142,F143))","v":0.22483274977579157},{"$f":"IF(G145=0,0,[2]!Trim_From_Cv(G145/G142,G143))","v":0.53935787581888772},{"$f":"IF(H145=0,0,[2]!Trim_From_Cv(H145/H142,H143))","v":0.18845741603101038},{"$f":"IF(I145=0,0,[2]!Trim_From_Cv(I145/I142,I143))","v":0.47004417107714053},{"$f":"IF(J145<0.00001,0,[2]!Trim_From_Cv(J145/J142,J143))","v":0},{"$f":"IF(K145=0,0,[2]!Trim_From_Cv(K145/K142,K143))","v":8.6055032083920176E-3},{"$f":"IF(L145=0,0,[2]!Trim_From_Cv(L145/L142,L143))","v":2.1222036659311674E-2},{"$f":"IF(M145=0,0,[2]!Trim_From_Cv(M145/M142,M143))","v":7.1688365254751113E-2},{"$f":"IF(N145=0,0,[2]!Trim_From_Cv(N145/N142,N143))","v":0.16479866856033645},{"$f":"IF(O145=0,0,[2]!Trim_From_Cv(O145/O142,O143))","v":0.2020660313205174},{"$f":"IF(P145=0,0,[2]!Trim_From_Cv(P145/P142,P143))","v":0.24817266820762934},{"$f":"IF(Q145=0,0,[2]!Trim_From_Cv(Q145/Q142,Q143))","v":0.30826791060060321},{"$f":"IF(R145=0,0,[2]!Trim_From_Cv(R145/R142,R143))","v":0.35528591198650411},{"$f":"IF(S145=0,0,[2]!Trim_From_Cv(S145/S142,S143))","v":0.3939132218859468},{"$f":"IF(T145=0,0,[2]!Trim_From_Cv(T145/T142,T143))","v":0.42669591024541187},{"$f":"IF(U145=0,0,[2]!Trim_From_Cv(U145/U142,U143))","v":0.4551724124908057},{"$f":"IF(V145=0,0,[2]!Trim_From_Cv(V145/V142,V143))","v":0.48034378233834135},{"$f":"IF(W145=0,0,[2]!Trim_From_Cv(W145/W142,W143))","v":0.5028980777138502},{"$f":"IF(X145=0,0,[2]!Trim_From_Cv(X145/X142,X143))","v":0.52332862238788347},{"$f":"IF(Y145=0,0,[2]!Trim_From_Cv(Y145/Y142,Y143))","v":0.54200123578000936},{"$f":"IF(Z145=0,0,[2]!Trim_From_Cv(Z145/Z142,Z143))","v":0.5591942822862751},{"$f":"IF(AA145=0,0,[2]!Trim_From_Cv(AA145/AA142,AA143))","v":0.57512633732945762},{"$f":"IF(AB145=0,0,[2]!Trim_From_Cv(AB145/AB142,AB143))","v":0.58996736429408192}]
[null,"Tout",null,{"$f":"[2]!T_P_H_(11,D95,[2]!H_(11,D138,D139))","v":99.108406127680922},null,{"$f":"[2]!T_P_H_(11,F95,[2]!H_(11,F138,F139))","v":99.108406127680922},{"$f":"[2]!T_P_H_(11,G95,[2]!H_(11,G138,G139))","v":99.108406127680922},{"$f":"[2]!T_P_H_(11,H95,[2]!H_(11,H138,H139))","v":99.108406127680922},{"$f":"[2]!T_P_H_(11,I95,[2]!H_(11,I138,I139))","v":99.108406127680922},{"$f":"[2]!T_P_H_(11,J95,[2]!H_(11,J138,J139))","v":99.108406127680922},{"$f":"[2]!T_P_H_(11,K95,[2]!H_(11,K138,K139))","v":99.108406127680922},{"$f":"[2]!T_P_H_(11,L95,[2]!H_(11,L138,L139))","v":99.108406127680922},{"$f":"[2]!T_P_H_(11,M95,[2]!H_(11,M138,M139))","v":99.108406127680922},{"$f":"[2]!T_P_H_(11,N95,[2]!H_(11,N138,N139))","v":99.108406127680922},{"$f":"[2]!T_P_H_(11,O95,[2]!H_(11,O138,O139))","v":99.108406127680922},{"$f":"[2]!T_P_H_(11,P95,[2]!H_(11,P138,P139))","v":99.108406127680922},{"$f":"[2]!T_P_H_(11,Q95,[2]!H_(11,Q138,Q139))","v":99.108406127680922},{"$f":"[2]!T_P_H_(11,R95,[2]!H_(11,R138,R139))","v":99.108406127680922},{"$f":"[2]!T_P_H_(11,S95,[2]!H_(11,S138,S139))","v":99.108406127680922},{"$f":"[2]!T_P_H_(11,T95,[2]!H_(11,T138,T139))","v":99.108406127680922},{"$f":"[2]!T_P_H_(11,U95,[2]!H_(11,U138,U139))","v":99.108406127680922},{"$f":"[2]!T_P_H_(11,V95,[2]!H_(11,V138,V139))","v":99.108406127680922},{"$f":"[2]!T_P_H_(11,W95,[2]!H_(11,W138,W139))","v":99.108406127680922},{"$f":"[2]!T_P_H_(11,X95,[2]!H_(11,X138,X139))","v":99.108406127680922},{"$f":"[2]!T_P_H_(11,Y95,[2]!H_(11,Y138,Y139))","v":99.108406127680922},{"$f":"[2]!T_P_H_(11,Z95,[2]!H_(11,Z138,Z139))","v":99.108406127680922},{"$f":"[2]!T_P_H_(11,AA95,[2]!H_(11,AA138,AA139))","v":99.108406127680922},{"$f":"[2]!T_P_H_(11,AB95,[2]!H_(11,AB138,AB139))","v":99.108406127680922}]
[null,"delta T",null,{"$f":"D147-D95","v":69.108406127680922},null,{"$f":"F147-F95","v":69.108406127680922},{"$f":"G147-G95","v":69.108406127680922},{"$f":"H147-H95","v":69.108406127680922},{"$f":"I147-I95","v":69.108406127680922},{"$f":"J147-J95","v":69.108406127680922},{"$f":"K147-K95","v":69.108406127680922},{"$f":"L147-L95","v":69.108406127680922},{"$f":"M147-M95","v":69.108406127680922},{"$f":"N147-N95","v":69.108406127680922},{"$f":"O147-O95","v":69.108406127680922},{"$f":"P147-P95","v":69.108406127680922},69.108406127680922,69.108406127680922,69.108406127680922,69.108406127680922,{"$f":"U147-U95","v":69.108406127680922},69.108406127680922,69.108406127680922,69.108406127680922,69.108406127680922,69.108406127680922,69.108406127680922,69.108406127680922]
[null,"CV335"]
[null,"Pin","Bara",{"$f":"D91","v":13.15},null,{"$f":"F91","v":13.15},13.25,13.5,12.25,{"$f":"J91","v":13.15},13.15,{"$f":"L91","v":13.15},13.15,13.15,13.15,13.15,{"$f":"Q91","v":13.15},13.15,13.15,13.15,{"$f":"U91","v":13.15},13.15,13.15,13.15,13.15,13.15,13.15,13.15]
[null,"Tin","K",{"$f":"D92","v":7.2906635679049048},null,{"$f":"F92","v":9.1661496679837366},8.6223146254179426,8.8279999999999994,10.795640526772669,{"$f":"J92","v":7.289570189226823},7.2875494761866335,{"$f":"L92","v":7.286091223216423},7.2817678358976652,7.2801751232542466,7.2808852270882953,7.2835767670375562,{"$f":"Q92","v":7.2929775419785274},7.309641747149449,7.3351707676476412,7.3715975333960877,7.4214865443397402,7.4880009996514749,7.574845195653733,7.6859260832822134,7.8246161009732589,{"$f":"Z92","v":7.9928254087617381},8.190438152641093,8.414996515030289]
[null,"Rho",null,{"$f":"[2]!rho_(11,D150,D151)","v":122.33933382974966},null,{"$f":"[2]!rho_(11,F150,F151)","v":92.385436868539188},{"$f":"[2]!rho_(11,G150,G151)","v":101.58811590421918},{"$f":"[2]!rho_(11,H150,H151)","v":99.5385923004863},{"$f":"[2]!rho_(11,I150,I151)","v":66.476961067945879},{"$f":"[2]!rho_(11,J150,J151)","v":122.3554602961871},{"$f":"[2]!rho_(11,K150,K151)","v":122.38525605267236},{"$f":"[2]!rho_(11,L150,L151)","v":122.40675166263661},{"$f":"[2]!rho_(11,M150,M151)","v":122.47044880873382},{"$f":"[2]!rho_(11,N150,N151)","v":122.4939022601133},{"$f":"[2]!rho_(11,O150,O151)","v":122.48344645754396},{"$f":"[2]!rho_(11,P150,P151)","v":122.44380344539697},{"$f":"[2]!rho_(11,Q150,Q151)","v":122.30519433940992},{"$f":"[2]!rho_(11,R150,R151)","v":122.05892824408417},{"$f":"[2]!rho_(11,S150,S151)","v":121.68027091130101},{"$f":"[2]!rho_(11,T150,T151)","v":121.13709609048141},{"$f":"[2]!rho_(11,U150,U151)","v":120.3877662475066},{"$f":"[2]!rho_(11,V150,V151)","v":119.37920067123139},{"$f":"[2]!rho_(11,W150,W151)","v":118.04655161202567},{"$f":"[2]!rho_(11,X150,X151)","v":116.31729006265563},{"$f":"[2]!rho_(11,Y150,Y151)","v":114.12277996026393},{"$f":"[2]!rho_(11,Z150,Z151)","v":111.41624187103298},{"$f":"[2]!rho_(11,AA150,AA151)","v":108.18992422198602},{"$f":"[2]!rho_(11,AB150,AB151)","v":104.49208532283211}]
[null,"dP",null,{"$f":"(D150-D108)*1000","v":8270},null,{"$f":"(F150-F108)*1000","v":8270},8070,8620.0000000000018,7070,{"$f":"(J150-J108)*1000","v":8270},8270,{"$f":"(L150-L108)*1000","v":8270},8270,8270,8270,8270,{"$f":"(Q150-Q108)*1000","v":8270},8270,8270,8270,8270,8270,8270,8270,8270,{"$f":"(Z150-Z108)*1000","v":8270},8270,8270]
[null,"Cvs",null,5,null,{"$f":"$D$154","v":5},{"$f":"$D$154","v":5},5,5,5,5,5,5,5,5,5,5,5,5,5,5,5,5,5,5,5,5,5]
[null,"Range",null,250,null,{"$f":"$D$155","v":250},{"$f":"$D$155","v":250},250,250,250,250,250,250,250,250,250,250,250,250,250,250,250,250,250,250,250,250,250]
[null,"Flow",null,{"$f":"IF(D150/2>D108,\"S\",\"SS\")","v":"S"},null,{"$f":"IF(F150/2>F108,\"S\",\"SS\")","v":"S"},"S","S","S",{"$f":"IF(J150/2>J108,\"S\",\"SS\")","v":"S"},"S",{"$f":"IF(L150/2>L108,\"S\",\"SS\")","v":"S"},"S","S","S","S",{"$f":"IF(Q150/2>Q108,\"S\",\"SS\")","v":"S"},"S","S","S","S","S","S","S","S",{"$f":"IF(Z150/2>Z108,\"S\",\"SS\")","v":"S"},"S","S"]
[null,"Cv",null,{"$f":"[2]!Cv_Simple(D151,D150,D153/1000,D152,D105,D156)","v":2.1150953834914854},null,{"$f":"[2]!Cv_Simple(F151,F150,F153/1000,F152,F105,F156)","v":2.1716352414862659},{"$f":"[2]!Cv_Simple(G151,G150,G153/1000,G152,G105,G156)","v":1.2515831301016425},{"$f":"[2]!Cv_Simple(H151,H150,H153/1000,H152,H105,H156)","v":2.1033203578381747},{"$f":"[2]!Cv_Simple(I151,I150,I153/1000,I152,I105,I156)","v":1.9817782879768813},{"$f":"[2]!Cv_Simple(J151,J150,J153/1000,J152,J105,J156)","v":2.1241474190788745},{"$f":"[2]!Cv_Simple(K151,K150,K153/1000,K152,K105,K156)","v":2.1036611201686193},{"$f":"[2]!Cv_Simple(L151,L150,L153/1000,L152,L105,L156)","v":2.0872958756017597},{"$f":"[2]!Cv_Simple(M151,M150,M153/1000,M152,M105,M156)","v":2.0220474787307618},{"$f":"[2]!Cv_Simple(N151,N150,N153/1000,N152,N105,N156)","v":1.9409797338049428},{"$f":"[2]!Cv_Simple(O151,O150,O153/1000,O152,O105,O156)","v":1.9087115189022288},{"$f":"[2]!Cv_Simple(P151,P150,P153/1000,P152,P105,P156)","v":1.8604860183001737},{"$f":"[2]!Cv_Simple(Q151,Q150,Q153/1000,Q152,Q105,Q156)","v":1.7806034998830667},{"$f":"[2]!Cv_Simple(R151,R150,R153/1000,R152,R105,R156)","v":1.7013807324961381},{"$f":"[2]!Cv_Simple(S151,S150,S153/1000,S152,S105,S156)","v":1.622881843819852},{"$f":"[2]!Cv_Simple(T151,T150,T153/1000,T152,T105,T156)","v":1.5451904291061835},{"$f":"[2]!Cv_Simple(U151,U150,U153/1000,U152,U105,U156)","v":1.4684132969631714},{"$f":"[2]!Cv_Simple(V151,V150,V153/1000,V152,V105,V156)","v":1.3926807087233912},{"$f":"[2]!Cv_Simple(W151,W150,W153/1000,W152,W105,W156)","v":1.318136181780762},{"$f":"[2]!Cv_Simple(X151,X150,X153/1000,X152,X105,X156)","v":1.2449044401923759},{"$f":"[2]!Cv_Simple(Y151,Y150,Y153/1000,Y152,Y105,Y156)","v":1.1730284787414345},{"$f":"[2]!Cv_Simple(Z151,Z150,Z153/1000,Z152,Z105,Z156)","v":1.1023921012824629},{"$f":"[2]!Cv_Simple(AA151,AA150,AA153/1000,AA152,AA105,AA156)","v":1.0326492805600551},{"$f":"[2]!Cv_Simple(AB151,AB150,AB153/1000,AB152,AB105,AB156)","v":0.96320334593709034}]
[null,"Trim",null,{"$f":"[2]!Trim_From_Cv(D157/D154,D155)","v":0.84418290463815637},null,{"$f":"[2]!Trim_From_Cv(F157/F154,F155)","v":0.84896072369758668},{"$f":"[2]!Trim_From_Cv(G157/G154,G155)","v":0.74915539945276188},{"$f":"[2]!Trim_From_Cv(H157/H154,H155)","v":0.84317181512922723},{"$f":"[2]!Trim_From_Cv(I157/I154,I155)","v":0.83239157908985717},{"$f":"[2]!Trim_From_Cv(J157/J154,J155)","v":0.84495635886011555},{"$f":"[2]!Trim_From_Cv(K157/K154,K155)","v":0.84320115491739012},{"$f":"[2]!Trim_From_Cv(L157/L154,L155)","v":0.84178670525598887},{"$f":"[2]!Trim_From_Cv(M157/M154,M155)","v":0.83603482402471807},{"$f":"[2]!Trim_From_Cv(N157/N154,N155)","v":0.8286241515627033},{"$f":"[2]!Trim_From_Cv(O157/O154,O155)","v":0.82558791780327734},{"$f":"[2]!Trim_From_Cv(P157/P154,P155)","v":0.82095315471990948},{"$f":"[2]!Trim_From_Cv(Q157/Q154,Q155)","v":0.81300500427802447},{"$f":"[2]!Trim_From_Cv(R157/R154,R155)","v":0.80476221574784068},{"$f":"[2]!Trim_From_Cv(S157/S154,S155)","v":0.79620711902380736},{"$f":"[2]!Trim_From_Cv(T157/T154,T155)","v":0.78732245467936435},{"$f":"[2]!Trim_From_Cv(U157/U154,U155)","v":0.77809215664981357},{"$f":"[2]!Trim_From_Cv(V157/V154,V155)","v":0.76850194646345904},{"$f":"[2]!Trim_From_Cv(W157/W154,W155)","v":0.75853869529162932},{"$f":"[2]!Trim_From_Cv(X157/X154,X155)","v":0.74818636570788011},{"$f":"[2]!Trim_From_Cv(Y157/Y154,Y155)","v":0.73741567927879592},{"$f":"[2]!Trim_From_Cv(Z157/Z154,Z155)","v":0.7261674982954629},{"$f":"[2]!Trim_From_Cv(AA157/AA154,AA155)","v":0.71433098615747659},{"$f":"[2]!Trim_From_Cv(AB157/AB154,AB155)","v":0.70172230364469146}]
[null,"Tout",null,{"$f":"[2]!T_P_H_(11,D108,[2]!H_(11,D150,D151))","v":6.5080687114154943},null,{"$f":"[2]!T_P_H_(11,F108,[2]!H_(11,F150,F151))","v":7.630998961978265},{"$f":"[2]!T_P_H_(11,G108,[2]!H_(11,G150,G151))","v":7.3219643390544888},{"$f":"[2]!T_P_H_(11,H108,[2]!H_(11,H150,H151))","v":7.3519064983716929},{"$f":"[2]!T_P_H_(11,I108,[2]!H_(11,I150,I151))","v":9.4038371934393972},{"$f":"[2]!T_P_H_(11,J108,[2]!H_(11,J150,J151))","v":6.5076151867744905},{"$f":"[2]!T_P_H_(11,K108,[2]!H_(11,K150,K151))","v":6.5067773978318657},{"$f":"[2]!T_P_H_(11,L108,[2]!H_(11,L150,L151))","v":6.5061731162157059},{"$f":"[2]!T_P_H_(11,M108,[2]!H_(11,M150,M151))","v":6.5043830866027719},{"$f":"[2]!T_P_H_(11,N108,[2]!H_(11,N150,N151))","v":6.5037242233751265},{"$f":"[2]!T_P_H_(11,O108,[2]!H_(11,O150,O151))","v":6.5040179365079505},{"$f":"[2]!T_P_H_(11,P108,[2]!H_(11,P150,P151))","v":6.5051317682126424},{"$f":"[2]!T_P_H_(11,Q108,[2]!H_(11,Q150,Q151))","v":6.5090290145093253},{"$f":"[2]!T_P_H_(11,R108,[2]!H_(11,R150,R151))","v":6.5159643141771708},{"$f":"[2]!T_P_H_(11,S108,[2]!H_(11,S150,S151))","v":6.5266570107899007},{"$f":"[2]!T_P_H_(11,T108,[2]!H_(11,T150,T151))","v":6.5420611187463784},{"$f":"[2]!T_P_H_(11,U108,[2]!H_(11,U150,U151))","v":6.5634502432004949},{"$f":"[2]!T_P_H_(11,V108,[2]!H_(11,V150,V151))","v":6.5925207653239495},{"$f":"[2]!T_P_H_(11,W108,[2]!H_(11,W150,W151))","v":6.6314917157616708},{"$f":"[2]!T_P_H_(11,X108,[2]!H_(11,X150,X151))","v":6.6831459609521859},{"$f":"[2]!T_P_H_(11,Y108,[2]!H_(11,Y150,Y151))","v":6.750739300631845},{"$f":"[2]!T_P_H_(11,Z108,[2]!H_(11,Z150,Z151))","v":6.8377830170846385},{"$f":"[2]!T_P_H_(11,AA108,[2]!H_(11,AA150,AA151))","v":6.9478177208080893},{"$f":"[2]!T_P_H_(11,AB108,[2]!H_(11,AB150,AB151))","v":7.0839372537996068}]
[null,"delta T",null,{"$f":"D159-D108","v":1.6280687114154944},null,{"$f":"F159-F108","v":2.7509989619782651},2.1419643390544891,2.471906498371693,4.2238371934393975,1.6276151867744906,1.6267773978318658,{"$f":"L159-L108","v":1.626173116215706},{"$f":"M159-M108","v":1.624383086602772},{"$f":"N159-N108","v":1.6237242233751266},{"$f":"O159-O108","v":1.6240179365079506},{"$f":"P159-P108","v":1.6251317682126425},1.6290290145093254,1.6359643141771709,1.6466570107899008,1.6620611187463785,1.683450243200495,1.7125207653239496,1.751491715761671,1.803145960952186,1.8707393006318451,{"$f":"Z159-Z108","v":1.9577830170846386},2.0678177208080895,2.2039372537996069]
[]
[null,null,null,null,null,null,null,null,null,null,null,null,null,null,null,null,null,null,null,null,null,null,"Ratio Cv",0.5]
[null,null,null,null,null,null,null,null,null,null,null,null,null,null,null,null,null,null,null,null,null,null,null,{"$f":"[2]!Trim_From_Cv(X162,X155)","v":0.87446308307325438}]
[]
[null,null,null,null,null,null,null,null,null,null,null,null,{"$f":"M48","v":"T1"},{"$f":"M170","v":"T3"},"T1+T2"]
[null,"Courbe de rendement TC3",null,null,null,null,null,null,null,null,null,{"$f":"L171","v":"MAX"},{"$f":"M49","v":"192g/s @ 14,77 b ; 40K"},{"$f":"M171","v":"357g/s @ 13,07 b ; 9,16K"},{"$f":"F105+F59","v":548.2843711241045}]
[null,null,null,null,null,null,null,null,null,null,null,{"$f":"L172","v":"MIN"},{"$f":"M50","v":"159g/s @ 12,39 b ; 40,73K"},{"$f":"M172","v":"216g/s @ 7,369 b ; 7,912K"},{"$f":"G105+G59","v":375.65514167947907}]
[null,null,null,null,null,null,null,null,null,null,null,{"$f":"L173","v":"STS"},{"$f":"M51","v":"104g/s @ 10,3 b ; 66K"},{"$f":"M173","v":"363g/s @ 13,07 b ; 8,828K"},{"$f":"H105+H59","v":444.43944007926183}]
[null,null,null,null,null,null,null,null,null,null,null,{"$f":"L174","v":"BAKING"},{"$f":"M52","v":"125g/s @ 9,25 b ; 37,12K"},{"$f":"M174","v":"267g/s @ 10,48 b ; 10,55K"},{"$f":"I105+I59","v":391.06027121173315}]
[null,null,null,null,"d : mm",null,null,null,null,null,null,null,"T3"]
[null,null,null,null,"N : Hz",null,null,null,null,null,null,"MAX",{"$f":"ROUND(F105,0)&\"g/s @ \"&F106&\" b ; \"&F107&\"K\"","v":"357g/s @ 13,07 b ; 9,16K"}]
[null,null,null,null,"H : J/kG",null,null,null,null,null,null,"MIN",{"$f":"ROUND(G105,0)&\"g/s @ \"&G106&\" b ; \"&G107&\"K\"","v":"216g/s @ 7,369 b ; 7,912K"}]
[null,null,null,null,null,null,null,null,null,null,null,"STS",{"$f":"ROUND(H105,0)&\"g/s @ \"&H106&\" b ; \"&H107&\"K\"","v":"363g/s @ 13,07 b ; 8,828K"}]
[null,null,null,null,null,null,null,null,null,null,null,"BAKING",{"$f":"ROUND(I105,0)&\"g/s @ \"&I106&\" b ; \"&I107&\"K\"","v":"267g/s @ 10,48 b ; 10,55K"}]
[]
[]
[]
[null,"rendement=(0,321*rap^4 - 1,6098*rap^3 + 1,316*rap^2 + 0,9448*rap)*(ETAgar/0,97)",null,null,null,null,null,null,"U1/CO _nom",0.64]
[null,null,null,null,null,null,null,null,"Eta_gar",0.8]
[null,"U1/C0",{"$f":"D29","v":0.78},{"$f":"D64","v":0.76},{"$f":"D110","v":0.72}]
[null,0,{"$f":"(0.321*B181^4-1.6098*B181^3+1.316*B181^2+0.9448*B181)*$D$29/0.97215493","v":0}]
[null,{"$f":"B181+0.05","v":0.05},{"$f":"(0.321*$B182^4-1.6098*$B182^3+1.316*$B182^2+0.9448*$B182)*$C$180/0.97215493","v":4.0382461852042459E-2},{"$f":"(0.321*$B182^4-1.6098*$B182^3+1.316*$B182^2+0.9448*$B182)*$D$180/0.97215493","v":3.9347014112246496E-2},{"$f":"(0.321*$B182^4-1.6098*$B182^3+1.316*$B182^2+0.9448*$B182)*$E$180/0.97215493","v":3.7276118632654578E-2}]
[null,0.1,{"$f":"(0.321*$B183^4-1.6098*$B183^3+1.316*$B183^2+0.9448*$B183)*$C$180/0.97215493","v":8.5098158171146673E-2},{"$f":"(0.321*$B183^4-1.6098*$B183^3+1.316*$B183^2+0.9448*$B183)*$D$180/0.97215493","v":8.2916154115476232E-2},{"$f":"(0.321*$B183^4-1.6098*$B183^3+1.316*$B183^2+0.9448*$B183)*$E$180/0.97215493","v":7.8552146004135376E-2}]
[null,0.15000000000000002,0.13323633134792623,0.12982001515951785,0.12298738278270113]
[null,0.2,0.18392485650409657,0.17920883454245307,0.16977679061916603]
[null,0.25,0.23633024149247489,0.23027049171061653,0.21815099214689987]
[null,0.3,0.28965762689698032,0.28223050825859619,0.26737627098182798]
[null,0.35,0.34315078603263366,0.33435204792923284,0.3167545717224311]
[null,0.39999999999999997,0.39609212494555779,0.38593591661362037,0.36562349994974563]
[null,0.44999999999999996,0.4478026824129771,0.43632056235110589,0.41335632222736346]
[null,0.49999999999999994,0.49764212994321799,0.48488207532928934,0.45936196610143198]
[null,0.54999999999999993,0.54500877177570861,0.53103418788402379,0.50308502010065403]
[null,0.6,0.58933954488097895,0.57422827449941549,0.54400573373628835]
[null,0.65,0.63011001896066099,0.61395335180782351,0.58164001750214867]
[null,0.70000000000000007,0.66683439644748832,0.64973607858986027,0.61553944287460449]
[null,0.75000000000000011,0.69906551250529614,0.68114075577439104,0.64529124231258095]
[null,0.80000000000000016,0.7263948350290218,0.70776932643853407,0.67051830925755851]
[null,0.8500000000000002,0.74845246464470438,0.72926137580766071,0.69087919813357312]
[null,0.90000000000000024,0.76490713470948513,0.74529413125539579,0.70606812434721711]
[null,0.95000000000000029,0.77546621131160665,0.7555824623036167,0.71581496428763691]
[null,1.0000000000000002,0.77987569327041351,0.75987888062245412,0.71988525532653547]
[null,1.0500000000000003,0.77792021213635165,0.75797354003029138,0.71808019581817073]
[null,1.1000000000000003,0.76942303219096997,0.74969423649376565,0.7102366450993568]
[null,1.1500000000000004,0.75424605044691839,0.73490640812776653,0.69622712348946292]
[null,1.2000000000000004,0.7322897966479478,0.71351313519543635,0.67595981229041324,null,"F Let u be the peripheral speed of the wheel : u = p . Æ . N / 60                      (in m/s)"]
[null,1.2500000000000004,0.70349343326891334,0.68545514010817188,0.64937855378668918,null,"F Let n, be the speed ratio of the turbine : n =  u / [ 2 . (H1 - H2S ) ] 0.5       (dimensionless number)"]
[null,1.3000000000000005,0.66783475551576954,0.65071078742562172,0.61646285124532574,null,null,"N = speed of rotation of the turbine (in rpm)"]
[null,1.3500000000000005,0.62533019132557388,0.60929608385568745,0.57722786891591438,null,null,"Æ = diameter of the wheel of the turbine (in m)"]
[null,1.4000000000000006,0.57603480136648577,0.56126467825452464,0.53172443203060227]
[null,1.4500000000000006,0.5200422790377659,0.50670786162654113,0.48003902680409161]
[null,1.5000000000000007,0.45748495046977738,0.44575456712439848,0.42229380043364062]

{"sheet":"Turbines_JT60SA_serial_indep","index":2,"n_rows":168,"n_cols":40,"rows_kept":168,"cut":false,"hidden":false,"merged":[]}
[]
[]
[]
[]
[null,null,null,null,"Vitesse de la roue ajustée en fonction de la puissance du frein",null,null,null,null,null,null,{"$f":"D65*0.3","v":448.8}]
[]
[1,2,3,4,5,6,7,8,9,10,11,12,13,14,15,16,17,18,19,20,21,22,23,24,25,26,27,28,29,30,31,32,33]
[null,"Relation entre la puissance et la vitesse de rotation",null,null,null,null,null,null,null,null,null,null,"²"]
[]
[null,"Cvs",null,30,null,null,null,30]
[null,"Range",null,100,null,null,null,100]
[null,"Trim",null,0.85,null,null,null,0.85]
[null,"Cv",null,{"$f":"[2]!Cv_From_Trim(D12,D11)*D10","v":15.035617008818171},null,null,null,{"$f":"[2]!Cv_From_Trim(H12,H11)*H10","v":15.035617008818171}]
[null,"Pin","Bara",15,null,null,null,15]
[null,"Tin","K",40.03,null,null,null,{"$f":"H25","v":80}]
[null,"Rho",null,{"$f":"[2]!rho_(11,D14,D15)","v":17.343206998481495},null,null,null,{"$f":"[2]!rho_(11,H14,H15)","v":8.7915125131395992}]
[null,"Flow",null,{"$f":"IF(D14/2>D24,\"S\",\"SS\")","v":"SS"},null,null,null,{"$f":"IF(H14/2>H24,\"S\",\"SS\")","v":"SS"}]
[null,"m","g/s",{"$f":"[2]!q_gs(D15,D14,(D14-D24),D16,D13,D17)","v":226.408332585029},null,null,null,{"$f":"[2]!q_gs(H15,H14,(H14-H24),H16,H13,H17)","v":425.36172656610597}]
[null,"TURBINE 1"]
[null,null,null,null,null,null,null,null,null,"14D",null,"16D"]
[null,null,null,"DESIGN",null,null,null,"start-up","start-up","start-up","start-up","start-up","start-up","start-up","start-up","start-up","start-up"]
[]
[null,"m","g/s",191.5,null,null,null,{"$f":"H36*H24/H25^0.5","v":121.14774580935705},{"$f":"I36*I24/I25^0.5","v":124.93288956269798},129.10843114579296,133.74447705736691,138.92974008026607,144.77832678322761,151.43980098058483,159.11456287372152,168.07821538675529,178.72186710127596,180.19645469476148,181.70730898474733,183.25589672021511,184.84376779206568,186.47256219946212,188.14401608452761,189.85996989060956,191.62237539377983]
[null,"Pin","Bara",14.77,null,null,null,13.209283254142326,13.277077886829094,13.354873357543404,13.444641778640207,13.548902955995459,13.670931281784394,13.815066051507143,13.987191593863363,14.195508982033729,14.45183362137676,14.488045211140022,14.525314566755531,14.563687283349964,14.603211648231571,14.643938912205156,14.685923461388454,14.729223128888107,14.773899387833017]
[null,"Tin","K",40.03,null,null,null,80,{"$f":"H25-4","v":76},{"$f":"I25-4","v":72},68,64,60,56,52,48,44,{"$f":"Q25-0.5","v":43.5},{"$f":"R25-0.5","v":43},42.5,42,41.5,41,40.5,40]
[null,"Pout","Bara",6.36,null,null,null,6.36,6.36,6.36,6.36,6.36,6.36,6.36,6.36,6.36,6.36,6.36,6.36,6.36,6.36,6.36,6.36,6.36,6.36]
[null,"Tout","K",{"$f":"[2]!T2_turb(11,D24,D25,D26,D28)","v":31.094586910112792},null,null,null,{"$f":"[2]!T2_turb(11,H24,H25,H26,H28)","v":65.881348421070356},{"$f":"[2]!T2_turb(11,I24,I25,I26,I28)","v":62.316554520395343},{"$f":"[2]!T2_turb(11,J24,J25,J26,J28)","v":58.766296121466468},{"$f":"[2]!T2_turb(11,K24,K25,K26,K28)","v":55.231789116787439},{"$f":"[2]!T2_turb(11,L24,L25,L26,L28)","v":51.714400802266283},{"$f":"[2]!T2_turb(11,M24,M25,M26,M28)","v":48.215671155847232},{"$f":"[2]!T2_turb(11,N24,N25,N26,N28)","v":44.737334697621932},{"$f":"[2]!T2_turb(11,O24,O25,O26,O28)","v":41.281340099548856},{"$f":"[2]!T2_turb(11,P24,P25,P26,P28)","v":37.849860435024453},{"$f":"[2]!T2_turb(11,Q24,Q25,Q26,Q28)","v":34.445278366890321},{"$f":"[2]!T2_turb(11,R24,R25,R26,R28)","v":34.021721766077569},{"$f":"[2]!T2_turb(11,S24,S25,S26,S28)","v":33.598629817061841},{"$f":"[2]!T2_turb(11,T24,T25,T26,T28)","v":33.176007484815038},{"$f":"[2]!T2_turb(11,U24,U25,U26,U28)","v":32.753859722802979},{"$f":"[2]!T2_turb(11,V24,V25,V26,V28)","v":32.332191423178664},{"$f":"[2]!T2_turb(11,W24,W25,W26,W28)","v":31.911007439469916},{"$f":"[2]!T2_turb(11,X24,X25,X26,X28)","v":31.490312535614741},{"$f":"[2]!T2_turb(11,Y24,Y25,Y26,Y28)","v":31.070111420287635}]
[null,"Efficacity","%",0.78,null,null,null,{"$f":"(0.321*H50^4-1.6098*H50^3+1.316*H50^2+0.9448*H50)*($D$28/0.97215493)","v":0.70166034037455327},{"$f":"(0.321*I50^4-1.6098*I50^3+1.316*I50^2+0.9448*I50)*($D$28/0.97215493)","v":0.71135591790105379},0.72106222637635264,0.73069985263187465,0.74016148023392914,0.74930178239287615,0.75792295269373933,0.76575354886662028,0.77241674695012208,0.77738118049100791,0.77784748055795716,0.7782739232778525,0.77865860325771141,0.77899951849782523,0.7792945641904756,0.77954152639542806,0.77973807491453584,0.77988175586902886]
[null,"Power","W",{"$f":"+D23*(D40-D41)","v":9122.4436160855366},null,null,null,{"$f":"+H23*(H40-H41)","v":9122.4436130375598},9122.4436270382776,9122.4436214964626,9122.4436064338188,9122.4436137465527,9122.4436123664927,9122.4436137505872,9122.4436235155317,9122.4436090208146,9122.4436137705834,9122.4436146988628,9122.4436153828865,9122.4436250904873,9122.4436195990129,9122.4436170467779,9122.4436053969876,9122.4436154449395,9122.4436161143294]
[null,"Speed","Hz",1995,null,null,null,1995,1995,1995,1995,1995,1995,1995,1995,1995,1995,1995,1995,1995,1995,1995,1995,1995,1995]
[null,"Speed calculated from P=K.rho.N^3",null,null,null,null,null,{"$f":"(H29/$D29*$D33/H33)^(1/3)*$D30","v":1994.9999997778114},{"$f":"(I29/$D29*$D33/I33)^(1/3)*$D30","v":1995.0000007984236},1995.0000003944408,1994.9999992964174,1994.9999998294948,1994.9999997288921,1994.999999829789,1995.0000005416255,1994.9999994850023,1994.9999998312464,1994.9999998989156,1994.9999999487789,1995.0000006564351,1995.0000002561226,1995.0000000700718,1994.9999992208354,1994.9999999533022,1995.0000000020989]
[null,"Delta Speed Frein & Turbine",null,{"$f":"D26-D33","v":1.1600000000000001},null,null,null,{"$f":"H30-H31","v":2.221886461484246E-7},{"$f":"I30-I31","v":-7.9842357081361115E-7},-3.9444080357498024E-7,7.0358260018110741E-7,1.7050524547812529E-7,2.7110786504636053E-7,1.7021102394210175E-7,-5.4162546803127043E-7,5.1499773690011352E-7,1.6875355868251063E-7,1.0108442438649945E-7,5.1221149988123216E-8,-6.5643507696222514E-7,-2.5612257559259888E-7,-7.0071791924419813E-8,7.7916456575621851E-7,4.6697778088855557E-8,-2.0988863980164751E-9]
[null,"Brake Pressure",null,5.2,null,null,null,{"$f":"($D33-$D26)+H26","v":5.2},{"$f":"($D33-$D26)+I26","v":5.2},5.2,5.2,5.2,5.2,5.2,5.2,5.2,5.2,5.2,5.2,5.2,5.2,5.2,5.2,5.2,5.2]
[null,"Rho (brake)",null,{"$f":"[2]!rho_(11,D33,330)","v":0.75697464940773784},null,null,null,{"$f":"[2]!rho_(11,H33,330)","v":0.75697464940773784},{"$f":"[2]!rho_(11,I33,330)","v":0.75697464940773784},{"$f":"[2]!rho_(11,J33,330)","v":0.75697464940773784},{"$f":"[2]!rho_(11,K33,330)","v":0.75697464940773784},{"$f":"[2]!rho_(11,L33,330)","v":0.75697464940773784},{"$f":"[2]!rho_(11,M33,330)","v":0.75697464940773784},{"$f":"[2]!rho_(11,N33,330)","v":0.75697464940773784},{"$f":"[2]!rho_(11,O33,330)","v":0.75697464940773784},{"$f":"[2]!rho_(11,P33,330)","v":0.75697464940773784},{"$f":"[2]!rho_(11,Q33,330)","v":0.75697464940773784},{"$f":"[2]!rho_(11,R33,330)","v":0.75697464940773784},{"$f":"[2]!rho_(11,S33,330)","v":0.75697464940773784},{"$f":"[2]!rho_(11,T33,330)","v":0.75697464940773784},{"$f":"[2]!rho_(11,U33,330)","v":0.75697464940773784},{"$f":"[2]!rho_(11,V33,330)","v":0.75697464940773784},{"$f":"[2]!rho_(11,W33,330)","v":0.75697464940773784},{"$f":"[2]!rho_(11,X33,330)","v":0.75697464940773784},{"$f":"[2]!rho_(11,Y33,330)","v":0.75697464940773784}]
[null,"Wheel","mm",35.799999999999997,null,null,null,{"$f":"$D$35","v":35.799999999999997},{"$f":"$D$35","v":35.799999999999997},35.799999999999997,35.799999999999997,35.799999999999997,35.799999999999997,35.799999999999997,35.799999999999997,35.799999999999997,35.799999999999997,35.799999999999997,35.799999999999997,35.799999999999997,35.799999999999997,35.799999999999997,35.799999999999997,35.799999999999997,35.799999999999997]
[null,"a = mÖT/P",null,{"$f":"D23*D25^0.5/D24","v":82.031580287488268},null,null,null,{"$f":"+$D$36","v":82.031580287488268},{"$f":"+$D$36","v":82.031580287488268},82.031580287488268,82.031580287488268,82.031580287488268,82.031580287488268,82.031580287488268,82.031580287488268,82.031580287488268,82.031580287488268,82.031580287488268,82.031580287488268,82.031580287488268,82.031580287488268,82.031580287488268,82.031580287488268,82.031580287488268,82.031580287488268,null,null,null,null,null,null,null,null,null,null,null,"T1 out",63,31,"x"]
[null,"Rho (in)","kg/m3",{"$f":"[2]!rho_(11,D24,D25)","v":17.087672541642732},null,null,null,{"$f":"[2]!rho_(11,H24,H25)","v":7.7660605505880893},{"$f":"[2]!rho_(11,I24,I25)","v":8.2075576819028555},{"$f":"[2]!rho_(11,J24,J25)","v":8.7037416911757592},{"$f":"[2]!rho_(11,K24,K25)","v":9.2655120522802115},{"$f":"[2]!rho_(11,L24,L25)","v":9.9068856609552576},{"$f":"[2]!rho_(11,M24,M25)","v":10.64620464678436},{"$f":"[2]!rho_(11,N24,N25)","v":11.507957758641105},{"$f":"[2]!rho_(11,O24,O25)","v":12.525615689066411},{"$f":"[2]!rho_(11,P24,P25)","v":13.746213503316968},{"$f":"[2]!rho_(11,Q24,Q25)","v":15.238095294709865},{"$f":"[2]!rho_(11,R24,R25)","v":15.44828605587977},{"$f":"[2]!rho_(11,S24,S25)","v":15.664510012945385},{"$f":"[2]!rho_(11,T24,T25)","v":15.887034489134546},{"$f":"[2]!rho_(11,U24,U25)","v":16.11614302351413},{"$f":"[2]!rho_(11,V24,V25)","v":16.352136702506165},{"$f":"[2]!rho_(11,W24,W25)","v":16.595335487574189},{"$f":"[2]!rho_(11,X24,X25)","v":16.846079803228697},{"$f":"[2]!rho_(11,Y24,Y25)","v":17.104732121090368},null,null,null,null,null,null,null,null,null,null,null,"T2 in",62,18,"y"]
[null,"Sound Speed @inlet",null,{"$f":"[2]!Sound_speed(11,D24,D25)","v":391.2334216977045},null,null,null,{"$f":"[2]!Sound_speed(11,H24,H25)","v":538.91476166545908},{"$f":"[2]!Sound_speed(11,I24,I25)","v":525.99135492327571},{"$f":"[2]!Sound_speed(11,J24,J25)","v":512.74533842609276},{"$f":"[2]!Sound_speed(11,K24,K25)","v":499.15108626106354},{"$f":"[2]!Sound_speed(11,L24,L25)","v":485.17936569915167},{"$f":"[2]!Sound_speed(11,M24,M25)","v":470.79659847734735},{"$f":"[2]!Sound_speed(11,N24,N25)","v":455.96393644824406},{"$f":"[2]!Sound_speed(11,O24,O25)","v":440.63611492300868},{"$f":"[2]!Sound_speed(11,P24,P25)","v":424.76007465614606},{"$f":"[2]!Sound_speed(11,Q24,Q25)","v":408.27345515050234},{"$f":"[2]!Sound_speed(11,R24,R25)","v":406.16618602069235},{"$f":"[2]!Sound_speed(11,S24,S25)","v":404.04809803814084},{"$f":"[2]!Sound_speed(11,T24,T25)","v":401.91903461254844},{"$f":"[2]!Sound_speed(11,U24,U25)","v":399.77883673080578},{"$f":"[2]!Sound_speed(11,V24,V25)","v":397.6273431650103},{"$f":"[2]!Sound_speed(11,W24,W25)","v":395.46439056330075},{"$f":"[2]!Sound_speed(11,X24,X25)","v":393.28981373303316},{"$f":"[2]!Sound_speed(11,Y24,Y25)","v":391.1034457875478},null,null,null,null,null,null,null,null,null,null,null,"slope",{"$f":"SLOPE(AL37:AM37,AL36:AM36)","v":1.375}]
[null,"S=Q/(rho*V) = cte",null,{"$f":"D23/(D37*D38)","v":2.8645071953707371E-2},null,null,null,{"$f":"H23/(H37*H38)","v":2.8946395095487482E-2},{"$f":"I23/(I37*I38)","v":2.8939047657983816E-2},2.892989714152313E-2,2.8918410021926164E-2,2.8903853687997205E-2,2.8885203171005156E-2,2.8860993483110303E-2,2.8829078323658098E-2,2.8786220964274054E-2,2.8727369700344441E-2,2.8718527913202244E-2,2.8709294166507082E-2,2.8699646345988428E-2,2.8689560785657105E-2,2.8679012134719479E-2,2.8667973213167133E-2,2.8656414850422127E-2,2.864430570994626E-2,null,null,null,null,null,null,null,null,null,null,null,"intercept",{"$f":"INTERCEPT(AL37:AM37,AL36:AM36)","v":-24.625}]
[null,"Hin",null,{"$f":"[2]!H_(11,D24,D25)","v":223.57106614117126},null,null,null,{"$f":"[2]!H_(11,H24,H25)","v":434.00743838312928},{"$f":"[2]!H_(11,I24,I25)","v":413.11850195273422},{"$f":"[2]!H_(11,J24,J25)","v":392.21103602348046},{"$f":"[2]!H_(11,K24,K25)","v":371.28111541481854},{"$f":"[2]!H_(11,L24,L25)","v":350.32369391769879},{"$f":"[2]!H_(11,M24,M25)","v":329.33218502048032},{"$f":"[2]!H_(11,N24,N25)","v":308.29784166725983},{"$f":"[2]!H_(11,O24,O25)","v":287.20881307640343},{"$f":"[2]!H_(11,P24,P25)","v":266.0486638443316},{"$f":"[2]!H_(11,Q24,Q25)","v":244.7939589768576},{"$f":"[2]!H_(11,R24,R25)","v":242.12891297633288},{"$f":"[2]!H_(11,S24,S25)","v":239.46178924162191},{"$f":"[2]!H_(11,T24,T25)","v":236.79250010933401},{"$f":"[2]!H_(11,U24,U25)","v":234.12095301789108},{"$f":"[2]!H_(11,V24,V25)","v":231.44705016565564},{"$f":"[2]!H_(11,W24,W25)","v":228.77068813100311},{"$f":"[2]!H_(11,X24,X25)","v":226.09175746680597},{"$f":"[2]!H_(11,Y24,Y25)","v":223.41014225053877},null,null,null,null,null,null,null,null,null,null,null,"x","y"]
[null,"Hout",null,{"$f":"[2]!H_(11,D26,D27)","v":175.9342848561293},null,null,null,{"$f":"[2]!H_(11,H26,H27)","v":358.70728688552731},{"$f":"[2]!H_(11,I26,I27)","v":340.09975037363023},{"$f":"[2]!H_(11,J26,J27)","v":321.55380984128686},{"$f":"[2]!H_(11,K26,K27)","v":303.0731130573011},{"$f":"[2]!H_(11,L26,L27)","v":284.66141305201734},{"$f":"[2]!H_(11,M26,M27)","v":266.32245272798559},{"$f":"[2]!H_(11,N26,N27)","v":248.0597566018937},{"$f":"[2]!H_(11,O26,O27)","v":229.87626312775166},{"$f":"[2]!H_(11,P26,P27)","v":211.77367295375322},{"$f":"[2]!H_(11,Q26,Q27)","v":193.75127594243526},{"$f":"[2]!H_(11,R26,R27)","v":191.50392354381847},{"$f":"[2]!H_(11,S26,S27)","v":189.25773489536206},{"$f":"[2]!H_(11,T26,T27)","v":187.01269062785181},{"$f":"[2]!H_(11,U26,U27)","v":184.7687691246206},{"$f":"[2]!H_(11,V26,V27)","v":182.52594611985575},{"$f":"[2]!H_(11,W26,W27)","v":180.28419467112852},{"$f":"[2]!H_(11,X26,X27)","v":178.04348472821363},{"$f":"[2]!H_(11,Y26,Y27)","v":175.80378314259062},null,null,null,null,null,null,null,null,null,null,null,277,{"$f":"m*AK41+p","v":356.25}]
[null,"Sin = Sout",null,{"$f":"[2]!S_(11,D24,D25)","v":15.488244062210457},null,null,null,{"$f":"[2]!S_(11,H24,H25)","v":19.378618657952245},{"$f":"[2]!S_(11,I24,I25)","v":19.09986189374176},{"$f":"[2]!S_(11,J24,J25)","v":18.804815565743773},{"$f":"[2]!S_(11,K24,K25)","v":18.491447397697637},{"$f":"[2]!S_(11,L24,L25)","v":18.157315176305566},{"$f":"[2]!S_(11,M24,M25)","v":17.799446793484467},{"$f":"[2]!S_(11,N24,N25)","v":17.414172100675714},{"$f":"[2]!S_(11,O24,O25)","v":16.996880937534449},{"$f":"[2]!S_(11,P24,P25)","v":16.541663796875227},{"$f":"[2]!S_(11,Q24,Q25)","v":16.040757786393321},{"$f":"[2]!S_(11,R24,R25)","v":15.97444699241386},{"$f":"[2]!S_(11,S24,S25)","v":15.907239105754762},{"$f":"[2]!S_(11,T24,T25)","v":15.83910880646941},{"$f":"[2]!S_(11,U24,U25)","v":15.770029657325903},{"$f":"[2]!S_(11,V24,V25)","v":15.699974025839996},{"$f":"[2]!S_(11,W24,W25)","v":15.628913018332181},{"$f":"[2]!S_(11,X24,X25)","v":15.556816390768134},{"$f":"[2]!S_(11,Y24,Y25)","v":15.48365247389737},null,null,null,null,null,null,null,null,null,null,null,31,{"$f":"m*AK42+p","v":18}]
[null,"Tout(iso)",null,{"$f":"[1]!HeCalc(2,0,1,D26*10^5,8,D42*1000,1)","v":28.580768861485691},null,null,null,{"$f":"[1]!HeCalc(2,0,1,H26*10^5,8,H42*1000,1)","v":59.749282015881604},{"$f":"[1]!HeCalc(2,0,1,I26*10^5,8,I42*1000,1)","v":56.646275328492493},{"$f":"[1]!HeCalc(2,0,1,J26*10^5,8,J42*1000,1)","v":53.540052827957339},{"$f":"[1]!HeCalc(2,0,1,K26*10^5,8,K42*1000,1)","v":50.430519641718654},{"$f":"[1]!HeCalc(2,0,1,L26*10^5,8,L42*1000,1)","v":47.317566981487801},{"$f":"[1]!HeCalc(2,0,1,M26*10^5,8,M42*1000,1)","v":44.201064034154754},{"$f":"[1]!HeCalc(2,0,1,N26*10^5,8,N42*1000,1)","v":41.080844072306064},{"$f":"[1]!HeCalc(2,0,1,O26*10^5,8,O42*1000,1)","v":37.956681121160315},{"$f":"[1]!HeCalc(2,0,1,P26*10^5,8,P42*1000,1)","v":34.828249533856798},{"$f":"[1]!HeCalc(2,0,1,Q26*10^5,8,Q42*1000,1)","v":31.695052434830323},{"$f":"[1]!HeCalc(2,0,1,R26*10^5,8,R42*1000,1)","v":31.303032583935167},{"$f":"[1]!HeCalc(2,0,1,S26*10^5,8,S42*1000,1)","v":30.910924475011289},{"$f":"[1]!HeCalc(2,0,1,T26*10^5,8,T42*1000,1)","v":30.518725971647559},{"$f":"[1]!HeCalc(2,0,1,U26*10^5,8,U42*1000,1)","v":30.126434815805911},{"$f":"[1]!HeCalc(2,0,1,V26*10^5,8,V42*1000,1)","v":29.734048565114612},{"$f":"[1]!HeCalc(2,0,1,W26*10^5,8,W42*1000,1)","v":29.341564629498517},{"$f":"[1]!HeCalc(2,0,1,X26*10^5,8,X42*1000,1)","v":28.948980209913184},{"$f":"[1]!HeCalc(2,0,1,Y26*10^5,8,Y42*1000,1)","v":28.556292351579447},null,null,null,null,null,null,null,null,null,null,null,31,{"$f":"m*AK43+p","v":18}]
[null,"Hout(iso)",null,{"$f":"[2]!H_(11,D26,D43)","v":162.49826962188638},null,null,null,{"$f":"[2]!H_(11,H26,H43)","v":326.69034040178116},{"$f":"[2]!H_(11,I26,I43)","v":310.47121985159532},{"$f":"[2]!H_(11,J26,J43)","v":294.22056641134083},{"$f":"[2]!H_(11,K26,K43)","v":277.93498688907408},{"$f":"[2]!H_(11,L26,L43)","v":261.61024067918538},{"$f":"[2]!H_(11,M26,M43)","v":245.24092329776713},{"$f":"[2]!H_(11,N26,N43)","v":228.81999388435048},{"$f":"[2]!H_(11,O26,O43)","v":212.33805337374349},{"$f":"[2]!H_(11,P26,P43)","v":195.78220327769773},{"$f":"[2]!H_(11,Q26,Q43)","v":179.13417158377612},{"$f":"[2]!H_(11,R26,R43)","v":177.04547348739771},{"$f":"[2]!H_(11,S26,S43)","v":174.95486842020244},{"$f":"[2]!H_(11,T26,T43)","v":172.86228823828279},{"$f":"[2]!H_(11,U26,U43)","v":170.76766110772618},{"$f":"[2]!H_(11,V26,V43)","v":168.67091095747458},{"$f":"[2]!H_(11,W26,W43)","v":166.57195744365336},{"$f":"[2]!H_(11,X26,X43)","v":164.4707153702546},{"$f":"[2]!H_(11,Y26,Y43)","v":162.36709469918239}]
[null,"ΔHs",null,{"$f":"D40-D44","v":61.072796519284879},null,null,null,107.31709798134813,102.6472821011389,97.990469612139634,93.346128525744462,88.713453238513409,84.091261722713199,79.47784778290935,74.870759702659939,70.266460566633867,65.659787393081473,65.08343948893517,64.50692082141947,63.930211871051227,63.353291910164899,62.776139208181064,62.198730687349752,61.621042096551378,61.043047551356381]
[null,"u1","m/s",{"$f":"(2*52.7%*D45*1000*D28)^0.5","v":224.07402231056255},null,null,null,{"$f":"PI()*$D$47*H30","v":224.07402231056253},{"$f":"PI()*$D$47*I30","v":224.07402231056253},224.07402231056253,224.07402231056253,224.07402231056253,224.07402231056253,224.07402231056253,224.07402231056253,224.07402231056253,224.07402231056253,224.07402231056253,224.07402231056253,224.07402231056253,224.07402231056253,224.07402231056253,224.07402231056253,224.07402231056253,224.07402231056253]
[null,"D1",null,{"$f":"D46/PI()/D30","v":3.5751867939057311E-2}]
[null,"Co = (2*ΔHs)^0,5",null,{"$f":"(2000*D45)^0.5","v":349.49333761685608},null,null,null,463.28630021045979,453.09443188178534,442.69734494830584,432.07899399471955,421.22073367419466,410.10062599979824,398.69248245460898,386.96449372690495,374.87720807388081,362.38042826036138,360.7864728310505,359.18496856472007,357.57575944420847,355.95868274327825,354.33356941780454,352.70024294675432,351.05851961332991,349.4082069767577]
[null,"u1/Co",null,{"$f":"D46/D48","v":0.64113961038138956},null,null,null,0.48366209449485364,0.49454154927470967,0.50615623713923075,0.51859503800201157,0.53196342059429358,0.54638790605180099,0.56202219046373236,0.57905576853441187,0.59772644878000158,0.6183391950449677,0.62107101896664563,0.6238401991206588,0.62664768623814993,0.62949446993028524,0.63238157953459562,0.63531008779143383,0.63828111209882255,0.64129581914905542]
[null,"U1/C0 off de / U1/C0 nom",null,{"$f":"D49/$D$49","v":1},null,null,null,{"$f":"H49/$D49","v":0.75437874475910394},{"$f":"I49/$D49","v":0.77134767727192166},0.78946336951188789,0.80886444949723058,0.82971541920151959,0.85221361651134864,0.87659876470493958,0.90316642297292105,0.93228750665465332,0.96443767477904108,0.96869856254427034,0.97301771567281581,0.97739661704161607,0.98183681016966484,0.9863399005380683,0.9909075613242988,0.99554153535941015,1.0002436423598489]
[null,"Rdt",null,{"$f":"(0.321*D50^4-1.6098*D50^3+1.316*D50^2+0.9448*D50)*($D28/0.97215493)","v":0.77987569327041328},null,null,null,{"$f":"(0.321*H50^4-1.6098*H50^3+1.316*H50^2+0.9448*H50)*($D28/0.97)","v":0.7032191330727835},0.7129362500744173,0.7226641218644817,0.73232315885190769,0.74180580619124925,0.75096641423816679,0.75960673713543869,0.76745472958317607,0.77413273047641618,0.77910819289026101,0.77957552887886317,0.78000291897423302,0.78038845355041053,0.78073012616008974,0.78102582731955905,0.78127333817014488,0.78147032333698496,0.78161432348982762]
[]
[]
[null,"TURBINE 2"]
[null,null,null,null,null,null,null,5]
[null,null,null,"DESIGN",null,null,null,{"$f":"H21","v":"start-up"},{"$f":"I21","v":"start-up"},"start-up","start-up","start-up","start-up","start-up","start-up","start-up","start-up",0,0,0,0,0,0,0,0]
[null,"Delta Debit",null,null,null,null,null,{"$f":"H58-H23","v":-43.70561895690642},{"$f":"I58-I23","v":-44.300794770780328},-44.819430379739444,-45.204994154694106,-45.36608241713823,-45.150459087366769,-44.294141004752888,-42.313472261047806,-38.251043749639223,-29.979700454534282,-28.441370622359074,-26.744088957077707,-24.86734748285437,-22.787048873571365,-20.474667184712189,-17.896151628910474,-15.010475265343587,-11.767680063819029]
[null,"m","g/s",191.20000000000002,null,null,null,{"$f":"H71*H59/H60^0.5","v":77.442126852450627},80.632094791917652,84.289000766053519,88.539482902672802,93.563657663127842,99.627867695860843,107.14565997583195,116.80109061267372,129.82717163711607,148.74216664674168,151.75508407240241,154.96322002766962,158.38854923736073,162.05671891849431,165.99789501474993,170.24786445561713,174.84949462526598,179.8546953299608]
[null,"Pin","Bara",6.3070000000000004,null,null,null,4.8618736607768973,4.8704293320940311,4.8835602776196776,4.9029201131654405,4.9309542284952759,4.9714219048733694,5.0303942728573565,5.1183322154684374,5.2549413354246228,5.4825565008231294,5.5215091680185919,5.5637171314713125,5.609585429427999,5.6595914286897369,5.7143023436396847,5.774398266845715,5.8407029447800785,5.914225538910558]
[null,"Tin","K",18.21,null,null,null,{"$f":"m*H27+p","v":65.96185407897174},{"$f":"m*I27+p","v":61.060262465543602},56.178657167016397,51.318710035582725,46.482301103116143,41.671547839289943,36.888835209230159,32.136842636879678,27.418558098158627,{"$f":"m*Q27+p","v":22.737257754474193},22.15486742835666,21.573115998460032,20.99201029162068,20.411557118854098,19.831763206870662,19.252635229271135,18.674179736470272,18.096403202895495]
[null,"Pout","Bara",1.35,null,null,null,1.1499999999999999,1.1499999999999999,1.1499999999999999,1.1499999999999999,1.1499999999999999,1.1499999999999999,1.1499999999999999,1.1499999999999999,1.1499999999999999,1.1499999999999999,1.1499999999999999,1.1499999999999999,1.1499999999999999,1.1499999999999999,1.1499999999999999,1.1499999999999999,1.1499999999999999,1.1499999999999999]
[null,"Tout","K",{"$f":"[2]!T2_turb(11,D59,D60,D61,D63)","v":11.618357475588732},null,null,null,{"$f":"[2]!T2_turb(11,H59,H60,H61,H63)","v":51.229742388025016},{"$f":"[2]!T2_turb(11,I59,I60,I61,I63)","v":46.905771543703366},{"$f":"[2]!T2_turb(11,J59,J60,J61,J63)","v":42.630768132060339},{"$f":"[2]!T2_turb(11,K59,K60,K61,K63)","v":38.410586051555462},{"$f":"[2]!T2_turb(11,L59,L60,L61,L63)","v":34.252296458400096},{"$f":"[2]!T2_turb(11,M59,M60,M61,M63)","v":30.164561119540227},{"$f":"[2]!T2_turb(11,N59,N60,N61,N63)","v":26.158152358210579},{"$f":"[2]!T2_turb(11,O59,O60,O61,O63)","v":22.246671637808181},{"$f":"[2]!T2_turb(11,P59,P60,P61,P63)","v":18.447473499829155},{"$f":"[2]!T2_turb(11,Q59,Q60,Q61,Q63)","v":14.782426333646871},{"$f":"[2]!T2_turb(11,R59,R60,R61,R63)","v":14.334965559480569},{"$f":"[2]!T2_turb(11,S59,S60,S61,S63)","v":13.890037026383935},{"$f":"[2]!T2_turb(11,T59,T60,T61,T63)","v":13.447682912736585},{"$f":"[2]!T2_turb(11,U59,U60,U61,U63)","v":13.007940048476648},{"$f":"[2]!T2_turb(11,V59,V60,V61,V63)","v":12.570837559016013},{"$f":"[2]!T2_turb(11,W59,W60,W61,W63)","v":12.136393743534741},{"$f":"[2]!T2_turb(11,X59,X60,X61,X63)","v":11.704611715355901},{"$f":"[2]!T2_turb(11,Y59,Y60,Y61,Y63)","v":11.27547341925103}]
[null,"Efficacity","%",0.76,null,null,null,{"$f":"(0.321*H85^4-1.6098*H85^3+1.316*H85^2+0.9448*H85)*($D$63/0.97215493)","v":0.51199332401801023},{"$f":"(0.321*I85^4-1.6098*I85^3+1.316*I85^2+0.9448*I85)*($D$63/0.97215493)","v":0.53061030362869022},0.55082963719069733,0.57282035292505762,0.59674437720892748,0.62272322529621882,0.65076377270032926,0.68058965549086037,0.71123726999764214,0.73998870679403372,0.74316356255218474,0.74618041994430995,0.74901119690451434,0.75162321005464805,0.7539782303869057,0.75603128350625293,0.75772910559421447,0.75900812286425579]
[null,"Power","W",{"$f":"+D58*(D75-D76)","v":6144.650345780522},null,null,null,5991.0340871407989,5991.0340871041244,5991.0340871111275,5991.034087200992,5991.034087158132,5991.0340871842163,5991.0340871767739,5991.0340869642459,5991.0340873441655,5991.0340872103052,5991.0340871794033,5991.034087157057,5991.0340868846633,5991.0340870483706,5991.0340871160815,5991.0340872942998,5991.0340871402213,5991.0340871361477]
[null,"Speed","Hz",1496,null,null,null,1496,1496,1496,1496,1496,1496,1496,1496,1496,1496,1496,1496,1496,1496,1496,1496,1496,1496]
[null,null,null,null,null,null,null,{"$f":"(H64/$D64*$D68/H68)^(1/3)*$D65","v":1496.0000000003986},{"$f":"(I64/$D64*$D68/I68)^(1/3)*$D65","v":1495.9999999973461},1495.9999999979289,1496.0000000054088,1496.0000000018413,1496.0000000040125,1496.0000000033931,1495.9999999857032,1496.0000000173261,1496.0000000061841,1496.0000000036118,1496.0000000017519,1495.9999999790791,1495.9999999927054,1495.9999999983413,1496.0000000131752,1496.0000000003504,1496.0000000000116]
[null,"Delta Speed Frein & Turbine",null,null,null,null,null,{"$f":"H65-H66","v":-3.985860530519858E-10},{"$f":"I65-I66","v":2.6539055397734046E-9},2.0711468096124008E-9,-5.4087649914436042E-9,-1.8412720237392932E-9,-4.0124632505467162E-9,-3.393097358639352E-9,1.4296801964519545E-8,-1.7326101442449726E-8,{"$f":"Q65-Q66","v":-6.1841092247050256E-9},{"$f":"R65-R66","v":-3.6118308344157413E-9},-1.751914169290103E-9,2.0920879251207225E-8,7.2946022555697709E-9,1.6586909623583779E-9,-1.3175167623558082E-8,-3.503828338580206E-10,-1.1596057447604835E-11]
[null,"Brake Pressure",null,8,null,null,null,{"$f":"($D68-$D61)+H61","v":7.8000000000000007},{"$f":"($D68-$D61)+I61","v":7.8000000000000007},7.8000000000000007,7.8000000000000007,7.8000000000000007,7.8000000000000007,7.8000000000000007,7.8000000000000007,7.8000000000000007,7.8000000000000007,7.8000000000000007,7.8000000000000007,7.8000000000000007,7.8000000000000007,7.8000000000000007,7.8000000000000007,7.8000000000000007,7.8000000000000007]
[null,"Rho (brake)",null,{"$f":"[2]!rho_(11,D68,330)","v":1.1632432504804469},null,null,null,{"$f":"[2]!rho_(11,H68,330)","v":1.1342549379241607},{"$f":"[2]!rho_(11,I68,330)","v":1.1342549379241607},{"$f":"[2]!rho_(11,J68,330)","v":1.1342549379241607},{"$f":"[2]!rho_(11,K68,330)","v":1.1342549379241607},{"$f":"[2]!rho_(11,L68,330)","v":1.1342549379241607},{"$f":"[2]!rho_(11,M68,330)","v":1.1342549379241607},{"$f":"[2]!rho_(11,N68,330)","v":1.1342549379241607},{"$f":"[2]!rho_(11,O68,330)","v":1.1342549379241607},{"$f":"[2]!rho_(11,P68,330)","v":1.1342549379241607},{"$f":"[2]!rho_(11,Q68,330)","v":1.1342549379241607},{"$f":"[2]!rho_(11,R68,330)","v":1.1342549379241607},{"$f":"[2]!rho_(11,S68,330)","v":1.1342549379241607},{"$f":"[2]!rho_(11,T68,330)","v":1.1342549379241607},{"$f":"[2]!rho_(11,U68,330)","v":1.1342549379241607},{"$f":"[2]!rho_(11,V68,330)","v":1.1342549379241607},{"$f":"[2]!rho_(11,W68,330)","v":1.1342549379241607},{"$f":"[2]!rho_(11,X68,330)","v":1.1342549379241607},{"$f":"[2]!rho_(11,Y68,330)","v":1.1342549379241607}]
[null,"Wheel","mm",39.5,null,null,null,{"$f":"$D$35","v":35.799999999999997},{"$f":"$D$35","v":35.799999999999997},35.799999999999997,35.799999999999997,35.799999999999997,35.799999999999997,35.799999999999997,35.799999999999997,35.799999999999997,35.799999999999997,35.799999999999997,35.799999999999997,35.799999999999997,35.799999999999997,35.799999999999997,35.799999999999997,35.799999999999997,35.799999999999997]
[null,"a = mÖT/P",null,{"$f":"D58*D60^0.5/D59","v":129.36596422035444},null,null,null,{"$f":"$D$71","v":129.36596422035444},129.36596422035444,129.36596422035444,129.36596422035444,129.36596422035444,129.36596422035444,129.36596422035444,129.36596422035444,129.36596422035444,129.36596422035444,129.36596422035444,129.36596422035444,129.36596422035444,129.36596422035444,129.36596422035444,129.36596422035444,129.36596422035444,129.36596422035444]
[null,"Rho (in)","kg/m3",{"$f":"[2]!rho_(11,D59,D60)","v":16.817250243896773},null,null,null,{"$f":"[2]!rho_(11,H59,H60)","v":3.5128910905216459},{"$f":"[2]!rho_(11,I59,I60)","v":3.7993960709878691},{"$f":"[2]!rho_(11,J59,J60)","v":4.1381903231629815},{"$f":"[2]!rho_(11,K59,K60)","v":4.545251092971875},{"$f":"[2]!rho_(11,L59,L60)","v":5.0438865212787238},{"$f":"[2]!rho_(11,M59,M60)","v":5.6695396290837152},{"$f":"[2]!rho_(11,N59,N60)","v":6.4789954222859167},{"$f":"[2]!rho_(11,O59,O60)","v":7.5696326962020599},{"$f":"[2]!rho_(11,P59,P60)","v":9.1246680889264802},{"$f":"[2]!rho_(11,Q59,Q60)","v":11.53881890139097},{"$f":"[2]!rho_(11,R59,R60)","v":11.93939519461877},{"$f":"[2]!rho_(11,S59,S60)","v":12.370591092183949},{"$f":"[2]!rho_(11,T59,T60)","v":12.83622346378303},{"$f":"[2]!rho_(11,U59,U60)","v":13.340796329486052},{"$f":"[2]!rho_(11,V59,V60)","v":13.88966811735958},{"$f":"[2]!rho_(11,W59,W60)","v":14.489271595370678},{"$f":"[2]!rho_(11,X59,X60)","v":15.147407681583996},{"$f":"[2]!rho_(11,Y59,Y60)","v":15.873644166006097}]
[null,"Sound Speed",null,{"$f":"[2]!Sound_speed(11,D59,D60)","v":258.39146376447951},null,null,null,{"$f":"[2]!Sound_speed(11,H59,H60)","v":482.99736133769642},{"$f":"[2]!Sound_speed(11,I59,I60)","v":465.09196928218023},{"$f":"[2]!Sound_speed(11,J59,J60)","v":446.53844572400476},{"$f":"[2]!Sound_speed(11,K59,K60)","v":427.25586156664428},{"$f":"[2]!Sound_speed(11,L59,L60)","v":407.1435595144394},{"$f":"[2]!Sound_speed(11,M59,M60)","v":386.07322375175693},{"$f":"[2]!Sound_speed(11,N59,N60)","v":363.87610480752301},{"$f":"[2]!Sound_speed(11,O59,O60)","v":340.32110554302523},{"$f":"[2]!Sound_speed(11,P59,P60)","v":315.07405704337151},{"$f":"[2]!Sound_speed(11,Q59,Q60)","v":287.61397302723833},{"$f":"[2]!Sound_speed(11,R59,R60)","v":283.98741949279616},{"$f":"[2]!Sound_speed(11,S59,S60)","v":280.31085379190188},{"$f":"[2]!Sound_speed(11,T59,T60)","v":276.58171928905892},{"$f":"[2]!Sound_speed(11,U59,U60)","v":272.79723582963766},{"$f":"[2]!Sound_speed(11,V59,V60)","v":268.95437798306301},{"$f":"[2]!Sound_speed(11,W59,W60)","v":265.04985485970411},{"$f":"[2]!Sound_speed(11,X59,X60)","v":261.08009314401068},{"$f":"[2]!Sound_speed(11,Y59,Y60)","v":257.04123027913158}]
[null,"S=Q/(rho*V) = cte",null,{"$f":"D58/(D72*D73)","v":4.4000208975996838E-2},null,null,null,4.5642332244054361E-2,4.5630427001084883E-2,4.5614360249108525E-2,4.5592254868881646E-2,4.5561111962078689E-2,4.5515923419136406E-2,4.5447853267919634E-2,4.5340176663542828E-2,4.5158122232068533E-2,4.4819062162052101E-2,4.4757087797925636E-2,4.4688756097261306E-2,4.4613165545918564E-2,4.4529244042277843E-2,4.4435706964217864E-2,4.4331002142427196E-2,4.421323658212311E-2,4.4080077380982664E-2]
[null,"Hin",null,{"$f":"[2]!H_(11,D59,D60)","v":105.90220745591094},null,null,null,{"$f":"[2]!H_(11,H59,H60)","v":358.81815640994091},{"$f":"[2]!H_(11,I59,I60)","v":333.26240764487693},{"$f":"[2]!H_(11,J59,J60)","v":307.78890388172204},{"$f":"[2]!H_(11,K59,K60)","v":282.39962681096983},{"$f":"[2]!H_(11,L59,L60)","v":257.09463630504973},{"$f":"[2]!H_(11,M59,M60)","v":231.87033739373845},{"$f":"[2]!H_(11,N59,N60)","v":206.71611457313998},{"$f":"[2]!H_(11,O59,O60)","v":181.60733846006403},{"$f":"[2]!H_(11,P59,P60)","v":156.48933132029757},{"$f":"[2]!H_(11,Q59,Q60)","v":131.23473629250552},{"$f":"[2]!H_(11,R59,R60)","v":128.0557200344609},{"$f":"[2]!H_(11,S59,S60)","v":124.86895118847751},{"$f":"[2]!H_(11,T59,T60)","v":121.67320123712314},{"$f":"[2]!H_(11,U59,U60)","v":118.46703083866899},{"$f":"[2]!H_(11,V59,V60)","v":115.24874126368827},{"$f":"[2]!H_(11,W59,W60)","v":112.0163119401879},{"$f":"[2]!H_(11,X59,X60)","v":108.76731750137542},{"$f":"[2]!H_(11,Y59,Y60)","v":105.49881749614187}]
[null,"Hout",null,{"$f":"[2]!H_(11,D61,D62)","v":73.764914852456329},null,null,null,{"$f":"[2]!H_(11,H61,H62)","v":281.45672109508405},{"$f":"[2]!H_(11,I61,I62)","v":258.96154639893234},{"$f":"[2]!H_(11,J61,J62)","v":236.71160989719124},{"$f":"[2]!H_(11,K61,K62)","v":214.73451413139108},{"$f":"[2]!H_(11,L61,L62)","v":193.06300012502129},{"$f":"[2]!H_(11,M61,M62)","v":171.73621803796385},{"$f":"[2]!H_(11,N61,N62)","v":150.8012591461621},{"$f":"[2]!H_(11,O61,O62)","v":130.31471734207099},{"$f":"[2]!H_(11,P61,P62)","v":110.34310467299842},{"$f":"[2]!H_(11,Q61,Q62)","v":90.956755795967254},{"$f":"[2]!H_(11,R61,R62)","v":88.577411127715621},{"$f":"[2]!H_(11,S61,S62)","v":86.20794449226068},{"$f":"[2]!H_(11,T61,T62)","v":83.848281975399786},{"$f":"[2]!H_(11,U61,U62)","v":81.498282322530429},{"$f":"[2]!H_(11,V61,V62)","v":79.157716816759347},{"$f":"[2]!H_(11,W61,W62)","v":76.826242998934688},{"$f":"[2]!H_(11,X61,X62)","v":74.503368955341074},{"$f":"[2]!H_(11,Y61,Y62)","v":72.188405020420745}]
[null,"Sin = Sout",null,{"$f":"[2]!S_(11,D59,D60)","v":13.041567593259808},null,null,null,{"$f":"[2]!S_(11,H59,H60)","v":20.454827234244185},{"$f":"[2]!S_(11,I59,I60)","v":20.048552537988616},{"$f":"[2]!S_(11,J59,J60)","v":19.608086790186853},{"$f":"[2]!S_(11,K59,K60)","v":19.127075853727025},{"$f":"[2]!S_(11,L59,L60)","v":18.597178516585931},{"$f":"[2]!S_(11,M59,M60)","v":18.007122387049847},{"$f":"[2]!S_(11,N59,N60)","v":17.341107984483042},{"$f":"[2]!S_(11,O59,O60)","v":16.575915612374949},{"$f":"[2]!S_(11,P59,P60)","v":15.675140423508285},{"$f":"[2]!S_(11,Q59,Q60)","v":14.576016346597386},{"$f":"[2]!S_(11,R59,R60)","v":14.419591819482712},{"$f":"[2]!S_(11,S59,S60)","v":14.257941658486134},{"$f":"[2]!S_(11,T59,T60)","v":14.090668015708236},{"$f":"[2]!S_(11,U59,U60)","v":13.917321321614173},{"$f":"[2]!S_(11,V59,V60)","v":13.737390144489638},{"$f":"[2]!S_(11,W59,W60)","v":13.55028831817979},{"$f":"[2]!S_(11,X59,X60)","v":13.355338277852205},{"$f":"[2]!S_(11,Y59,Y60)","v":13.151749233935188}]
[null,"Tout(iso)",null,{"$f":"[1]!HeCalc(2,0,1,D61*10^5,8,D77*1000,1)","v":9.7639107105745424},null,null,null,{"$f":"[1]!HeCalc(2,0,1,H61*10^5,8,H77*1000,1)","v":37.064181629166129},{"$f":"[1]!HeCalc(2,0,1,I61*10^5,8,I77*1000,1)","v":34.284967219147049},{"$f":"[1]!HeCalc(2,0,1,J61*10^5,8,J77*1000,1)","v":31.508718195515822},{"$f":"[1]!HeCalc(2,0,1,K61*10^5,8,K77*1000,1)","v":28.735528084709969},{"$f":"[1]!HeCalc(2,0,1,L61*10^5,8,L77*1000,1)","v":25.965405906906113},{"$f":"[1]!HeCalc(2,0,1,M61*10^5,8,M77*1000,1)","v":23.198194296252826},{"$f":"[1]!HeCalc(2,0,1,N61*10^5,8,N77*1000,1)","v":20.433406394775528},{"$f":"[1]!HeCalc(2,0,1,O61*10^5,8,O77*1000,1)","v":17.669878547274468},{"$f":"[1]!HeCalc(2,0,1,P61*10^5,8,P77*1000,1)","v":14.904955713476571},{"$f":"[1]!HeCalc(2,0,1,Q61*10^5,8,Q77*1000,1)","v":12.132291602089348},{"$f":"[1]!HeCalc(2,0,1,R61*10^5,8,R77*1000,1)","v":11.784527857974361},{"$f":"[1]!HeCalc(2,0,1,S61*10^5,8,S77*1000,1)","v":11.436358227201209},{"$f":"[1]!HeCalc(2,0,1,T61*10^5,8,T77*1000,1)","v":11.08772017123921},{"$f":"[1]!HeCalc(2,0,1,U61*10^5,8,U77*1000,1)","v":10.738540503949787},{"$f":"[1]!HeCalc(2,0,1,V61*10^5,8,V77*1000,1)","v":10.388733003032256},{"$f":"[1]!HeCalc(2,0,1,W61*10^5,8,W77*1000,1)","v":10.038195413756663},{"$f":"[1]!HeCalc(2,0,1,X61*10^5,8,X77*1000,1)","v":9.6868054754606288},{"$f":"[1]!HeCalc(2,0,1,Y61*10^5,8,Y77*1000,1)","v":9.3344157809448394}]
[null,"Hout(iso)",null,{"$f":"[2]!H_(11,D61,D78)","v":63.616296135548602},null,null,null,{"$f":"[2]!H_(11,H61,H78)","v":207.71963288283436},{"$f":"[2]!H_(11,I61,I78)","v":193.23334914785471},{"$f":"[2]!H_(11,J61,J78)","v":178.75210341645615},{"$f":"[2]!H_(11,K61,K78)","v":164.27338996541658},{"$f":"[2]!H_(11,L61,L78)","v":149.79302002587332},{"$f":"[2]!H_(11,M61,M78)","v":135.30397064682634},{"$f":"[2]!H_(11,N61,N78)","v":120.79422129539887},{"$f":"[2]!H_(11,O61,O78)","v":106.24236530160582},{"$f":"[2]!H_(11,P61,P78)","v":91.607710806439897},{"$f":"[2]!H_(11,Q61,Q78)","v":76.804202249573592},{"$f":"[2]!H_(11,R61,R78)","v":74.933754835887981},{"$f":"[2]!H_(11,S61,S78)","v":73.057076120647025},{"$f":"[2]!H_(11,T61,T78)","v":71.173396403706121},{"$f":"[2]!H_(11,U61,U78)","v":69.281816729262758},{"$f":"[2]!H_(11,V61,V78)","v":67.381279058038629},{"$f":"[2]!H_(11,W61,W78)","v":65.470527778912313},{"$f":"[2]!H_(11,X61,X78)","v":63.548058675132893},{"$f":"[2]!H_(11,Y61,Y78)","v":61.612050711560428}]
[null,"ΔHs",null,{"$f":"D75-D79","v":42.285911320362338},null,null,null,151.09852352710655,140.02905849702222,129.03680046526588,118.12623684555325,107.30161627917641,96.566366746912109,85.921893277741106,75.364973158458213,64.881620513857669,54.430534042931924,53.121965198572923,51.811875067830485,50.499804833417016,49.185214109406232,47.867462205649645,46.545784161275591,45.219258826242523,43.88676678458144]
[null,"u1","m/s",{"$f":"(2*52.7%*D80*1000*D63)^0.5","v":184.04539223806461},null,null,null,{"$f":"PI()*$D$82*H65","v":184.04539223806461},184.04539223806461,184.04539223806461,184.04539223806461,184.04539223806461,184.04539223806461,184.04539223806461,184.04539223806461,184.04539223806461,{"$f":"PI()*$D$82*Q65","v":184.04539223806461},{"$f":"PI()*$D$82*R65","v":184.04539223806461},184.04539223806461,184.04539223806461,184.04539223806461,184.04539223806461,184.04539223806461,184.04539223806461,184.04539223806461]
[null,"D1",null,{"$f":"D81/PI()/D65","v":3.9160072096222902E-2}]
[null,"Co = (2*ΔHs)^0,5",null,{"$f":"(2000*D80)^0.5","v":290.81234953269205},null,null,null,549.72451924051302,529.20517476121154,508.0094496468858,486.05809703275855,463.25288186729375,439.46869455494124,414.54045225464091,388.23954759518824,360.22665230062495,329.94100697831402,325.95080978139299,321.90643071498425,317.80435753279727,313.64060358762936,309.41060811048362,305.10910888164449,300.72997464916102,296.26598449562664]
[null,"u1/Co",null,{"$f":"D81/D83","v":0.6328664946100403},null,null,null,0.33479567637320884,0.34777700788944427,0.36228734006029495,0.37864895855373565,0.39728925483681582,0.41879067728464953,0.44397450535179744,0.47405111967100805,0.51091553349159369,0.55781302822465273,0.56464161681788494,0.57173568054941493,0.57911538302010601,0.58680346273037121,0.59482573452150711,0.60321172616795926,0.61199550345048404,0.62121675072279992]
[null,"U1/C0 off de / U1/C0 nom",null,{"$f":"D84/$D$49","v":0.98709623358564935},null,null,null,{"$f":"H84/$D84","v":0.52901469618723185},{"$f":"I84/$D84","v":0.54952665507081},0.57245460637559775,0.59830779758225561,0.62776155511537635,0.66173621269474847,0.70152948391645487,0.74905390585278009,0.80730381185120192,0.88140711030746854,0.89219704570678182,0.90340646158192817,0.9150672186824258,0.92721524638770425,0.93989133504061839,0.95314214183458434,0.96702149452165809,0.98159209882896592]
[null,"Rdt",null,{"$f":"(0.321*D85^4-1.6098*D85^3+1.316*D85^2+0.9448*D85)*($D63/0.97215493)","v":0.75935604730996153},null,null,null,{"$f":"(0.321*H85^4-1.6098*H85^3+1.316*H85^2+0.9448*H85)*($D63/0.97215493)","v":0.51199332401801023},{"$f":"(0.321*I85^4-1.6098*I85^3+1.316*I85^2+0.9448*I85)*($D63/0.97215493)","v":0.53061030362869022},0.55082963719069733,0.57282035292505762,0.59674437720892748,0.62272322529621882,0.65076377270032926,0.68058965549086037,0.71123726999764214,0.73998870679403372,0.74316356255218474,0.74618041994430995,0.74901119690451434,0.75162321005464805,0.7539782303869057,0.75603128350625293,0.75772910559421447,0.75900812286425579]
[]
[null,"TURBINE 3"]
[]
[null,null,null,"DESIGN",null,{"$f":"F56","v":0},{"$f":"G56","v":0},{"$f":"H56","v":"start-up"},{"$f":"I56","v":"start-up"}]
[]
[null,"m","g/s",399.8,null,{"$f":"F105/(F95*F94)^0.5*F93","v":161.47618188513178},{"$f":"G105/(G95*G94)^0.5*G93","v":95.080415199611181},{"$error":"#DIV/0!"},117.10102732642108]
[null,"Pin","Bara",13.07,null,13.07,7.3689999999999998,null,10.48]
[null,"Tin","K",7.2919999999999998,null,9.16,7.9119999999999999,null,10.55]
[null,"Pout","Bara",4.88,null,4.88,5.18,null,5.18]
[null,"Tout","K",{"$f":"[2]!T2_turb(11,D93,D94,D95,D97)","v":6.1198408797506243},null,{"$f":"[2]!T2_turb(11,F93,F94,F95,F97)","v":7.0494463059442776},{"$f":"[2]!T2_turb(11,G93,G94,G95,G97)","v":7.1447253899950391},{"$f":"[2]!T2_turb(11,H93,H94,H95,H97)","v":{"$error":"#VALUE!"}},{"$f":"[2]!T2_turb(11,I93,I94,I95,I97)","v":8.6903815136344829}]
[null,"Efficacity","%",0.72,null,{"$f":"(0.321*F119^4-1.6098*F119^3+1.316*F119^2+0.9448*F119)*($D$97/0.97215493)","v":0.58179731360313081},{"$f":"(0.321*G119^4-1.6098*G119^3+1.316*G119^2+0.9448*G119)*($D$97/0.97215493)","v":0.582724483494652},{"$f":"(0.321*H119^4-1.6098*H119^3+1.316*H119^2+0.9448*H119)*($D$97/0.97215493)","v":{"$error":"#VALUE!"}},{"$f":"(0.321*I119^4-1.6098*I119^3+1.316*I119^2+0.9448*I119)*($D$97/0.97215493)","v":0.50201641458397539}]
[null,"Power","W",{"$f":"+D92*(D109-D110)","v":2075.5404202052005},null,954.74184184263254,182.5140950412455,{"$error":"#DIV/0!"},610.67834348723773]
[null,"Speed","Hz",2076,null,1602.552519659416,914.20818650847264,862.66257848011605,1367.3629344539765]
[null,null,null,null,null,{"$f":"(F98/$D98*$D102/F102)^(1/3)*$D99","v":1602.5525123839127},{"$f":"(G98/$D98*$D102/G102)^(1/3)*$D99","v":914.20817108894096},{"$f":"(H98/$D98*$D102/H102)^(1/3)*$D99","v":{"$error":"#DIV/0!"}},{"$f":"(I98/$D98*$D102/I102)^(1/3)*$D99","v":1367.3629301538849}]
[null,null,null,null,null,{"$f":"F99-F100","v":7.2755033215798903E-6},{"$f":"G99-G100","v":1.5419531678162457E-5},{"$f":"H99-H100","v":{"$error":"#DIV/0!"}},{"$f":"I99-I100","v":4.300091632103431E-6}]
[null,"Brake Pressure",null,10.1,null,{"$f":"($D102-$D95)+F95","v":10.1},{"$f":"($D102-$D95)+G95","v":10.399999999999999},{"$f":"($D102-$D95)+H95","v":5.22},{"$f":"($D102-$D95)+I95","v":10.399999999999999}]
[null,"Rho (brake)",null,{"$f":"[2]!rho_(11,D102,330)","v":1.4673342046153373},null,{"$f":"[2]!rho_(11,F102,330)","v":1.4673342046153373},{"$f":"[2]!rho_(11,G102,330)","v":1.5107331217743123},{"$f":"[2]!rho_(11,H102,330)","v":0.75987987169063398},{"$f":"[2]!rho_(11,I102,330)","v":1.5107331217743123}]
[null,"Wheel","mm",29.5,null,{"$f":"$D$104","v":29.5},{"$f":"$D$104","v":29.5},{"$f":"$D$104","v":29.5},{"$f":"$D$104","v":29.5}]
[null,"a = mÖT/P",null,{"$f":"D92*D94^0.5/D93","v":82.601994178997316},null,{"$f":"$D$105","v":82.601994178997316},{"$f":"$D$105","v":82.601994178997316},82.601994178997316,82.601994178997316]
[null,"Rho (in)","kg/m3",{"$f":"[2]!rho_(11,D93,D94)","v":122.0413850208848},null,{"$f":"[2]!rho_(11,F93,F94)","v":92.042022544510019},{"$f":"[2]!rho_(11,G93,G94)","v":70.649649504414128},{"$f":"[2]!rho_(11,H93,H94)","v":"NUM"},{"$f":"[2]!rho_(11,I93,I94)","v":58.789985568547117}]
[null,"Sound Speed",null,{"$f":"[2]!Sound_speed(11,D93,D94)","v":249.05671288435045},null,{"$f":"[2]!Sound_speed(11,F93,F94)","v":219.03534618547846},{"$f":"[2]!Sound_speed(11,G93,G94)","v":170.78644408370695},{"$f":"[2]!Sound_speed(11,H93,H94)","v":"NUM"},{"$f":"[2]!Sound_speed(11,I93,I94)","v":204.26692373410398}]
[null,"S=Q/(rho*V) = cte",null,{"$f":"D92/(D106*D107)","v":1.3153381307708404E-2},null,8.0095499679843866E-3,7.8800262035761022E-3,{"$error":"#DIV/0!"},9.7512278209034905E-3]
[null,"Hin",null,{"$f":"[2]!H_(11,D93,D94)","v":28.150884578454882},null,{"$f":"[2]!H_(11,F93,F94)","v":40.890140453818937},{"$f":"[2]!H_(11,G93,G94)","v":36.811643961665368},{"$f":"[2]!H_(11,H93,H94)","v":{"$error":"#VALUE!"}},{"$f":"[2]!H_(11,I93,I94)","v":54.059832308617963}]
[null,"Hout",null,{"$f":"[2]!H_(11,D95,D96)","v":22.959437804554931},null,{"$f":"[2]!H_(11,F95,F96)","v":34.977554271159498},{"$f":"[2]!H_(11,G95,G96)","v":34.892067835939827},{"$f":"[2]!H_(11,H95,H96)","v":{"$error":"#VALUE!"}},{"$f":"[2]!H_(11,I95,I96)","v":48.844862317065612}]
[null,"Sin = Sout",null,{"$f":"[2]!S_(11,D93,D94)","v":5.0600046690749361},null,{"$f":"[2]!S_(11,F93,F94)","v":6.606972813997622},{"$f":"[2]!S_(11,G93,G94)","v":6.9458302073485418},{"$f":"[2]!S_(11,H93,H94)","v":{"$error":"#VALUE!"}},{"$f":"[2]!S_(11,I93,I94)","v":8.3000204511344844}]
[null,"Tout(iso)",null,{"$f":"[1]!HeCalc(2,0,1,D95*10^5,8,D111*1000,1)","v":5.9351387842537191},null,{"$f":"[1]!HeCalc(2,0,1,F95*10^5,8,F111*1000,1)","v":6.6999950291002683},{"$f":"[1]!HeCalc(2,0,1,G95*10^5,8,G111*1000,1)","v":7.0241819850115181},{"$f":"[1]!HeCalc(2,0,1,H95*10^5,8,H111*1000,1)","v":{"$error":"#VALUE!"}},{"$f":"[1]!HeCalc(2,0,1,I95*10^5,8,I111*1000,1)","v":8.0488946725573083}]
[null,"Hout(iso)",null,{"$f":"[2]!H_(11,D95,D112)","v":20.940541836947467},null,{"$f":"[2]!H_(11,F95,F112)","v":30.727518437529557},{"$f":"[2]!H_(11,G95,G112)","v":33.517503797489027},{"$f":"[2]!H_(11,H95,H112)","v":{"$error":"#VALUE!"}},{"$f":"[2]!H_(11,I95,I112)","v":43.671785543492518}]
[null,"ΔHs",null,{"$f":"D109-D113","v":7.2103427415074144},null,10.162622016289379,3.2941401641763406,{"$error":"#VALUE!"},10.388046765125445]
[null,"u1","m/s",{"$f":"(2*52.7%*D114*1000*D97)^0.5","v":73.971514109656738},null,{"$f":"PI()*$D$116*F99","v":57.101751598965535},{"$f":"PI()*$D$116*G99","v":32.574838038282842},30.738177791866459,48.72153497060885]
[null,"D1",null,{"$f":"D115/PI()/D99","v":1.1341938457171245E-2},null,null,null,null,null,null,null,null,"T3"]
[null,"Co = (2*ΔHs)^0,5",null,{"$f":"(2000*D114)^0.5","v":120.0861585821398},null,142.56663015088333,81.16822240478524,{"$error":"#VALUE!"},144.13914641848999,null,null,"MAX",{"$f":"ROUND(F92,0)&\"g/s @ \"&F93&\" b ; \"&F94&\"K\"","v":"161g/s @ 13,07 b ; 9,16K"}]
[null,"u1/Co",null,{"$f":"D115/D117","v":0.61598701285010871},null,0.40052676799986592,0.40132501455843644,{"$error":"#VALUE!"},0.33801736850273811,null,null,"MIN",{"$f":"ROUND(G92,0)&\"g/s @ \"&G93&\" b ; \"&G94&\"K\"","v":"95g/s @ 7,369 b ; 7,912K"}]
[null,"U1/C0 off de / U1/C0 nom",null,{"$f":"D118/$D$49","v":0.96076892283052273},null,{"$f":"F118/$D118","v":0.65021950080841751},{"$f":"G118/$D118","v":0.65151538293242062},{"$f":"H118/$D118","v":{"$error":"#VALUE!"}},{"$f":"I118/$D118","v":0.54874106344996854},null,null,"STS",{"$f":"ROUND(H92,0)&\"g/s @ \"&H93&\" b ; \"&H94&\"K\"","v":{"$error":"#DIV/0!"}}]
[null,"Rdt",null,{"$f":"(0.321*D119^4-1.6098*D119^3+1.316*D119^2+0.9448*D119)*($D97/0.97215493)","v":0.7171786087866604},null,{"$f":"(0.321*F119^4-1.6098*F119^3+1.316*F119^2+0.9448*F119)*($D97/0.97215493)","v":0.58179731360313081},{"$f":"(0.321*G119^4-1.6098*G119^3+1.316*G119^2+0.9448*G119)*($D97/0.97215493)","v":0.582724483494652},{"$f":"(0.321*H119^4-1.6098*H119^3+1.316*H119^2+0.9448*H119)*($D97/0.97215493)","v":{"$error":"#VALUE!"}},{"$f":"(0.321*I119^4-1.6098*I119^3+1.316*I119^2+0.9448*I119)*($D97/0.97215493)","v":0.50201641458397539},null,null,"BAKING",{"$f":"ROUND(I92,0)&\"g/s @ \"&I93&\" b ; \"&I94&\"K\"","v":"117g/s @ 10,48 b ; 10,55K"}]
[]
[null,null,null,null,null,null,null,null,null,null,null,null,{"$f":"M47","v":0},{"$f":"M116","v":"T3"},"T1+T2"]
[null,"Courbe de rendement TC3",null,null,null,null,null,null,null,null,null,{"$f":"L117","v":"MAX"},{"$f":"M48","v":410.10062599979824},{"$f":"M117","v":"161g/s @ 13,07 b ; 9,16K"},{"$f":"F92+F58","v":161.47618188513178}]
[null,null,null,null,null,null,null,null,null,null,null,{"$f":"L118","v":"MIN"},{"$f":"M49","v":0.54638790605180099},{"$f":"M118","v":"95g/s @ 7,369 b ; 7,912K"},{"$f":"G92+G58","v":95.080415199611181}]
[null,null,null,null,null,null,null,null,null,null,null,{"$f":"L119","v":"STS"},{"$f":"M50","v":0.85221361651134864},{"$f":"M119","v":{"$error":"#DIV/0!"}},{"$f":"H92+H58","v":{"$error":"#DIV/0!"}}]
[null,null,null,null,null,null,null,null,null,null,null,{"$f":"L120","v":"BAKING"},{"$f":"M51","v":0.75096641423816679},{"$f":"M120","v":"117g/s @ 10,48 b ; 10,55K"},{"$f":"I92+I58","v":197.73312211833871}]
[null,null,null,null,"d : mm"]
[null,null,null,null,"N : Hz"]
[null,null,null,null,"H : J/kG"]
[]
[]
[]
[]
[]
[null,"rendement=(0,321*rap^4 - 1,6098*rap^3 + 1,316*rap^2 + 0,9448*rap)*(ETAgar/0,97)",null,null,null,null,null,null,"U1/CO _nom",0.64]
[null,null,null,null,null,null,null,null,"Eta_gar",0.8]
[null,"U1/C0",{"$f":"D28","v":0.78},{"$f":"D63","v":0.76},{"$f":"D97","v":0.72}]
[null,0,{"$f":"(0.321*B138^4-1.6098*B138^3+1.316*B138^2+0.9448*B138)*$D$28/0.97215493","v":0}]
[null,{"$f":"B138+0.05","v":0.05},{"$f":"(0.321*$B139^4-1.6098*$B139^3+1.316*$B139^2+0.9448*$B139)*$C$137/0.97215493","v":4.0382461852042459E-2},{"$f":"(0.321*$B139^4-1.6098*$B139^3+1.316*$B139^2+0.9448*$B139)*$D$137/0.97215493","v":3.9347014112246496E-2},{"$f":"(0.321*$B139^4-1.6098*$B139^3+1.316*$B139^2+0.9448*$B139)*$E$137/0.97215493","v":3.7276118632654578E-2}]
[null,0.1,{"$f":"(0.321*$B140^4-1.6098*$B140^3+1.316*$B140^2+0.9448*$B140)*$C$137/0.97215493","v":8.5098158171146673E-2},{"$f":"(0.321*$B140^4-1.6098*$B140^3+1.316*$B140^2+0.9448*$B140)*$D$137/0.97215493","v":8.2916154115476232E-2},{"$f":"(0.321*$B140^4-1.6098*$B140^3+1.316*$B140^2+0.9448*$B140)*$E$137/0.97215493","v":7.8552146004135376E-2}]
[null,0.15000000000000002,0.13323633134792623,0.12982001515951785,0.12298738278270113]
[null,0.2,0.18392485650409657,0.17920883454245307,0.16977679061916603]
[null,0.25,0.23633024149247489,0.23027049171061653,0.21815099214689987]
[null,0.3,0.28965762689698032,0.28223050825859619,0.26737627098182798]
[null,0.35,0.34315078603263366,0.33435204792923284,0.3167545717224311]
[null,0.39999999999999997,0.39609212494555779,0.38593591661362037,0.36562349994974563]
[null,0.44999999999999996,0.4478026824129771,0.43632056235110589,0.41335632222736346]
[null,0.49999999999999994,0.49764212994321799,0.48488207532928934,0.45936196610143198]
[null,0.54999999999999993,0.54500877177570861,0.53103418788402379,0.50308502010065403]
[null,0.6,0.58933954488097895,0.57422827449941549,0.54400573373628835]
[null,0.65,0.63011001896066099,0.61395335180782351,0.58164001750214867]
[null,0.70000000000000007,0.66683439644748832,0.64973607858986027,0.61553944287460449]
[null,0.75000000000000011,0.69906551250529614,0.68114075577439104,0.64529124231258095]
[null,0.80000000000000016,0.7263948350290218,0.70776932643853407,0.67051830925755851]
[null,0.8500000000000002,0.74845246464470438,0.72926137580766071,0.69087919813357312]
[null,0.90000000000000024,0.76490713470948513,0.74529413125539579,0.70606812434721711]
[null,0.95000000000000029,0.77546621131160665,0.7555824623036167,0.71581496428763691]
[null,1.0000000000000002,0.77987569327041351,0.75987888062245412,0.71988525532653547]
[null,1.0500000000000003,0.77792021213635165,0.75797354003029138,0.71808019581817073]
[null,1.1000000000000003,0.76942303219096997,0.74969423649376565,0.7102366450993568]
[null,1.1500000000000004,0.75424605044691839,0.73490640812776653,0.69622712348946292]
[null,1.2000000000000004,0.7322897966479478,0.71351313519543635,0.67595981229041324,null,"F Let u be the peripheral speed of the wheel : u = p . Æ . N / 60                      (in m/s)"]
[null,1.2500000000000004,0.70349343326891334,0.68545514010817188,0.64937855378668918,null,"F Let n, be the speed ratio of the turbine : n =  u / [ 2 . (H1 - H2S ) ] 0.5       (dimensionless number)"]
[null,1.3000000000000005,0.66783475551576954,0.65071078742562172,0.61646285124532574,null,null,"N = speed of rotation of the turbine (in rpm)"]
[null,1.3500000000000005,0.62533019132557388,0.60929608385568745,0.57722786891591438,null,null,"Æ = diameter of the wheel of the turbine (in m)"]
[null,1.4000000000000006,0.57603480136648577,0.56126467825452464,0.53172443203060227]
[null,1.4500000000000006,0.5200422790377659,0.50670786162654113,0.48003902680409161]
[null,1.5000000000000007,0.45748495046977738,0.44575456712439848,0.42229380043364062]

{"sheet":"Turbines_JT60SA_serial","index":3,"n_rows":173,"n_cols":40,"rows_kept":173,"cut":false,"hidden":false,"merged":[]}
[]
[]
[]
[]
[null,null,null,null,"Vitesse de la roue ajustée en fonction de la puissance du frein",null,null,null,null,null,null,{"$f":"D70*0.3","v":448.8}]
[]
[1,2,3,4,5,6,7,8,9,10,11,12,13,14,15,16,17,18,19,20,21,22,23,24,25,26,27,28,29,30,31,32,33]
[null,"Relation entre la puissance et la vitesse de rotation",null,null,null,null,null,null,null,null,null,null,"²"]
[]
[null,"CV330"]
[null,"Pin","Bara",15,null,null,null,15,15,15,15,15,15,15,15,15,15,15,15,15,15,15,15,15,15]
[null,"Tin","K",{"$f":"[2]!T_P_H_(11,D11,[2]!H_(11,D29,D30))","v":40.028139559593733},null,null,null,{"$f":"[2]!T_P_H_(11,H11,[2]!H_(11,H29,H30))","v":79.74905181387355},{"$f":"[2]!T_P_H_(11,I11,[2]!H_(11,I29,I30))","v":75.76249620793493},{"$f":"[2]!T_P_H_(11,J11,[2]!H_(11,J29,J30))","v":71.777830878028993},{"$f":"[2]!T_P_H_(11,K11,[2]!H_(11,K29,K30))","v":65.804972525710028},{"$f":"[2]!T_P_H_(11,L11,[2]!H_(11,L29,L30))","v":61.826263590656708},{"$f":"[2]!T_P_H_(11,M11,[2]!H_(11,M29,M30))","v":57.850464304103362},{"$f":"[2]!T_P_H_(11,N11,[2]!H_(11,N29,N30))","v":53.877809985341152},{"$f":"[2]!T_P_H_(11,O11,[2]!H_(11,O29,O30))","v":49.908314917844102},{"$f":"[2]!T_P_H_(11,P11,[2]!H_(11,P29,P30))","v":45.941370455652802},{"$f":"[2]!T_P_H_(11,Q11,[2]!H_(11,Q29,Q30))","v":41.974573789497299},{"$f":"[2]!T_P_H_(11,R11,[2]!H_(11,R29,R30))","v":41.478445457580861},{"$f":"[2]!T_P_H_(11,S11,[2]!H_(11,S29,S30))","v":40.982183445201102},{"$f":"[2]!T_P_H_(11,T11,[2]!H_(11,T29,T30))","v":40.485754672971986},{"$f":"[2]!T_P_H_(11,U11,[2]!H_(11,U29,U30))","v":39.989119449356529},{"$f":"[2]!T_P_H_(11,V11,[2]!H_(11,V29,V30))","v":39.492229789598206},{"$f":"[2]!T_P_H_(11,W11,[2]!H_(11,W29,W30))","v":38.995027169174534},{"$f":"[2]!T_P_H_(11,X11,[2]!H_(11,X29,X30))","v":38.497439471580599},{"$f":"[2]!T_P_H_(11,Y11,[2]!H_(11,Y29,Y30))","v":37.999376754089582}]
[null,"Rho",null,{"$f":"[2]!rho_(11,D11,D12)","v":17.34400697294025},null,null,null,{"$f":"[2]!rho_(11,H11,H12)","v":8.8185700956575843},{"$f":"[2]!rho_(11,I11,I12)","v":9.2721137159717859},{"$f":"[2]!rho_(11,J11,J12)","v":9.7751109935317757},{"$f":"[2]!rho_(11,K11,K12)","v":10.641792036831724},{"$f":"[2]!rho_(11,L11,L12)","v":11.311121939414722},{"$f":"[2]!rho_(11,M11,M12)","v":12.071289020220251},{"$f":"[2]!rho_(11,N11,N12)","v":12.942511103191086},{"$f":"[2]!rho_(11,O11,O12)","v":13.951703210826363},{"$f":"[2]!rho_(11,P11,P12)","v":15.135701183093179},{"$f":"[2]!rho_(11,Q11,Q12)","v":16.546873262265752},{"$f":"[2]!rho_(11,R11,R12)","v":16.74276622727653},{"$f":"[2]!rho_(11,S11,S12)","v":16.943577857885877},{"$f":"[2]!rho_(11,T11,T12)","v":17.149515896587125},{"$f":"[2]!rho_(11,U11,U12)","v":17.360802974706992},{"$f":"[2]!rho_(11,V11,V12)","v":17.577678625673283},{"$f":"[2]!rho_(11,W11,W12)","v":17.800401802557978},{"$f":"[2]!rho_(11,X11,X12)","v":18.029254093599924},{"$f":"[2]!rho_(11,Y11,Y12)","v":18.264543932788179}]
[null,"dP",null,{"$f":"(D11-D29)*1000","v":230.00000000000043},null,null,null,{"$f":"(H11-H29)*1000","v":5269.6596513491013},{"$f":"(I11-I29)*1000","v":5197.115883366605},5106.2506378624557,4922.8684741141142,4756.288108253385,4537.6950578747674,4242.938204403993,3829.5977319102212,3214.3888874442796,2202.6005791354974,2027.4762410181459,1836.3974184347303,1626.9050002994625,1395.9648783322809,1139.7788040147886,853.51195393756279,530.88868019897359,163.57311283525001]
[null,"Cvs",null,30,null,null,null,30,30,30,30,30,30,30,30,30,30,30,30,30,30,30,30,30,30]
[null,"Range",null,250,null,null,null,250,250,250,250,250,250,250,250,250,250,250,250,250,250,250,250,250,250]
[null,"Flow",null,{"$f":"IF(D11/2>D29,\"S\",\"SS\")","v":"SS"},null,null,null,{"$f":"IF(H11/2>H29,\"S\",\"SS\")","v":"SS"},{"$f":"IF(I11/2>I29,\"S\",\"SS\")","v":"SS"},"SS","SS","SS","SS","SS","SS","SS","SS","SS","SS","SS","SS","SS","SS","SS","SS"]
[null,"Cv",null,{"$f":"[2]!Cv_Simple(D12,D11,D11-D29,D13,D28,D17)","v":12.717086074964683},null,null,null,{"$f":"[2]!Cv_Simple(H12,H11,H11-H29,H13,H28,H17)","v":2.1392298461395423},{"$f":"[2]!Cv_Simple(I12,I11,I11-I29,I13,I28,I17)","v":2.1633578267508948},{"$f":"[2]!Cv_Simple(J12,J11,J11-J29,J13,J28,J17)","v":2.1939720321481877},{"$f":"[2]!Cv_Simple(K12,K11,K11-K29,K13,K28,K17)","v":2.257401407335716},{"$f":"[2]!Cv_Simple(L12,L11,L11-L29,L13,L28,L17)","v":2.3172597052951271},{"$f":"[2]!Cv_Simple(M12,M11,M11-M29,M13,M28,M17)","v":2.3995732317518139},{"$f":"[2]!Cv_Simple(N12,N11,N11-N29,N13,N28,N17)","v":2.5184661694733164},{"$f":"[2]!Cv_Simple(O12,O11,O11-O29,O13,O28,O17)","v":2.7038836966976385},{"$f":"[2]!Cv_Simple(P12,P11,P11-P29,P13,P28,P17)","v":3.0344183212594702},{"$f":"[2]!Cv_Simple(Q12,Q11,Q11-Q29,Q13,Q28,Q17)","v":3.8233069689131787},{"$f":"[2]!Cv_Simple(R12,R11,R11-R29,R13,R28,R17)","v":4.012596513384465},{"$f":"[2]!Cv_Simple(S12,S11,S11-S29,S13,S28,S17)","v":4.2475485396746793},{"$f":"[2]!Cv_Simple(T12,T11,T11-T29,T13,T28,T17)","v":4.5489401161984429},{"$f":"[2]!Cv_Simple(U12,U11,U11-U29,U13,U28,U17)","v":4.9534812384085321},{"$f":"[2]!Cv_Simple(V12,V11,V11-V29,V13,V28,V17)","v":5.5338104687094551},{"$f":"[2]!Cv_Simple(W12,W11,W11-W29,W13,W28,W17)","v":6.4610202776805048},{"$f":"[2]!Cv_Simple(X12,X11,X11-X29,X13,X28,X17)","v":8.2856912817392203},{"$f":"[2]!Cv_Simple(Y12,Y11,Y11-Y29,Y13,Y28,Y17)","v":15.116153124259892}]
[null,"Cv",null,{"$f":"[2]!cv_gaz(11,D28,D11,D29,D12,0.87)","v":12.689488996002535},null,null,null,{"$f":"[2]!cv_gaz(11,H28,H11,H29,H12,0.87)","v":1.9436992107946489},{"$f":"[2]!cv_gaz(11,I28,I11,I29,I12,0.87)","v":1.9693440128641393},{"$f":"[2]!cv_gaz(11,J28,J11,J29,J12,0.87)","v":2.0018924768918045},{"$f":"[2]!cv_gaz(11,K28,K11,K29,K12,0.87)","v":2.0693185341607467},{"$f":"[2]!cv_gaz(11,L28,L11,L29,L12,0.87)","v":2.1328984876744532},{"$f":"[2]!cv_gaz(11,M28,M11,M29,M12,0.87)","v":2.2202128715999501},{"$f":"[2]!cv_gaz(11,N28,N11,N29,N12,0.87)","v":2.3460470728593648},{"$f":"[2]!cv_gaz(11,O28,O11,O29,O12,0.87)","v":2.5415750456955561},{"$f":"[2]!cv_gaz(11,P28,P11,P29,P12,0.87)","v":2.888020498818074},{"$f":"[2]!cv_gaz(11,Q28,Q11,Q29,Q12,0.87)","v":3.7059149416372059},{"$f":"[2]!cv_gaz(11,R28,R11,R29,R12,0.87)","v":3.9007125211640608},{"$f":"[2]!cv_gaz(11,S28,S11,S29,S12,0.87)","v":4.1418972481935787},{"$f":"[2]!cv_gaz(11,T28,T11,T29,T12,0.87)","v":4.4504377282561967},{"$f":"[2]!cv_gaz(11,U28,U11,U29,U12,0.87)","v":4.8633301108776621},{"$f":"[2]!cv_gaz(11,V28,V11,V29,V12,0.87)","v":5.4536769671678389},{"$f":"[2]!cv_gaz(11,W28,W11,W29,W12,0.87)","v":6.3934263566416112},{"$f":"[2]!cv_gaz(11,X28,X11,X29,X12,0.87)","v":8.235152395316641},{"$f":"[2]!cv_gaz(11,Y28,Y11,Y29,Y12,0.87)","v":15.095890474206236}]
[null,"Trim",null,{"$f":"[2]!Trim_From_Cv(D18/D15,D16)","v":0.84456089703109605},null,null,null,{"$f":"[2]!Trim_From_Cv(H18/H15,H16)","v":0.52172956728878139},{"$f":"[2]!Trim_From_Cv(I18/I15,I16)","v":0.52376085664233774},{"$f":"[2]!Trim_From_Cv(J18/J15,J16)","v":0.52630584437268313},{"$f":"[2]!Trim_From_Cv(K18/K15,K16)","v":0.53146765173655774},{"$f":"[2]!Trim_From_Cv(L18/L15,L16)","v":0.53620751940282274},{"$f":"[2]!Trim_From_Cv(M18/M15,M16)","v":0.54252932008409571},{"$f":"[2]!Trim_From_Cv(N18/N15,N16)","v":0.55128771801287346},{"$f":"[2]!Trim_From_Cv(O18/O15,O16)","v":0.56415371370327283},{"$f":"[2]!Trim_From_Cv(P18/P15,P16)","v":0.58504141086586525},{"$f":"[2]!Trim_From_Cv(Q18/Q15,Q16)","v":0.62689555073879311},{"$f":"[2]!Trim_From_Cv(R18/R15,R16)","v":0.6356473639418132},{"$f":"[2]!Trim_From_Cv(S18/S15,S16)","v":0.64595323440264529},{"$f":"[2]!Trim_From_Cv(T18/T15,T16)","v":0.65836883654705802},{"$f":"[2]!Trim_From_Cv(U18/U15,U16)","v":0.67379887341878419},{"$f":"[2]!Trim_From_Cv(V18/V15,V16)","v":0.69386349472615638},{"$f":"[2]!Trim_From_Cv(W18/W15,W16)","v":0.72191958587447169},{"$f":"[2]!Trim_From_Cv(X18/X15,X16)","v":0.7669697720119184},{"$f":"[2]!Trim_From_Cv(Y18/Y15,Y16)","v":0.87586012534054936}]
[]
[]
[]
[null,"TURBINE 1"]
[]
[null,null,null,"DESIGN",null,null,null,"start-up","start-up","start-up","start-up","start-up","start-up","start-up","start-up","start-up","start-up"]
[]
[null,"m","g/s",191.5,null,null,null,{"$f":"H41*H29/H30^0.5","v":89.240935826493427},92.241881020687188,95.647964911157828,101.7527223113034,106.71920677945342,112.69235518470391,120.08198591056735,129.58803039064682,142.54574852921488,161.98625233094222,165.18914467162824,168.64128853373413,172.37945217950357,176.44884783100846,180.90588353632617,185.82212039686431,191.29013393552344,197.43247984118725]
[null,"Pin","Bara",14.77,null,null,null,9.7303403486508984,9.8028841166333951,9.8937493621375445,10.077131525885886,10.243711891746615,10.462304942125233,10.757061795596007,11.170402268089779,11.785611112555721,12.797399420864503,12.972523758981854,13.16360258156527,13.373094999700537,13.604035121667719,13.860221195985211,14.146488046062437,14.469111319801026,14.83642688716475]
[null,"Tin","K",40.03,null,null,null,80,{"$f":"H30-4","v":76},{"$f":"I30-4","v":72},66,62,58,54,50,46,42,{"$f":"Q30-0.5","v":41.5},{"$f":"R30-0.5","v":41},40.5,40,39.5,39,38.5,38]
[null,"Pout","Bara",6.36,null,null,null,{"$f":"H64","v":4.8611803786639429},4.8693514385585583,4.881990177216764,4.9130637687379588,4.9457777111148831,4.9932641526823787,5.0633001662480153,5.1699190045544059,5.3414192726405281,5.6457491347923821,{"$f":"R64","v":5.7005047579863737},5.7608224612458026,5.8275921609718768,5.9019153476654225,{"$f":"V64","v":5.9851753682022801},6.0791388401038642,6.1861064588873731,6.3091445919169935]
[null,"Tout","K",{"$f":"[2]!T2_turb(11,D29,D30,D31,D33)","v":31.094586910112792},null,null,null,{"$f":"[2]!T2_turb(11,H29,H30,H31,H33)","v":66.26207257386136},{"$f":"[2]!T2_turb(11,I29,I30,I31,I33)","v":62.685949527727971},{"$f":"[2]!T2_turb(11,J29,J30,J31,J33)","v":59.122712416246827},{"$f":"[2]!T2_turb(11,K29,K30,K31,K33)","v":53.803819897507616},{"$f":"[2]!T2_turb(11,L29,L30,L31,L33)","v":50.276397438897376},{"$f":"[2]!T2_turb(11,M29,M30,M31,M33)","v":46.764632754845891},{"$f":"[2]!T2_turb(11,N29,N30,N31,N33)","v":43.268977108660906},{"$f":"[2]!T2_turb(11,O29,O30,O31,O33)","v":39.78924801695419},{"$f":"[2]!T2_turb(11,P29,P30,P31,P33)","v":36.323763953436277},{"$f":"[2]!T2_turb(11,Q29,Q30,Q31,Q33)","v":32.866985893659795},{"$f":"[2]!T2_turb(11,R29,R30,R31,R33)","v":32.43488051662716},{"$f":"[2]!T2_turb(11,S29,S30,S31,S33)","v":32.002625179927065},{"$f":"[2]!T2_turb(11,T29,T30,T31,T33)","v":31.570152846024563},{"$f":"[2]!T2_turb(11,U29,U30,U31,U33)","v":31.13738356248794},{"$f":"[2]!T2_turb(11,V29,V30,V31,V33)","v":30.704221148752286},{"$f":"[2]!T2_turb(11,W29,W30,W31,W33)","v":30.270548701052626},{"$f":"[2]!T2_turb(11,X29,X30,X31,X33)","v":29.836222367707588},{"$f":"[2]!T2_turb(11,Y29,Y30,Y31,Y33)","v":29.401062569758071}]
[null,"Efficacity","%",0.78,null,null,null,{"$f":"(0.321*H55^4-1.6098*H55^3+1.316*H55^2+0.9448*H55)*($D$33/0.97215493)","v":0.71244306313186256},{"$f":"(0.321*I55^4-1.6098*I55^3+1.316*I55^2+0.9448*I55)*($D$33/0.97215493)","v":0.72150652369888379},0.7304755833371277,0.74354615694171233,0.75182065691706701,0.75954738283124834,0.76650239252378305,0.77239817818647472,0.77687216580188656,0.77949230067234387,{"$f":"(0.321*R55^4-1.6098*R55^3+1.316*R55^2+0.9448*R55)*($D$33/0.97215493)","v":0.77966724514469299},0.77980580491105245,0.77990747889990819,0.77997193336167769,{"$f":"(0.321*V55^4-1.6098*V55^3+1.316*V55^2+0.9448*V55)*($D$33/0.97215493)","v":0.77999905905380928},0.77998904922991719,0.77994250839431545,0.77986060797742085]
[null,"Power","W",{"$f":"+D28*(D45-D46)","v":9122.4436160855366},null,null,null,{"$f":"+H28*(H45-H46)","v":6493.040253146135},6507.3748748966182,6529.5472173087837,6584.0601202491152,6641.4507140008336,6724.7569428635015,6847.6222492632023,7034.6653909980778,7335.5310703158502,7869.4218405401161,7965.4805056850773,8071.2968199577072,8188.4319755721008,8318.8183458983367,8464.8827494618454,8629.724378541825,8817.379386213217,9033.2271602769451]
[null,"Speed","Hz",1995,null,null,null,1995,1995,1995,1995,1995,1995,1995,1995,1995,1995,1995,1995,1995,1995,1995,1995,1995,1995]
[null,"Speed calculated from P=K.rho.N^3",null,null,null,null,null,{"$f":"(H34/$D34*$D38/H38)^(1/3)*$D35","v":1994.9999999810127},1994.9999999796835,1994.9999999749607,1995.0000001439248,1995.0000000024156,1995.0000000852592,1995.0000002411759,1995.0000001649325,1995.0000002748548,1995.0000002073709,1994.9999997794641,1994.9999995792584,1994.9999994006878,1995.0000001128817,1995.0000009525615,1995.0000008872719,1995.0000004157534,1995.0000003200303]
[null,"Delta Speed Frein & Turbine",null,{"$f":"D31-D38","v":1.1600000000000001},null,null,null,{"$f":"H35-H36","v":1.898729351523798E-8},{"$f":"I35-I36","v":2.0316520021879114E-8},2.5039298634510487E-8,-1.4392480807146057E-7,-2.4156179279088974E-9,-8.5259216575650498E-8,-2.4117593966366258E-7,-1.6493254406668711E-7,-2.7485475584398955E-7,-2.0737093109346461E-7,{"$f":"R35-R36","v":2.2053586690162774E-7},4.2074157136084978E-7,5.9931221585429739E-7,-1.1288170753687155E-7,{"$f":"V35-V36","v":-9.5256154963863082E-7},-8.8727188085613307E-7,-4.1575344766897615E-7,-3.2003026717575267E-7]
[null,"Brake Pressure",null,5.2,null,null,null,{"$f":"($D38-$D31)+H31","v":3.7011803786639428},3.7093514385585582,3.7219901772167638,3.7530637687379587,3.7857777111148829,3.8332641526823785,3.9033001662480151,4.0099190045544058,4.1814192726405279,4.4857491347923819,4.5405047579863735,4.6008224612458024,4.6675921609718767,4.7419153476654223,4.82517536820228,4.919138840103864,5.026106458887373,5.1491445919169934]
[null,"Rho (brake)",null,{"$f":"[2]!rho_(11,D38,330)","v":0.75697464940773784},null,null,null,{"$f":"[2]!rho_(11,H38,330)","v":0.53911899755141035},{"$f":"[2]!rho_(11,I38,330)","v":0.54030739824463503},{"$f":"[2]!rho_(11,J38,330)","v":0.54214556342679965},{"$f":"[2]!rho_(11,K38,330)","v":0.54666479380443866},{"$f":"[2]!rho_(11,L38,330)","v":0.5514224665906603},{"$f":"[2]!rho_(11,M38,330)","v":0.55832831514530123},{"$f":"[2]!rho_(11,N38,330)","v":0.56851300815502748},{"$f":"[2]!rho_(11,O38,330)","v":0.58401648329463018},{"$f":"[2]!rho_(11,P38,330)","v":0.60895154562504872},{"$f":"[2]!rho_(11,Q38,330)","v":0.65319057732983643},{"$f":"[2]!rho_(11,R38,330)","v":0.6611489801396303},{"$f":"[2]!rho_(11,S38,330)","v":0.6699153850309375},{"$f":"[2]!rho_(11,T38,330)","v":0.6796189999681892},{"$f":"[2]!rho_(11,U38,330)","v":0.69041973633186571},{"$f":"[2]!rho_(11,V38,330)","v":0.70251840370540597},{"$f":"[2]!rho_(11,W38,330)","v":0.71617141868355016},{"$f":"[2]!rho_(11,X38,330)","v":0.73171267461372347},{"$f":"[2]!rho_(11,Y38,330)","v":0.74958712187058896}]
[null,"Wheel","mm",35.799999999999997,null,null,null,{"$f":"$D$40","v":35.799999999999997},{"$f":"$D$40","v":35.799999999999997},35.799999999999997,35.799999999999997,35.799999999999997,35.799999999999997,35.799999999999997,35.799999999999997,35.799999999999997,35.799999999999997,35.799999999999997,35.799999999999997,35.799999999999997,35.799999999999997,35.799999999999997,35.799999999999997,35.799999999999997,35.799999999999997]
[null,"a = mÖT/P",null,{"$f":"D28*D30^0.5/D29","v":82.031580287488268},null,null,null,{"$f":"+$D$41","v":82.031580287488268},{"$f":"+$D$41","v":82.031580287488268},82.031580287488268,82.031580287488268,82.031580287488268,82.031580287488268,82.031580287488268,82.031580287488268,82.031580287488268,82.031580287488268,82.031580287488268,82.031580287488268,82.031580287488268,82.031580287488268,82.031580287488268,82.031580287488268,82.031580287488268,82.031580287488268,null,null,null,null,null,null,null,null,null,null,null,"T1 out",63,31,"x"]
[null,"Rho (in)","kg/m3",{"$f":"[2]!rho_(11,D29,D30)","v":17.087672541642732},null,null,null,{"$f":"[2]!rho_(11,H29,H30)","v":5.7555168615424357},{"$f":"[2]!rho_(11,I29,I30)","v":6.0982917528727665},{"$f":"[2]!rho_(11,J29,J30)","v":6.4904975724958094},{"$f":"[2]!rho_(11,K29,K30)","v":7.19985259599685},{"$f":"[2]!rho_(11,L29,L30)","v":7.7810966770108561},{"$f":"[2]!rho_(11,M29,M30)","v":8.4828229066841523},{"$f":"[2]!rho_(11,N29,N30)","v":9.3519905891128694},{"$f":"[2]!rho_(11,O29,O30)","v":10.467011044747862},{"$f":"[2]!rho_(11,P29,P30)","v":11.973325917509028},{"$f":"[2]!rho_(11,Q29,Q30)","v":14.189691783084196},{"$f":"[2]!rho_(11,R29,R30)","v":14.549095894995501},{"$f":"[2]!rho_(11,S29,S30)","v":14.934571603767919},{"$f":"[2]!rho_(11,T29,T30)","v":15.349753891698512},{"$f":"[2]!rho_(11,U29,U30)","v":15.79908441227159},{"$f":"[2]!rho_(11,V29,V30)","v":16.288068677425454},{"$f":"[2]!rho_(11,W29,W30)","v":16.823644158629577},{"$f":"[2]!rho_(11,X29,X30)","v":17.414722775561259},{"$f":"[2]!rho_(11,Y29,Y30)","v":18.073016374672587},null,null,null,null,null,null,null,null,null,null,null,"T2 in",62,18,"y"]
[null,"Sound Speed @inlet",null,{"$f":"[2]!Sound_speed(11,D29,D30)","v":391.2334216977045},null,null,null,{"$f":"[2]!Sound_speed(11,H29,H30)","v":535.59028692683853},{"$f":"[2]!Sound_speed(11,I29,I30)","v":522.58331366954212},{"$f":"[2]!Sound_speed(11,J29,J30)","v":509.25707950766298},{"$f":"[2]!Sound_speed(11,K29,K30)","v":488.62137721921403},{"$f":"[2]!Sound_speed(11,L29,L30)","v":474.39995156477397},{"$f":"[2]!Sound_speed(11,M29,M30)","v":459.78117196162543},{"$f":"[2]!Sound_speed(11,N29,N30)","v":444.74807915139166},{"$f":"[2]!Sound_speed(11,O29,O30)","v":429.29925981866364},{"$f":"[2]!Sound_speed(11,P29,P30)","v":413.47783122229521},{"$f":"[2]!Sound_speed(11,Q29,Q30)","v":397.46820847483536},{"$f":"[2]!Sound_speed(11,R29,R30)","v":395.47799777005798},{"$f":"[2]!Sound_speed(11,S29,S30)","v":393.49681203060476},{"$f":"[2]!Sound_speed(11,T29,T30)","v":391.52793825998316},{"$f":"[2]!Sound_speed(11,U29,U30)","v":389.57549536417565},{"$f":"[2]!Sound_speed(11,V29,V30)","v":387.64471272983729},{"$f":"[2]!Sound_speed(11,W29,W30)","v":385.74233251170807},{"$f":"[2]!Sound_speed(11,X29,X30)","v":383.8772080268385},{"$f":"[2]!Sound_speed(11,Y29,Y30)","v":382.06122307408418},null,null,null,null,null,null,null,null,null,null,null,"slope",{"$f":"SLOPE(AL42:AM42,AL41:AM41)","v":1.375}]
[null,"S=Q/(rho*V) = cte",null,{"$f":"D28/(D42*D43)","v":2.8645071953707371E-2},null,null,null,{"$f":"H28/(H42*H43)","v":2.8949901667898816E-2},2.8944390867796058E-2,2.8937477260906386E-2,2.8923441617505655E-2,2.891060241753584E-2,2.8893680890140331E-2,2.8870859913145499E-2,2.8839124170815501E-2,2.8793021062825577E-2,2.872121436009982E-2,2.8709337537002274E-2,2.86965656425071E-2,2.8682785299181179E-2,2.866786005997899E-2,2.8651623449606967E-2,2.8633869104180039E-2,2.8614336391318509E-2,2.8592688754042469E-2,null,null,null,null,null,null,null,null,null,null,null,"intercept",{"$f":"INTERCEPT(AL42:AM42,AL41:AM41)","v":-24.625}]
[null,"Hin",null,{"$f":"[2]!H_(11,D29,D30)","v":223.57106614117126},null,null,null,{"$f":"[2]!H_(11,H29,H30)","v":433.14130806490056},{"$f":"[2]!H_(11,I29,I30)","v":412.28780837150464},{"$f":"[2]!H_(11,J29,J30)","v":391.42240219138097},{"$f":"[2]!H_(11,K29,K30)","v":360.09597164241666},{"$f":"[2]!H_(11,L29,L30)","v":339.18727578243715},{"$f":"[2]!H_(11,M29,M30)","v":318.25274418907128},{"$f":"[2]!H_(11,N29,N30)","v":297.28434837717924},{"$f":"[2]!H_(11,O29,O30)","v":276.27001547205668},{"$f":"[2]!H_(11,P29,P30)","v":255.19026741778114},{"$f":"[2]!H_(11,Q29,Q30)","v":234.00999262491322},{"$f":"[2]!H_(11,R29,R30)","v":231.35239894925536},{"$f":"[2]!H_(11,S29,S30)","v":228.69195383292379},{"$f":"[2]!H_(11,T29,T30)","v":226.02840016111742},{"$f":"[2]!H_(11,U29,U30)","v":223.3614407670874},{"$f":"[2]!H_(11,V29,V30)","v":220.69072892714823},{"$f":"[2]!H_(11,W29,W30)","v":218.01585571705743},{"$f":"[2]!H_(11,X29,X30)","v":215.33633290287648},{"$f":"[2]!H_(11,Y29,Y30)","v":212.6515692894715},null,null,null,null,null,null,null,null,null,null,null,"x","y"]
[null,"Hout",null,{"$f":"[2]!H_(11,D31,D32)","v":175.9342848561293},null,null,null,{"$f":"[2]!H_(11,H31,H32)","v":360.38276745781616},{"$f":"[2]!H_(11,I31,I32)","v":341.74095044872223},{"$f":"[2]!H_(11,J31,J32)","v":323.15595006797486},{"$f":"[2]!H_(11,K31,K32)","v":295.38949528785025},{"$f":"[2]!H_(11,L31,L32)","v":276.95432902032246},{"$f":"[2]!H_(11,M31,M32)","v":258.57915824048092},{"$f":"[2]!H_(11,N31,N32)","v":240.25978971970451},{"$f":"[2]!H_(11,O31,O32)","v":221.98517627979581},{"$f":"[2]!H_(11,P31,P32)","v":203.72937752100231},{"$f":"[2]!H_(11,Q31,Q32)","v":185.42919192546449},{"$f":"[2]!H_(11,R31,R32)","v":183.13203603425097},{"$f":"[2]!H_(11,S31,S32)","v":180.83121409276717},{"$f":"[2]!H_(11,T31,T32)","v":178.52603330682868},{"$f":"[2]!H_(11,U31,U32)","v":176.21566198668089},{"$f":"[2]!H_(11,V31,V32)","v":173.89909018112544},{"$f":"[2]!H_(11,W31,W32)","v":171.57507482342035},{"$f":"[2]!H_(11,X31,X32)","v":169.2420613123447},{"$f":"[2]!H_(11,Y31,Y32)","v":166.89806830755006},null,null,null,null,null,null,null,null,null,null,null,277,{"$f":"m*AK46+p","v":356.25}]
[null,"Sin = Sout",null,{"$f":"[2]!S_(11,D29,D30)","v":15.488244062210457},null,null,null,{"$f":"[2]!S_(11,H29,H30)","v":20.01562118310105},{"$f":"[2]!S_(11,I29,I30)","v":19.732505616083731},{"$f":"[2]!S_(11,J29,J30)","v":19.430946493965195},{"$f":"[2]!S_(11,K29,K30)","v":18.937734332412656},{"$f":"[2]!S_(11,L29,L30)","v":18.57613609839909},{"$f":"[2]!S_(11,M29,M30)","v":18.182227457665064},{"$f":"[2]!S_(11,N29,N30)","v":17.748496073484809},{"$f":"[2]!S_(11,O29,O30)","v":17.263769977421802},{"$f":"[2]!S_(11,P29,P30)","v":16.709765263523995},{"$f":"[2]!S_(11,Q29,Q30)","v":16.051486138016557},{"$f":"[2]!S_(11,R29,R30)","v":15.958636607834118},{"$f":"[2]!S_(11,S29,S30)","v":15.86271487892351},{"$f":"[2]!S_(11,T29,T30)","v":15.763396197691039},{"$f":"[2]!S_(11,U29,U30)","v":15.660291125774306},{"$f":"[2]!S_(11,V29,V30)","v":15.552926123564552},{"$f":"[2]!S_(11,W29,W30)","v":15.440716141003705},{"$f":"[2]!S_(11,X29,X30)","v":15.322924765222192},{"$f":"[2]!S_(11,Y29,Y30)","v":15.198604497007498},null,null,null,null,null,null,null,null,null,null,null,31,{"$f":"m*AK47+p","v":18}]
[null,"Tout(iso)",null,{"$f":"[1]!HeCalc(2,0,1,D31*10^5,8,D47*1000,1)","v":28.580768861485691},null,null,null,{"$f":"[1]!HeCalc(2,0,1,H31*10^5,8,H47*1000,1)","v":60.629926357654455},{"$f":"[1]!HeCalc(2,0,1,I31*10^5,8,I47*1000,1)","v":57.466628480689572},{"$f":"[1]!HeCalc(2,0,1,J31*10^5,8,J47*1000,1)","v":54.29818007316576},{"$f":"[1]!HeCalc(2,0,1,K31*10^5,8,K47*1000,1)","v":49.534925244288196},{"$f":"[1]!HeCalc(2,0,1,L31*10^5,8,L47*1000,1)","v":46.351521044004926},{"$f":"[1]!HeCalc(2,0,1,M31*10^5,8,M47*1000,1)","v":43.160811516301905},{"$f":"[1]!HeCalc(2,0,1,N31*10^5,8,N47*1000,1)","v":39.961483812341818},{"$f":"[1]!HeCalc(2,0,1,O31*10^5,8,O47*1000,1)","v":36.751425276763769},{"$f":"[1]!HeCalc(2,0,1,P31*10^5,8,P47*1000,1)","v":33.526903935128971},{"$f":"[1]!HeCalc(2,0,1,Q31*10^5,8,Q47*1000,1)","v":30.280389206499791},{"$f":"[1]!HeCalc(2,0,1,R31*10^5,8,R47*1000,1)","v":29.872327425857858},{"$f":"[1]!HeCalc(2,0,1,S31*10^5,8,S47*1000,1)","v":29.463612136169761},{"$f":"[1]!HeCalc(2,0,1,T31*10^5,8,T47*1000,1)","v":29.05417622202798},{"$f":"[1]!HeCalc(2,0,1,U31*10^5,8,U47*1000,1)","v":28.643940649326506},{"$f":"[1]!HeCalc(2,0,1,V31*10^5,8,V47*1000,1)","v":28.232811421690801},{"$f":"[1]!HeCalc(2,0,1,W31*10^5,8,W47*1000,1)","v":27.820675444335478},{"$f":"[1]!HeCalc(2,0,1,X31*10^5,8,X47*1000,1)","v":27.407394792476449},{"$f":"[1]!HeCalc(2,0,1,Y31*10^5,8,Y47*1000,1)","v":26.992798647056564},null,null,null,null,null,null,null,null,null,null,null,31,{"$f":"m*AK48+p","v":18}]
[null,"Hout(iso)",null,{"$f":"[2]!H_(11,D31,D48)","v":162.49826962188638},null,null,null,{"$f":"[2]!H_(11,H31,H48)","v":331.01589710610523},{"$f":"[2]!H_(11,I31,I48)","v":314.51064959944523},{"$f":"[2]!H_(11,J31,J48)","v":297.96759866251341},{"$f":"[2]!H_(11,K31,K48)","v":273.07181618082257},{"$f":"[2]!H_(11,L31,L48)","v":256.41095647071643},{"$f":"[2]!H_(11,M31,M48)","v":239.68807884040751},{"$f":"[2]!H_(11,N31,N48)","v":222.88854842446693},{"$f":"[2]!H_(11,O31,O48)","v":205.98911538019337},{"$f":"[2]!H_(11,P31,P48)","v":188.9491377157523},{"$f":"[2]!H_(11,Q31,Q48)","v":171.68634855871022},{"$f":"[2]!H_(11,R31,R48)","v":169.50503622458999},{"$f":"[2]!H_(11,S31,S48)","v":167.3167506236891},{"$f":"[2]!H_(11,T31,T48)","v":165.12070515953474},{"$f":"[2]!H_(11,U31,U48)","v":162.91595963649272},{"$f":"[2]!H_(11,V31,V48)","v":160.70137611589689},{"$f":"[2]!H_(11,W31,W48)","v":158.47555711993181},{"$f":"[2]!H_(11,X31,X48)","v":156.23675685152438},{"$f":"[2]!H_(11,Y31,Y48)","v":153.9827501262825}]
[null,"ΔHs",null,{"$f":"D45-D49","v":61.072796519284879},null,null,null,102.12541095879533,{"$f":"I45-I49","v":97.777158772059408},93.454803528867558,87.024155461594091,82.776319311720727,78.564665348663766,74.395799952712309,70.280900091863316,66.241129702028843,62.323644066203002,{"$f":"R45-R49","v":61.847362724665373},61.375203209234684,60.907695001582681,60.445481130594686,{"$f":"V45-V49","v":59.989352811251337},59.540298597125627,59.099576051352102,58.668819163188999]
[null,"u1","m/s",{"$f":"(2*52.7%*D50*1000*D33)^0.5","v":224.07402231056255},null,null,null,{"$f":"PI()*$D$52*H35","v":224.07402231056253},{"$f":"PI()*$D$52*I35","v":224.07402231056253},224.07402231056253,224.07402231056253,224.07402231056253,224.07402231056253,224.07402231056253,224.07402231056253,224.07402231056253,224.07402231056253,{"$f":"PI()*$D$52*R35","v":224.07402231056253},224.07402231056253,224.07402231056253,224.07402231056253,{"$f":"PI()*$D$52*V35","v":224.07402231056253},224.07402231056253,224.07402231056253,224.07402231056253]
[null,"D1",null,{"$f":"D51/PI()/D35","v":3.5751867939057311E-2}]
[null,"Co = (2*ΔHs)^0,5",null,{"$f":"(2000*D50)^0.5","v":349.49333761685608},null,null,null,451.94117085920669,{"$f":"(2000*I50)^0.5","v":442.21523893248957},432.33043734825696,417.1909765601219,406.88160270948777,396.39542214476637,385.7351421706669,374.91572410840098,363.98112506565184,353.05422831684939,{"$f":"(2000*R50)^0.5","v":351.70260938658208},350.35754083288884,349.02061544150274,347.69377656378805,{"$f":"(2000*V50)^0.5","v":346.37942436366319},345.08056623671416,343.80103563355391,342.54581930944363]
[null,"u1/Co",null,{"$f":"D51/D53","v":0.64113961038138956},null,null,null,0.49580351771130926,{"$f":"I51/I53","v":0.50670805205962299},0.51829342316248539,0.53710179486173748,0.55071062642896318,0.56527903651906741,0.58090123977198305,0.59766504283980115,0.61561989586725396,0.63467310214301342,{"$f":"R51/R53","v":0.63711219743685887},0.63955815472925648,0.64200798576644025,0.64445796103990316,{"$f":"V51/V53","v":0.64690338556399807},0.64933828280800654,0.65175493697289377,0.65414321144623888]
[null,"U1/C0 off de / U1/C0 nom",null,{"$f":"D54/$D$54","v":1},null,null,null,{"$f":"H54/$D54","v":0.77331599808093998},{"$f":"I54/$D54","v":0.79032404776582377},0.80839401398733168,0.83772985815403922,0.85895586158117165,0.8816785414066125,0.90604484634232318,0.9321917304162084,0.96019632214120276,0.98991404035303721,{"$f":"R54/$D54","v":0.99371835263440522},0.99753336773063772,1.0013544247945219,1.005175706827004,{"$f":"V54/$D54","v":1.0089898909524244},1.0127876554401933,1.0165569657834579,1.0202820116777904]
[null,"Rdt",null,{"$f":"(0.321*D55^4-1.6098*D55^3+1.316*D55^2+0.9448*D55)*($D33/0.97215493)","v":0.77987569327041328},null,null,null,{"$f":"(0.321*H55^4-1.6098*H55^3+1.316*H55^2+0.9448*H55)*($D33/0.97)","v":0.71402581048241387},0.72310940622786768,0.73209839132558208,0.74519800222004062,0.75349088463687142,0.76123477607009837,0.76820523685442355,0.77411412046082462,0.77859804738565097,0.78122400308831075,0.7813993362133318,0.78153820380092565,0.78164010366640901,0.78170470131874892,0.78173188727270293,0.78172185521121307,0.78167521098154658,0.78159312861654329]
[]
[]
[null,"TURBINE 2"]
[null,null,null,null,null,null,null,5]
[null,null,null,"DESIGN",null,null,null,{"$f":"H26","v":"start-up"},{"$f":"I26","v":"start-up"},"start-up","start-up","start-up","start-up","start-up","start-up","start-up","start-up",{"$f":"R26","v":0},0,0,0,{"$f":"V26","v":0},0,0,0]
[null,"Delta Debit",null,null,null,null,null,{"$f":"H63-H28","v":-12.115294719387791},-11.960840980623402,-11.7512042031519,-11.282482297350541,-10.812275887263567,-10.141660781147493,-9.1571729993420377,-7.6533618867704405,-5.2227292045968738,-0.93837038124681271,-0.17844016627137194,0.65335373126669083,1.5670103078157354,2.5745351242336767,3.6905071610476341,4.9328653360027488,6.3240291490754146,7.8925469638173524]
[null,"m","g/s",191.20000000000002,null,null,null,{"$f":"H76*H64/H65^0.5","v":77.125641107105636},{"$f":"I76*I64/I65^0.5","v":80.281040040063786},83.896760708005928,90.470240013952861,95.906930892189848,102.55069440355642,110.92481291122532,121.93466850387638,137.323019324618,161.04788194969541,{"$f":"R76*R64/R65^0.5","v":165.01070450535687},{"$f":"S76*S64/S65^0.5","v":169.29464226500082},{"$f":"T76*T64/T65^0.5","v":173.94646248731931},{"$f":"U76*U64/U65^0.5","v":179.02338295524214},{"$f":"V76*V64/V65^0.5","v":184.59639069737381},{"$f":"W76*W64/W65^0.5","v":190.75498573286706},{"$f":"X76*X64/X65^0.5","v":197.61416308459886},{"$f":"Y76*Y64/Y65^0.5","v":205.3250268050046}]
[null,"Pin","Bara",6.3070000000000004,null,null,null,4.8611803786639429,4.8693514385585583,4.881990177216764,4.9130637687379588,4.9457777111148831,4.9932641526823787,5.0633001662480153,5.1699190045544059,5.3414192726405281,5.6457491347923821,5.7005047579863737,5.7608224612458026,5.8275921609718768,5.9019153476654225,5.9851753682022801,6.0791388401038642,6.1861064588873731,6.3091445919169935]
[null,"Tin","K",18.21,null,null,null,{"$f":"m*H32+p","v":66.48534978905937},{"$f":"m*I32+p","v":61.568180600625965},56.668729572339387,49.355252359072978,44.505046478483891,39.676370037913102,34.869843524408743,30.085216023312014,25.320175435974882,{"$f":"m*Q32+p","v":20.567105603782217},19.972960710362344,19.378609622399715,18.783960163283773,18.188902398420922,17.593304079534391,16.997004463947363,16.399805755597932,15.801461033417347]
[null,"Pout","Bara",1.35,null,null,null,1.1499999999999999,1.1499999999999999,1.1499999999999999,1.1499999999999999,1.1499999999999999,1.1499999999999999,1.1499999999999999,1.1499999999999999,1.1499999999999999,1.1499999999999999,1.1499999999999999,1.1499999999999999,1.1499999999999999,1.1499999999999999,1.1499999999999999,1.1499999999999999,1.1499999999999999,1.1499999999999999]
[null,"Tout","K",{"$f":"[2]!T2_turb(11,D64,D65,D66,D68)","v":11.618357475588732},null,null,null,{"$f":"[2]!T2_turb(11,H64,H65,H66,H68)","v":51.693240397603432},{"$f":"[2]!T2_turb(11,I64,I65,I66,I68)","v":47.352444352911981},{"$f":"[2]!T2_turb(11,J64,J65,J66,J68)","v":43.058400969883103},{"$f":"[2]!T2_turb(11,K64,K65,K66,K68)","v":36.717056599420516},{"$f":"[2]!T2_turb(11,L64,L65,L66,L68)","v":32.565860813113616},{"$f":"[2]!T2_turb(11,M64,M65,M66,M68)","v":28.485618276037787},{"$f":"[2]!T2_turb(11,N64,N65,N66,N68)","v":24.486994466221351},{"$f":"[2]!T2_turb(11,O64,O65,O66,O68)","v":20.5832029382698},{"$f":"[2]!T2_turb(11,P64,P65,P66,P68)","v":16.790318034891868},{"$f":"[2]!T2_turb(11,Q64,Q65,Q66,Q68)","v":13.125572102451054},{"$f":"[2]!T2_turb(11,R64,R65,R66,R68)","v":12.677086928580154},{"$f":"[2]!T2_turb(11,S64,S65,S66,S68)","v":12.230711821463579},{"$f":"[2]!T2_turb(11,T64,T65,T66,T68)","v":11.786390759819342},{"$f":"[2]!T2_turb(11,U64,U65,U66,U68)","v":11.344034200589419},{"$f":"[2]!T2_turb(11,V64,V65,V66,V68)","v":10.903506472478442},{"$f":"[2]!T2_turb(11,W64,W65,W66,W68)","v":10.464607593488596},{"$f":"[2]!T2_turb(11,X64,X65,X66,X68)","v":10.027046326412488},{"$f":"[2]!T2_turb(11,Y64,Y65,Y66,Y68)","v":9.5903993039665707}]
[null,"Efficacity","%",0.76,null,null,null,{"$f":"(0.321*H90^4-1.6098*H90^3+1.316*H90^2+0.9448*H90)*($D$68/0.97215493)","v":0.51009692899935322},{"$f":"(0.321*I90^4-1.6098*I90^3+1.316*I90^2+0.9448*I90)*($D$68/0.97215493)","v":0.52860604588210169},0.54871853876323895,0.58227698186897314,0.60715163225203528,0.63415601410632827,0.66322653737460568,0.69388656592558695,0.72461052751481636,0.75094647665398517,{"$f":"(0.321*R90^4-1.6098*R90^3+1.316*R90^2+0.9448*R90)*($D$68/0.97215493)","v":0.75343044192121955},0.75561275023008778,0.75743684704083103,0.7588344063745277,{"$f":"(0.321*V90^4-1.6098*V90^3+1.316*V90^2+0.9448*V90)*($D$68/0.97215493)","v":0.75972199554180075},0.7599964341290173,0.75952815675156971,0.75815141173528433]
[null,"Power","W",{"$f":"+D63*(D80-D81)","v":6144.650345780522},null,null,null,5991.0340876816708,{"$f":"+I63*(I80-I81)","v":5991.0340876527944},5991.0340877352901,5991.0340815718973,5991.0340870474874,5991.0340871210819,5991.0340870803875,5991.0340870872615,5991.0340870257332,5991.0340870384134,{"$f":"+R63*(R80-R81)","v":5991.034090852113},5991.0340942792427,5991.0340973679304,5991.0340870880063,{"$f":"+V63*(V80-V81)","v":5991.0340867665282},5991.0340868390585,5991.0340870248547,5991.0340870881473]
[null,"Speed","Hz",1496,null,null,null,1496,1496,1496,1496,1496,1496,1496,1496,1496,1496,1496,1496,1496,1496,1496,1496,1496,1496]
[null,null,null,null,null,null,null,{"$f":"(H69/$D69*$D73/H73)^(1/3)*$D70","v":1496.0000000454186},{"$f":"(I69/$D69*$D73/I73)^(1/3)*$D70","v":1496.0000000430148},1496.0000000498812,1495.9999995368685,1495.9999999926317,1495.9999999987574,1495.9999999953702,1495.9999999959425,1495.9999999908212,1495.9999999918766,{"$f":"(R69/$D69*$D73/R73)^(1/3)*$D70","v":1496.0000003093119},1496.0000005945703,1496.000000851659,1495.9999999960044,{"$f":"(V69/$D69*$D73/V73)^(1/3)*$D70","v":1495.9999999692461},1495.9999999752831,1495.9999999907479,1495.9999999960162]
[null,"Delta Speed Frein & Turbine",null,null,null,null,null,{"$f":"H70-H71","v":-4.5418573790811934E-8},{"$f":"I70-I71","v":-4.3014779294026084E-8},-4.9881236918736249E-8,4.6313152779475786E-7,7.3682713264133781E-9,1.2425971362972632E-9,4.6297827793750912E-9,4.0574832382844761E-9,9.178847903967835E-9,{"$f":"Q70-Q71","v":8.1233793025603518E-9},{"$f":"R70-R71","v":-3.0931187211535871E-7},-5.9457033785292879E-7,-8.5165902419248596E-7,3.995637598563917E-9,{"$f":"V70-V71","v":3.0753881219425239E-8},{"$f":"W70-W71","v":2.4716882762731984E-8},{"$f":"X70-X71","v":9.2520622274605557E-9},{"$f":"Y70-Y71","v":3.9838141674408689E-9}]
[null,"Brake Pressure",null,8,null,null,null,{"$f":"($D73-$D66)+H66","v":7.8000000000000007},{"$f":"($D73-$D66)+I66","v":7.8000000000000007},7.8000000000000007,7.8000000000000007,7.8000000000000007,7.8000000000000007,7.8000000000000007,7.8000000000000007,7.8000000000000007,7.8000000000000007,{"$f":"($D73-$D66)+R66","v":7.8000000000000007},7.8000000000000007,7.8000000000000007,7.8000000000000007,{"$f":"($D73-$D66)+V66","v":7.8000000000000007},7.8000000000000007,7.8000000000000007,7.8000000000000007]
[null,"Rho (brake)",null,{"$f":"[2]!rho_(11,D73,330)","v":1.1632432504804469},null,null,null,{"$f":"[2]!rho_(11,H73,330)","v":1.1342549379241607},{"$f":"[2]!rho_(11,I73,330)","v":1.1342549379241607},{"$f":"[2]!rho_(11,J73,330)","v":1.1342549379241607},{"$f":"[2]!rho_(11,K73,330)","v":1.1342549379241607},{"$f":"[2]!rho_(11,L73,330)","v":1.1342549379241607},{"$f":"[2]!rho_(11,M73,330)","v":1.1342549379241607},{"$f":"[2]!rho_(11,N73,330)","v":1.1342549379241607},{"$f":"[2]!rho_(11,O73,330)","v":1.1342549379241607},{"$f":"[2]!rho_(11,P73,330)","v":1.1342549379241607},{"$f":"[2]!rho_(11,Q73,330)","v":1.1342549379241607},{"$f":"[2]!rho_(11,R73,330)","v":1.1342549379241607},{"$f":"[2]!rho_(11,S73,330)","v":1.1342549379241607},{"$f":"[2]!rho_(11,T73,330)","v":1.1342549379241607},{"$f":"[2]!rho_(11,U73,330)","v":1.1342549379241607},{"$f":"[2]!rho_(11,V73,330)","v":1.1342549379241607},{"$f":"[2]!rho_(11,W73,330)","v":1.1342549379241607},{"$f":"[2]!rho_(11,X73,330)","v":1.1342549379241607},{"$f":"[2]!rho_(11,Y73,330)","v":1.1342549379241607}]
[null,"Wheel","mm",39.5,null,null,null,{"$f":"$D$40","v":35.799999999999997},{"$f":"$D$40","v":35.799999999999997},35.799999999999997,35.799999999999997,35.799999999999997,35.799999999999997,35.799999999999997,35.799999999999997,35.799999999999997,35.799999999999997,35.799999999999997,35.799999999999997,35.799999999999997,35.799999999999997,35.799999999999997,35.799999999999997,35.799999999999997,35.799999999999997]
[null,"a = mÖT/P",null,{"$f":"D63*D65^0.5/D64","v":129.36596422035444},null,null,null,{"$f":"$D$76","v":129.36596422035444},129.36596422035444,129.36596422035444,129.36596422035444,129.36596422035444,129.36596422035444,129.36596422035444,129.36596422035444,129.36596422035444,129.36596422035444,129.36596422035444,129.36596422035444,129.36596422035444,129.36596422035444,129.36596422035444,129.36596422035444,129.36596422035444,129.36596422035444]
[null,"Rho (in)","kg/m3",{"$f":"[2]!rho_(11,D64,D65)","v":16.817250243896773},null,null,null,{"$f":"[2]!rho_(11,H64,H65)","v":3.4849388683231344},{"$f":"[2]!rho_(11,I64,I65)","v":3.7674473693343984},{"$f":"[2]!rho_(11,J64,J65)","v":4.1013358792179879},{"$f":"[2]!rho_(11,K64,K65)","v":4.7346866662819451},{"$f":"[2]!rho_(11,L64,L65)","v":5.2826426838271034},{"$f":"[2]!rho_(11,M64,M65)","v":5.9799300321293254},{"$f":"[2]!rho_(11,N64,N65)","v":6.8992687181104078},{"$f":"[2]!rho_(11,O64,O65)","v":8.1714182146186687},{"$f":"[2]!rho_(11,P64,P65)","v":10.060116857250442},{"$f":"[2]!rho_(11,Q64,Q65)","v":13.201419469649757},{"$f":"[2]!rho_(11,R64,R65)","v":13.75153503586453},{"$f":"[2]!rho_(11,S64,S65)","v":14.354094906567873},{"$f":"[2]!rho_(11,T64,T65)","v":15.017528527363433},{"$f":"[2]!rho_(11,U64,U65)","v":15.752281190518724},{"$f":"[2]!rho_(11,V64,V65)","v":16.571484198733668},{"$f":"[2]!rho_(11,W64,W65)","v":17.491921762209021},{"$f":"[2]!rho_(11,X64,X65)","v":18.535465975154494},{"$f":"[2]!rho_(11,Y64,Y65)","v":19.731275923202748}]
[null,"Sound Speed",null,{"$f":"[2]!Sound_speed(11,D64,D65)","v":258.39146376447951},null,null,null,{"$f":"[2]!Sound_speed(11,H64,H65)","v":484.87024700921472},{"$f":"[2]!Sound_speed(11,I64,I65)","v":466.97958776956682},{"$f":"[2]!Sound_speed(11,J64,J65)","v":448.43617740835174},{"$f":"[2]!Sound_speed(11,K64,K65)","v":419.20956711507318},{"$f":"[2]!Sound_speed(11,L64,L65)","v":398.62206349434712},{"$f":"[2]!Sound_speed(11,M64,M65)","v":376.97829777008803},{"$f":"[2]!Sound_speed(11,N64,N65)","v":354.06984864688832},{"$f":"[2]!Sound_speed(11,O64,O65)","v":329.59892654129015},{"$f":"[2]!Sound_speed(11,P64,P65)","v":303.10821756465009},{"$f":"[2]!Sound_speed(11,Q64,Q65)","v":273.81740970507252},{"$f":"[2]!Sound_speed(11,R64,R65)","v":269.89618752802619},{"$f":"[2]!Sound_speed(11,S64,S65)","v":265.9049938351539},{"$f":"[2]!Sound_speed(11,T64,T65)","v":261.83903218399689},{"$f":"[2]!Sound_speed(11,U64,U65)","v":257.69296887659203},{"$f":"[2]!Sound_speed(11,V64,V65)","v":253.46088283408116},{"$f":"[2]!Sound_speed(11,W64,W65)","v":249.13623755760167},{"$f":"[2]!Sound_speed(11,X64,X65)","v":244.71191058016592},{"$f":"[2]!Sound_speed(11,Y64,Y65)","v":240.18035703209551}]
[null,"S=Q/(rho*V) = cte",null,{"$f":"D63/(D77*D78)","v":4.4000208975996838E-2},null,null,null,4.5643410478681992E-2,{"$f":"I63/(I77*I78)","v":4.5631831343665788E-2},4.5616211507543525E-2,4.5580943817437498E-2,4.5544655800325726E-2,4.5491070186932415E-2,4.5408452234503467E-2,4.5273490075895338E-2,4.5034216107141957E-2,4.4552628239857686E-2,{"$f":"R63/(R77*R78)","v":4.4459460559112235E-2},4.4354828766097698E-2,4.4236702714821143E-2,4.4102553439774692E-2,{"$f":"V63/(V77*V78)","v":4.3949187946287445E-2},4.3772511977128635E-2,4.3567180113592251E-2,4.3326063540759817E-2]
[null,"Hin",null,{"$f":"[2]!H_(11,D64,D65)","v":105.90220745591094},null,null,null,{"$f":"[2]!H_(11,H64,H65)","v":361.5464578882453},{"$f":"[2]!H_(11,I64,I65)","v":335.91149993347784},{"$f":"[2]!H_(11,J64,J65)","v":310.34740218217763},{"$f":"[2]!H_(11,K64,K65)","v":272.13182647531204},{"$f":"[2]!H_(11,L64,L65)","v":246.7348487730531},{"$f":"[2]!H_(11,M64,M65)","v":221.38804751721855},{"$f":"[2]!H_(11,N64,N65)","v":196.06544025627954},{"$f":"[2]!H_(11,O64,O65)","v":170.71458412439625},{"$f":"[2]!H_(11,P64,P65)","v":145.22413607516057},{"$f":"[2]!H_(11,Q64,Q65)","v":119.32768195638531},{"$f":"[2]!H_(11,R64,R65)","v":116.03405168051044},{"$f":"[2]!H_(11,S64,S65)","v":112.72108140707688},{"$f":"[2]!H_(11,T64,T65)","v":109.38561261689215},{"$f":"[2]!H_(11,U64,U65)","v":106.02379965627202},{"$f":"[2]!H_(11,V64,V65)","v":102.63089980121451},{"$f":"[2]!H_(11,W64,W65)","v":99.200976578468925},{"$f":"[2]!H_(11,X64,X65)","v":95.726469441564078},{"$f":"[2]!H_(11,Y64,Y65)","v":92.197551193630147}]
[null,"Hout",null,{"$f":"[2]!H_(11,D66,D67)","v":73.764914852456329},null,null,null,{"$f":"[2]!H_(11,H66,H67)","v":283.86756923742911},{"$f":"[2]!H_(11,I66,I67)","v":261.28573419024627},{"$f":"[2]!H_(11,J66,J67)","v":238.93780260792863},{"$f":"[2]!H_(11,K66,K67)","v":205.91077875124361},{"$f":"[2]!H_(11,L66,L67)","v":184.26768366501642},{"$f":"[2]!H_(11,M66,M67)","v":162.96782791787359},{"$f":"[2]!H_(11,N66,N67)","v":142.05557600818659},{"$f":"[2]!H_(11,O66,O67)","v":121.58143634455215},{"$f":"[2]!H_(11,P66,P67)","v":101.59682496234909},{"$f":"[2]!H_(11,Q66,Q67)","v":82.127353616086111},{"$f":"[2]!H_(11,R66,R67)","v":79.727109601745966},{"$f":"[2]!H_(11,S66,S67)","v":77.332872931457558},{"$f":"[2]!H_(11,T66,T67)","v":74.94378487460807},{"$f":"[2]!H_(11,U66,U67)","v":72.558707062273655},{"$f":"[2]!H_(11,V66,V67)","v":70.176126096628963},{"$f":"[2]!H_(11,W66,W67)","v":67.794017206885883},{"$f":"[2]!H_(11,X66,X67)","v":65.409643999958021},{"$f":"[2]!H_(11,Y66,Y67)","v":63.019256758155507}]
[null,"Sin = Sout",null,{"$f":"[2]!S_(11,D64,D65)","v":13.041567593259808},null,null,null,{"$f":"[2]!S_(11,H64,H65)","v":20.496324982048964},{"$f":"[2]!S_(11,I64,I65)","v":20.092222635192414},{"$f":"[2]!S_(11,J64,J65)","v":19.65410693896504},{"$f":"[2]!S_(11,K64,K65)","v":18.918723531130624},{"$f":"[2]!S_(11,L64,L65)","v":18.363108733209259},{"$f":"[2]!S_(11,M64,M65)","v":17.740128701525808},{"$f":"[2]!S_(11,N64,N65)","v":17.030456663077725},{"$f":"[2]!S_(11,O64,O65)","v":16.204561658933915},{"$f":"[2]!S_(11,P64,P65)","v":15.213431422388446},{"$f":"[2]!S_(11,Q64,Q65)","v":13.964417156292173},{"$f":"[2]!S_(11,R64,R65)","v":13.781864750123916},{"$f":"[2]!S_(11,S64,S65)","v":13.591649072941776},{"$f":"[2]!S_(11,T64,T65)","v":13.392992352625573},{"$f":"[2]!S_(11,U64,U65)","v":13.184976632879993},{"$f":"[2]!S_(11,V64,V65)","v":12.966504836569881},{"$f":"[2]!S_(11,W64,W65)","v":12.736246559020126},{"$f":"[2]!S_(11,X64,X65)","v":12.492560446961006},{"$f":"[2]!S_(11,Y64,Y65)","v":12.233379615955437}]
[null,"Tout(iso)",null,{"$f":"[1]!HeCalc(2,0,1,D66*10^5,8,D82*1000,1)","v":9.7639107105745424},null,null,null,{"$f":"[1]!HeCalc(2,0,1,H66*10^5,8,H82*1000,1)","v":37.360542110758679},{"$f":"[1]!HeCalc(2,0,1,I66*10^5,8,I82*1000,1)","v":34.573334060568634},{"$f":"[1]!HeCalc(2,0,1,J66*10^5,8,J82*1000,1)","v":31.787833625381506},{"$f":"[1]!HeCalc(2,0,1,K66*10^5,8,K82*1000,1)","v":27.61225393938977},{"$f":"[1]!HeCalc(2,0,1,L66*10^5,8,L82*1000,1)","v":24.829587074322529},{"$f":"[1]!HeCalc(2,0,1,M66*10^5,8,M82*1000,1)","v":22.04662866233258},{"$f":"[1]!HeCalc(2,0,1,N66*10^5,8,N82*1000,1)","v":19.261489115684469},{"$f":"[1]!HeCalc(2,0,1,O66*10^5,8,O82*1000,1)","v":16.470574844455228},{"$f":"[1]!HeCalc(2,0,1,P66*10^5,8,P82*1000,1)","v":13.666529061152191},{"$f":"[1]!HeCalc(2,0,1,Q66*10^5,8,Q82*1000,1)","v":10.832209356395143},{"$f":"[1]!HeCalc(2,0,1,R66*10^5,8,R82*1000,1)","v":10.47402172646958},{"$f":"[1]!HeCalc(2,0,1,S66*10^5,8,S82*1000,1)","v":10.114548351528178},{"$f":"[1]!HeCalc(2,0,1,T66*10^5,8,T82*1000,1)","v":9.753596549200104},{"$f":"[1]!HeCalc(2,0,1,U66*10^5,8,U82*1000,1)","v":9.3909338664159545},{"$f":"[1]!HeCalc(2,0,1,V66*10^5,8,V82*1000,1)","v":9.0262766526737881},{"$f":"[1]!HeCalc(2,0,1,W66*10^5,8,W82*1000,1)","v":8.659274299023263},{"$f":"[1]!HeCalc(2,0,1,X66*10^5,8,X82*1000,1)","v":8.2894868317624244},{"$f":"[1]!HeCalc(2,0,1,Y66*10^5,8,Y82*1000,1)","v":7.9163523955364932}]
[null,"Hout(iso)",null,{"$f":"[2]!H_(11,D66,D83)","v":63.616296135548602},null,null,null,{"$f":"[2]!H_(11,H66,H83)","v":209.26385386787368},{"$f":"[2]!H_(11,I66,I83)","v":194.73686463640868},{"$f":"[2]!H_(11,J66,J83)","v":180.2085522442847},{"$f":"[2]!H_(11,K66,K83)","v":158.40408214388688},{"$f":"[2]!H_(11,L66,L83)","v":143.84924031914085},{"$f":"[2]!H_(11,M66,M83)","v":129.26526022224593},{"$f":"[2]!H_(11,N66,N83)","v":114.63042340382971},{"$f":"[2]!H_(11,O66,O83)","v":99.905967562452304},{"$f":"[2]!H_(11,P66,P83)","v":85.016190625569564},{"$f":"[2]!H_(11,Q66,Q83)","v":69.78975948546254},{"$f":"[2]!H_(11,R66,R83)","v":67.845207616575635},{"$f":"[2]!H_(11,S66,S83)","v":65.887291923186197},{"$f":"[2]!H_(11,T66,T83)","v":63.914062246920132},{"$f":"[2]!H_(11,U66,U83)","v":61.923146980406365},{"$f":"[2]!H_(11,V66,V83)","v":59.911623669216524},{"$f":"[2]!H_(11,W66,W83)","v":57.875836119857652},{"$f":"[2]!H_(11,X66,X83)","v":55.811128354976489},{"$f":"[2]!H_(11,Y66,Y83)","v":53.711446724484205}]
[null,"ΔHs",null,{"$f":"D80-D84","v":42.285911320362338},null,null,null,152.28260402037162,{"$f":"I80-I84","v":141.17463529706916},130.13884993789293,113.72774433142516,102.88560845391225,92.122787294972625,81.435016852449834,70.80861656194395,60.207945449591008,49.537922470922766,{"$f":"R80-R84","v":48.188844063934809},46.833789483890683,45.471550369972014,44.100652675865653,{"$f":"V80-V84","v":42.719276131997987},41.325140458611273,39.915341086587588,38.486104469145943]
[null,"u1","m/s",{"$f":"(2*52.7%*D85*1000*D68)^0.5","v":184.04539223806461},null,null,null,{"$f":"PI()*$D$87*H70","v":184.04539223806461},{"$f":"PI()*$D$87*I70","v":184.04539223806461},184.04539223806461,184.04539223806461,184.04539223806461,184.04539223806461,184.04539223806461,184.04539223806461,184.04539223806461,{"$f":"PI()*$D$87*Q70","v":184.04539223806461},{"$f":"PI()*$D$87*R70","v":184.04539223806461},184.04539223806461,184.04539223806461,184.04539223806461,{"$f":"PI()*$D$87*V70","v":184.04539223806461},184.04539223806461,184.04539223806461,184.04539223806461]
[null,"D1",null,{"$f":"D86/PI()/D70","v":3.9160072096222902E-2}]
[null,"Co = (2*ΔHs)^0,5",null,{"$f":"(2000*D85)^0.5","v":290.81234953269205},null,null,null,551.87426832634912,{"$f":"(2000*I85)^0.5","v":531.36547742033292},510.17418581871215,476.9229378661193,453.6201240110766,429.23836570132596,403.57159675192662,376.3206520029002,347.00992910748539,314.76315690030424,{"$f":"(2000*R85)^0.5","v":310.44756099520191},306.051595270767,301.56773822798755,296.98704576417356,{"$f":"(2000*V85)^0.5","v":292.29873804721768},287.48961879904903,282.54323947526183,277.43865797377964]
[null,"u1/Co",null,{"$f":"D86/D88","v":0.6328664946100403},null,null,null,0.33349152660480619,{"$f":"I86/I88","v":0.34636309669865284},0.36075010722605283,0.38590174140403666,0.40572580998097552,0.42877199930009907,0.45604148983556037,0.48906535226944231,0.53037500313444075,0.58471072043656558,{"$f":"R86/R88","v":0.59283890537928596},0.60135413466882193,0.61029536289098962,0.61970848514452803,{"$f":"V86/V88","v":0.62964826145891217},0.64018100203718875,0.65138841254836954,0.66337327891579734]
[null,"U1/C0 off de / U1/C0 nom",null,{"$f":"D89/$D$54","v":0.98709623358564935},null,null,null,{"$f":"H89/$D89","v":0.52695399336995552},{"$f":"I89/$D89","v":0.54729251690291314},0.57002560618782616,0.60976800745601423,0.6410922579034235,0.67750782029359891,0.72059667199882971,0.77277807631575535,0.83805195511455732,0.92390847898631867,{"$f":"R89/$D89","v":0.93675192229062698},0.95020693904701703,0.96433508186752948,0.97920887015259039,{"$f":"V89/$D89","v":0.99491483088686639},1.0115577416239352,1.02926670647929,1.0482041387331695]
[null,"Rdt",null,{"$f":"(0.321*D90^4-1.6098*D90^3+1.316*D90^2+0.9448*D90)*($D68/0.97215493)","v":0.75935604730996153},null,null,null,{"$f":"(0.321*H90^4-1.6098*H90^3+1.316*H90^2+0.9448*H90)*($D68/0.97215493)","v":0.51009692899935322},{"$f":"(0.321*I90^4-1.6098*I90^3+1.316*I90^2+0.9448*I90)*($D68/0.97215493)","v":0.52860604588210169},0.54871853876323895,0.58227698186897314,0.60715163225203528,0.63415601410632827,0.66322653737460568,0.69388656592558695,0.72461052751481636,0.75094647665398517,{"$f":"(0.321*R90^4-1.6098*R90^3+1.316*R90^2+0.9448*R90)*($D68/0.97215493)","v":0.75343044192121955},0.75561275023008778,0.75743684704083103,0.7588344063745277,{"$f":"(0.321*V90^4-1.6098*V90^3+1.316*V90^2+0.9448*V90)*($D68/0.97215493)","v":0.75972199554180075},0.7599964341290173,0.75952815675156971,0.75815141173528433]
[]
[null,"TURBINE 3"]
[]
[null,null,null,"DESIGN",null,{"$f":"F61","v":0},{"$f":"G61","v":0},{"$f":"H61","v":"start-up"},{"$f":"I61","v":"start-up"}]
[]
[null,"m","g/s",399.8,null,{"$f":"F110/(F100*F99)^0.5*F98","v":161.47618188513178},{"$f":"G110/(G100*G99)^0.5*G98","v":95.080415199611181},{"$error":"#DIV/0!"},117.10102732642108]
[null,"Pin","Bara",13.07,null,13.07,7.3689999999999998,null,10.48]
[null,"Tin","K",7.2919999999999998,null,9.16,7.9119999999999999,null,10.55]
[null,"Pout","Bara",4.88,null,4.88,5.18,null,5.18]
[null,"Tout","K",{"$f":"[2]!T2_turb(11,D98,D99,D100,D102)","v":6.1198408797506243},null,{"$f":"[2]!T2_turb(11,F98,F99,F100,F102)","v":7.0494463059442776},{"$f":"[2]!T2_turb(11,G98,G99,G100,G102)","v":7.1447253899950391},{"$f":"[2]!T2_turb(11,H98,H99,H100,H102)","v":{"$error":"#VALUE!"}},{"$f":"[2]!T2_turb(11,I98,I99,I100,I102)","v":8.6903815136344829}]
[null,"Efficacity","%",0.72,null,{"$f":"(0.321*F124^4-1.6098*F124^3+1.316*F124^2+0.9448*F124)*($D$102/0.97215493)","v":0.58179731360313081},{"$f":"(0.321*G124^4-1.6098*G124^3+1.316*G124^2+0.9448*G124)*($D$102/0.97215493)","v":0.582724483494652},{"$f":"(0.321*H124^4-1.6098*H124^3+1.316*H124^2+0.9448*H124)*($D$102/0.97215493)","v":{"$error":"#VALUE!"}},{"$f":"(0.321*I124^4-1.6098*I124^3+1.316*I124^2+0.9448*I124)*($D$102/0.97215493)","v":0.50201641458397539}]
[null,"Power","W",{"$f":"+D97*(D114-D115)","v":2075.5404202052005},null,954.74184184263254,182.5140950412455,{"$error":"#DIV/0!"},610.67834348723773]
[null,"Speed","Hz",2076,null,1602.552519659416,914.20818650847264,862.66257848011605,1367.3629344539765]
[null,null,null,null,null,{"$f":"(F103/$D103*$D107/F107)^(1/3)*$D104","v":1602.5525123839127},{"$f":"(G103/$D103*$D107/G107)^(1/3)*$D104","v":914.20817108894096},{"$f":"(H103/$D103*$D107/H107)^(1/3)*$D104","v":{"$error":"#DIV/0!"}},{"$f":"(I103/$D103*$D107/I107)^(1/3)*$D104","v":1367.3629301538849}]
[null,null,null,null,null,{"$f":"F104-F105","v":7.2755033215798903E-6},{"$f":"G104-G105","v":1.5419531678162457E-5},{"$f":"H104-H105","v":{"$error":"#DIV/0!"}},{"$f":"I104-I105","v":4.300091632103431E-6}]
[null,"Brake Pressure",null,10.1,null,{"$f":"($D107-$D100)+F100","v":10.1},{"$f":"($D107-$D100)+G100","v":10.399999999999999},{"$f":"($D107-$D100)+H100","v":5.22},{"$f":"($D107-$D100)+I100","v":10.399999999999999}]
[null,"Rho (brake)",null,{"$f":"[2]!rho_(11,D107,330)","v":1.4673342046153373},null,{"$f":"[2]!rho_(11,F107,330)","v":1.4673342046153373},{"$f":"[2]!rho_(11,G107,330)","v":1.5107331217743123},{"$f":"[2]!rho_(11,H107,330)","v":0.75987987169063398},{"$f":"[2]!rho_(11,I107,330)","v":1.5107331217743123}]
[null,"Wheel","mm",29.5,null,{"$f":"$D$109","v":29.5},{"$f":"$D$109","v":29.5},{"$f":"$D$109","v":29.5},{"$f":"$D$109","v":29.5}]
[null,"a = mÖT/P",null,{"$f":"D97*D99^0.5/D98","v":82.601994178997316},null,{"$f":"$D$110","v":82.601994178997316},{"$f":"$D$110","v":82.601994178997316},82.601994178997316,82.601994178997316]
[null,"Rho (in)","kg/m3",{"$f":"[2]!rho_(11,D98,D99)","v":122.0413850208848},null,{"$f":"[2]!rho_(11,F98,F99)","v":92.042022544510019},{"$f":"[2]!rho_(11,G98,G99)","v":70.649649504414128},{"$f":"[2]!rho_(11,H98,H99)","v":"NUM"},{"$f":"[2]!rho_(11,I98,I99)","v":58.789985568547117}]
[null,"Sound Speed",null,{"$f":"[2]!Sound_speed(11,D98,D99)","v":249.05671288435045},null,{"$f":"[2]!Sound_speed(11,F98,F99)","v":219.03534618547846},{"$f":"[2]!Sound_speed(11,G98,G99)","v":170.78644408370695},{"$f":"[2]!Sound_speed(11,H98,H99)","v":"NUM"},{"$f":"[2]!Sound_speed(11,I98,I99)","v":204.26692373410398}]
[null,"S=Q/(rho*V) = cte",null,{"$f":"D97/(D111*D112)","v":1.3153381307708404E-2},null,8.0095499679843866E-3,7.8800262035761022E-3,{"$error":"#DIV/0!"},9.7512278209034905E-3]
[null,"Hin",null,{"$f":"[2]!H_(11,D98,D99)","v":28.150884578454882},null,{"$f":"[2]!H_(11,F98,F99)","v":40.890140453818937},{"$f":"[2]!H_(11,G98,G99)","v":36.811643961665368},{"$f":"[2]!H_(11,H98,H99)","v":{"$error":"#VALUE!"}},{"$f":"[2]!H_(11,I98,I99)","v":54.059832308617963}]
[null,"Hout",null,{"$f":"[2]!H_(11,D100,D101)","v":22.959437804554931},null,{"$f":"[2]!H_(11,F100,F101)","v":34.977554271159498},{"$f":"[2]!H_(11,G100,G101)","v":34.892067835939827},{"$f":"[2]!H_(11,H100,H101)","v":{"$error":"#VALUE!"}},{"$f":"[2]!H_(11,I100,I101)","v":48.844862317065612}]
[null,"Sin = Sout",null,{"$f":"[2]!S_(11,D98,D99)","v":5.0600046690749361},null,{"$f":"[2]!S_(11,F98,F99)","v":6.606972813997622},{"$f":"[2]!S_(11,G98,G99)","v":6.9458302073485418},{"$f":"[2]!S_(11,H98,H99)","v":{"$error":"#VALUE!"}},{"$f":"[2]!S_(11,I98,I99)","v":8.3000204511344844}]
[null,"Tout(iso)",null,{"$f":"[1]!HeCalc(2,0,1,D100*10^5,8,D116*1000,1)","v":5.9351387842537191},null,{"$f":"[1]!HeCalc(2,0,1,F100*10^5,8,F116*1000,1)","v":6.6999950291002683},{"$f":"[1]!HeCalc(2,0,1,G100*10^5,8,G116*1000,1)","v":7.0241819850115181},{"$f":"[1]!HeCalc(2,0,1,H100*10^5,8,H116*1000,1)","v":{"$error":"#VALUE!"}},{"$f":"[1]!HeCalc(2,0,1,I100*10^5,8,I116*1000,1)","v":8.0488946725573083}]
[null,"Hout(iso)",null,{"$f":"[2]!H_(11,D100,D117)","v":20.940541836947467},null,{"$f":"[2]!H_(11,F100,F117)","v":30.727518437529557},{"$f":"[2]!H_(11,G100,G117)","v":33.517503797489027},{"$f":"[2]!H_(11,H100,H117)","v":{"$error":"#VALUE!"}},{"$f":"[2]!H_(11,I100,I117)","v":43.671785543492518}]
[null,"ΔHs",null,{"$f":"D114-D118","v":7.2103427415074144},null,10.162622016289379,3.2941401641763406,{"$error":"#VALUE!"},10.388046765125445]
[null,"u1","m/s",{"$f":"(2*52.7%*D119*1000*D102)^0.5","v":73.971514109656738},null,{"$f":"PI()*$D$121*F104","v":57.101751598965535},{"$f":"PI()*$D$121*G104","v":32.574838038282842},30.738177791866459,48.72153497060885]
[null,"D1",null,{"$f":"D120/PI()/D104","v":1.1341938457171245E-2},null,null,null,null,null,null,null,null,"T3"]
[null,"Co = (2*ΔHs)^0,5",null,{"$f":"(2000*D119)^0.5","v":120.0861585821398},null,142.56663015088333,81.16822240478524,{"$error":"#VALUE!"},144.13914641848999,null,null,"MAX",{"$f":"ROUND(F97,0)&\"g/s @ \"&F98&\" b ; \"&F99&\"K\"","v":"161g/s @ 13,07 b ; 9,16K"}]
[null,"u1/Co",null,{"$f":"D120/D122","v":0.61598701285010871},null,0.40052676799986592,0.40132501455843644,{"$error":"#VALUE!"},0.33801736850273811,null,null,"MIN",{"$f":"ROUND(G97,0)&\"g/s @ \"&G98&\" b ; \"&G99&\"K\"","v":"95g/s @ 7,369 b ; 7,912K"}]
[null,"U1/C0 off de / U1/C0 nom",null,{"$f":"D123/$D$54","v":0.96076892283052273},null,{"$f":"F123/$D123","v":0.65021950080841751},{"$f":"G123/$D123","v":0.65151538293242062},{"$f":"H123/$D123","v":{"$error":"#VALUE!"}},{"$f":"I123/$D123","v":0.54874106344996854},null,null,"STS",{"$f":"ROUND(H97,0)&\"g/s @ \"&H98&\" b ; \"&H99&\"K\"","v":{"$error":"#DIV/0!"}}]
[null,"Rdt",null,{"$f":"(0.321*D124^4-1.6098*D124^3+1.316*D124^2+0.9448*D124)*($D102/0.97215493)","v":0.7171786087866604},null,{"$f":"(0.321*F124^4-1.6098*F124^3+1.316*F124^2+0.9448*F124)*($D102/0.97215493)","v":0.58179731360313081},{"$f":"(0.321*G124^4-1.6098*G124^3+1.316*G124^2+0.9448*G124)*($D102/0.97215493)","v":0.582724483494652},{"$f":"(0.321*H124^4-1.6098*H124^3+1.316*H124^2+0.9448*H124)*($D102/0.97215493)","v":{"$error":"#VALUE!"}},{"$f":"(0.321*I124^4-1.6098*I124^3+1.316*I124^2+0.9448*I124)*($D102/0.97215493)","v":0.50201641458397539},null,null,"BAKING",{"$f":"ROUND(I97,0)&\"g/s @ \"&I98&\" b ; \"&I99&\"K\"","v":"117g/s @ 10,48 b ; 10,55K"}]
[]
[null,null,null,null,null,null,null,null,null,null,null,null,{"$f":"M52","v":0},{"$f":"M121","v":"T3"},"T1+T2"]
[null,"Courbe de rendement TC3",null,null,null,null,null,null,null,null,null,{"$f":"L122","v":"MAX"},{"$f":"M53","v":396.39542214476637},{"$f":"M122","v":"161g/s @ 13,07 b ; 9,16K"},{"$f":"F97+F63","v":161.47618188513178}]
[null,null,null,null,null,null,null,null,null,null,null,{"$f":"L123","v":"MIN"},{"$f":"M54","v":0.56527903651906741},{"$f":"M123","v":"95g/s @ 7,369 b ; 7,912K"},{"$f":"G97+G63","v":95.080415199611181}]
[null,null,null,null,null,null,null,null,null,null,null,{"$f":"L124","v":"STS"},{"$f":"M55","v":0.8816785414066125},{"$f":"M124","v":{"$error":"#DIV/0!"}},{"$f":"H97+H63","v":{"$error":"#DIV/0!"}}]
[null,null,null,null,null,null,null,null,null,null,null,{"$f":"L125","v":"BAKING"},{"$f":"M56","v":0.76123477607009837},{"$f":"M125","v":"117g/s @ 10,48 b ; 10,55K"},{"$f":"I97+I63","v":197.38206736648488}]
[null,null,null,null,"d : mm"]
[null,null,null,null,"N : Hz"]
[null,null,null,null,"H : J/kG"]
[]
[]
[]
[]
[]
[null,"rendement=(0,321*rap^4 - 1,6098*rap^3 + 1,316*rap^2 + 0,9448*rap)*(ETAgar/0,97)",null,null,null,null,null,null,"U1/CO _nom",0.64]
[null,null,null,null,null,null,null,null,"Eta_gar",0.8]
[null,"U1/C0",{"$f":"D33","v":0.78},{"$f":"D68","v":0.76},{"$f":"D102","v":0.72}]
[null,0,{"$f":"(0.321*B143^4-1.6098*B143^3+1.316*B143^2+0.9448*B143)*$D$33/0.97215493","v":0}]
[null,{"$f":"B143+0.05","v":0.05},{"$f":"(0.321*$B144^4-1.6098*$B144^3+1.316*$B144^2+0.9448*$B144)*$C$142/0.97215493","v":4.0382461852042459E-2},{"$f":"(0.321*$B144^4-1.6098*$B144^3+1.316*$B144^2+0.9448*$B144)*$D$142/0.97215493","v":3.9347014112246496E-2},{"$f":"(0.321*$B144^4-1.6098*$B144^3+1.316*$B144^2+0.9448*$B144)*$E$142/0.97215493","v":3.7276118632654578E-2}]
[null,0.1,{"$f":"(0.321*$B145^4-1.6098*$B145^3+1.316*$B145^2+0.9448*$B145)*$C$142/0.97215493","v":8.5098158171146673E-2},{"$f":"(0.321*$B145^4-1.6098*$B145^3+1.316*$B145^2+0.9448*$B145)*$D$142/0.97215493","v":8.2916154115476232E-2},{"$f":"(0.321*$B145^4-1.6098*$B145^3+1.316*$B145^2+0.9448*$B145)*$E$142/0.97215493","v":7.8552146004135376E-2}]
[null,0.15000000000000002,0.13323633134792623,0.12982001515951785,0.12298738278270113]
[null,0.2,0.18392485650409657,0.17920883454245307,0.16977679061916603]
[null,0.25,0.23633024149247489,0.23027049171061653,0.21815099214689987]
[null,0.3,0.28965762689698032,0.28223050825859619,0.26737627098182798]
[null,0.35,0.34315078603263366,0.33435204792923284,0.3167545717224311]
[null,0.39999999999999997,0.39609212494555779,0.38593591661362037,0.36562349994974563]
[null,0.44999999999999996,0.4478026824129771,0.43632056235110589,0.41335632222736346]
[null,0.49999999999999994,0.49764212994321799,0.48488207532928934,0.45936196610143198]
[null,0.54999999999999993,0.54500877177570861,0.53103418788402379,0.50308502010065403]
[null,0.6,0.58933954488097895,0.57422827449941549,0.54400573373628835]
[null,0.65,0.63011001896066099,0.61395335180782351,0.58164001750214867]
[null,0.70000000000000007,0.66683439644748832,0.64973607858986027,0.61553944287460449]
[null,0.75000000000000011,0.69906551250529614,0.68114075577439104,0.64529124231258095]
[null,0.80000000000000016,0.7263948350290218,0.70776932643853407,0.67051830925755851]
[null,0.8500000000000002,0.74845246464470438,0.72926137580766071,0.69087919813357312]
[null,0.90000000000000024,0.76490713470948513,0.74529413125539579,0.70606812434721711]
[null,0.95000000000000029,0.77546621131160665,0.7555824623036167,0.71581496428763691]
[null,1.0000000000000002,0.77987569327041351,0.75987888062245412,0.71988525532653547]
[null,1.0500000000000003,0.77792021213635165,0.75797354003029138,0.71808019581817073]
[null,1.1000000000000003,0.76942303219096997,0.74969423649376565,0.7102366450993568]
[null,1.1500000000000004,0.75424605044691839,0.73490640812776653,0.69622712348946292]
[null,1.2000000000000004,0.7322897966479478,0.71351313519543635,0.67595981229041324,null,"F Let u be the peripheral speed of the wheel : u = p . Æ . N / 60                      (in m/s)"]
[null,1.2500000000000004,0.70349343326891334,0.68545514010817188,0.64937855378668918,null,"F Let n, be the speed ratio of the turbine : n =  u / [ 2 . (H1 - H2S ) ] 0.5       (dimensionless number)"]
[null,1.3000000000000005,0.66783475551576954,0.65071078742562172,0.61646285124532574,null,null,"N = speed of rotation of the turbine (in rpm)"]
[null,1.3500000000000005,0.62533019132557388,0.60929608385568745,0.57722786891591438,null,null,"Æ = diameter of the wheel of the turbine (in m)"]
[null,1.4000000000000006,0.57603480136648577,0.56126467825452464,0.53172443203060227]
[null,1.4500000000000006,0.5200422790377659,0.50670786162654113,0.48003902680409161]
[null,1.5000000000000007,0.45748495046977738,0.44575456712439848,0.42229380043364062]

{"sheet":"Turbines_JT60SA_serial_Frein T1","index":4,"n_rows":168,"n_cols":40,"rows_kept":168,"cut":false,"hidden":false,"merged":[]}
[]
[]
[]
[]
[null,null,null,null,"Vitesse de la roue ajustée en fonction de la puissance du frein",null,null,null,null,null,null,{"$f":"D65*0.3","v":448.8}]
[]
[1,2,3,4,5,6,7,8,9,10,11,12,13,14,15,16,17,18,19,20,21,22,23,24,25,26,27,28,29,30,31,32,33]
[null,"Relation entre la puissance et la vitesse de rotation",null,null,null,null,null,null,null,null,null,null,"²"]
[]
[null,"Cvs",null,30,null,null,null,30]
[null,"Range",null,100,null,null,null,100]
[null,"Trim",null,0.85,null,null,null,0.85]
[null,"Cv",null,{"$f":"[2]!Cv_From_Trim(D12,D11)*D10","v":15.035617008818171},null,null,null,{"$f":"[2]!Cv_From_Trim(H12,H11)*H10","v":15.035617008818171}]
[null,"Pin","Bara",15,null,null,null,15]
[null,"Tin","K",40.03,null,null,null,{"$f":"H25","v":80}]
[null,"Rho",null,{"$f":"[2]!rho_(11,D14,D15)","v":17.343206998481495},null,null,null,{"$f":"[2]!rho_(11,H14,H15)","v":8.7915125131395992}]
[null,"Flow",null,{"$f":"IF(D14/2>D24,\"S\",\"SS\")","v":"SS"},null,null,null,{"$f":"IF(H14/2>H24,\"S\",\"SS\")","v":"SS"}]
[null,"m","g/s",{"$f":"[2]!q_gs(D15,D14,(D14-D24),D16,D13,D17)","v":226.408332585029},null,null,null,{"$f":"[2]!q_gs(H15,H14,(H14-H24),H16,H13,H17)","v":551.05876686643217}]
[null,"TURBINE 1"]
[]
[null,null,null,"DESIGN",null,null,null,"start-up","start-up","start-up","start-up","start-up","start-up","start-up","start-up","start-up","start-up"]
[]
[null,"m","g/s",191.5,null,null,null,{"$f":"H36*H24/H25^0.5","v":106.09696702681093},{"$f":"I36*I24/I25^0.5","v":109.41632084058156},113.11923072234391,119.58337462239092,124.678955146749,130.61491890435522,137.6720060026698,146.29487071401371,157.24979897252499,172.02733882410544,174.27673465907139,176.64361423052631,179.13973231720547,181.77861112833543,184.57589294609386,187.54978491746618,190.72161706738413,194.11655508693445]
[null,"Pin","Bara",14.77,null,null,null,11.568229194028468,11.628075032728878,11.700963191890374,11.842999056991831,11.967623579949523,12.126227278936183,12.332793006915608,12.610520822852695,13.001334640562161,13.590675347823593,13.686184316147024,13.78823867226822,13.897553497294171,14.014954705322092,14.141401339031875,14.278013751592558,14.426108925045712,14.5872456216537]
[null,"Tin","K",40.03,null,null,null,80,{"$f":"H25-4","v":76},{"$f":"I25-4","v":72},66,62,58,54,50,46,42,{"$f":"Q25-0.5","v":41.5},{"$f":"R25-0.5","v":41},40.5,40,39.5,39,38.5,38]
[null,"Pout","Bara",6.36,null,null,null,{"$f":"H59","v":4.8648442828706333},4.8749470369194778,4.8900582675092412,4.926261723222316,4.9637310001802595,5.0174710467590122,5.0957088330809759,5.2127541468270833,5.3956808651743886,5.702092132838291,5.7545341855530507,5.8113091128544658,5.872924698366937,5.9399693637357851,6.013128605254467,6.0932055837465464,6.1811470911073343,6.2780766155336671]
[null,"Tout","K",{"$f":"[2]!T2_turb(11,D24,D25,D26,D28)","v":31.094586910112792},null,null,null,{"$f":"[2]!T2_turb(11,H24,H25,H26,H28)","v":64.447286262863329},{"$f":"[2]!T2_turb(11,I24,I25,I26,I28)","v":60.92489198191489},{"$f":"[2]!T2_turb(11,J24,J25,J26,J28)","v":57.423929485675458},{"$f":"[2]!T2_turb(11,K24,K25,K26,K28)","v":52.219423100978254},{"$f":"[2]!T2_turb(11,L24,L25,L26,L28)","v":48.787018789229855},{"$f":"[2]!T2_turb(11,M24,M25,M26,M28)","v":45.391033167282991},{"$f":"[2]!T2_turb(11,N24,N25,N26,N28)","v":42.039704372334981},{"$f":"[2]!T2_turb(11,O24,O25,O26,O28)","v":38.745337941708804},{"$f":"[2]!T2_turb(11,P24,P25,P26,P28)","v":35.52782818153905},{"$f":"[2]!T2_turb(11,Q24,Q25,Q26,Q28)","v":32.422945561304793},{"$f":"[2]!T2_turb(11,R24,R25,R26,R28)","v":32.045737398077762},{"$f":"[2]!T2_turb(11,S24,S25,S26,S28)","v":31.671542305417073},{"$f":"[2]!T2_turb(11,T24,T25,T26,T28)","v":31.300595545336577},{"$f":"[2]!T2_turb(11,U24,U25,U26,U28)","v":30.933161477480976},{"$f":"[2]!T2_turb(11,V24,V25,V26,V28)","v":30.569538340311297},{"$f":"[2]!T2_turb(11,W24,W25,W26,W28)","v":30.210063820088262},{"$f":"[2]!T2_turb(11,X24,X25,X26,X28)","v":29.855121855946173},{"$f":"[2]!T2_turb(11,Y24,Y25,Y26,Y28)","v":29.505150740610084}]
[null,"Efficacity","%",0.78,null,null,null,{"$f":"(0.321*H50^4-1.6098*H50^3+1.316*H50^2+0.9448*H50)*($D$28/0.97215493)","v":0.6688324145168677},{"$f":"(0.321*I50^4-1.6098*I50^3+1.316*I50^2+0.9448*I50)*($D$28/0.97215493)","v":0.68019103877173193},0.69188088207003773,0.70996120526831485,0.72228340755290776,0.73468412444992448,0.74695504300963067,0.75873420055018737,0.76935353273459961,0.77744295902758931,0.77814963807987503,0.77876142081009747,0.77926677120507204,0.77965235023374224,0.77990264787109398,0.77999952200327627,0.77992161744176935,0.77964362762181205]
[null,"Power","W",{"$f":"+D23*(D40-D41)","v":9122.4436160855366},null,null,null,{"$f":"+H23*(H40-H41)","v":8771.5804028058537},8771.5804032003543,8771.5804035318106,8771.5804036784048,8771.5804033582099,8771.5804026112946,8771.5804089995108,8771.5804032497745,8771.5804068516009,8771.580408475993,8771.5804024218196,8771.5804113422364,8771.5804009699805,8771.5804096497741,8771.5804020907199,8771.5804051163559,8771.5804000191383,8771.5804010352476]
[null,"Speed","Hz",1995,null,null,null,1995,1995,1995,1995,1995,1995,1995,1995,1995,1995,1995,1995,1995,1995,1995,1995,1995,1995]
[null,"Speed calculated from P=K.rho.N^3",null,null,null,null,null,{"$f":"(H29/$D29*$D33/H33)^(1/3)*$D30","v":1995.0000002064849},{"$f":"(I29/$D29*$D33/I33)^(1/3)*$D30","v":1995.0000002363931},1995.000000261522,1995.0000002726354,1995.0000002483605,1995.0000001917347,1995.0000006760449,1995.0000002401398,1995.0000005132054,1995.0000006363553,1995.0000001773701,1995.0000008536538,1995.0000000673017,1995.0000007253432,1995.0000001522683,1995.0000003816513,1994.9999999952156,1995.0000000722498]
[null,"Delta Speed Frein & Turbine",null,{"$f":"D61-D33","v":-3.85},null,null,null,{"$f":"H30-H31","v":-2.0648485588026233E-7},{"$f":"I30-I31","v":-2.3639313440071419E-7},-2.6152201826334931E-7,-2.7263536139798816E-7,-2.4836049306031782E-7,-1.9173467080690898E-7,-6.7604491960082669E-7,-2.4013979782466777E-7,-5.1320535021659452E-7,-6.3635525293648243E-7,-1.7737011148710735E-7,-8.5365377344714943E-7,-6.7301698436494917E-8,-7.2534317041572649E-7,-1.5226828509184998E-7,-3.8165126170497388E-7,4.784396878676489E-9,-7.2249804361490533E-8]
[null,"Brake Pressure",null,5.2,null,null,null,{"$f":"($D33-$D61)+H61","v":5},{"$f":"($D33-$D61)+I61","v":5},{"$f":"($D33-$D61)+J61","v":5},5,5,5,5,5,5,5,5,5,5,5,5,5,5,5]
[null,"Rho (brake)",null,{"$f":"[2]!rho_(11,D33,330)","v":0.75697464940773784},null,null,null,{"$f":"[2]!rho_(11,H33,330)","v":0.72791980970899706},{"$f":"[2]!rho_(11,I33,330)","v":0.72791980970899706},{"$f":"[2]!rho_(11,J33,330)","v":0.72791980970899706},{"$f":"[2]!rho_(11,K33,330)","v":0.72791980970899706},{"$f":"[2]!rho_(11,L33,330)","v":0.72791980970899706},{"$f":"[2]!rho_(11,M33,330)","v":0.72791980970899706},{"$f":"[2]!rho_(11,N33,330)","v":0.72791980970899706},{"$f":"[2]!rho_(11,O33,330)","v":0.72791980970899706},{"$f":"[2]!rho_(11,P33,330)","v":0.72791980970899706},{"$f":"[2]!rho_(11,Q33,330)","v":0.72791980970899706},{"$f":"[2]!rho_(11,R33,330)","v":0.72791980970899706},{"$f":"[2]!rho_(11,S33,330)","v":0.72791980970899706},{"$f":"[2]!rho_(11,T33,330)","v":0.72791980970899706},{"$f":"[2]!rho_(11,U33,330)","v":0.72791980970899706},{"$f":"[2]!rho_(11,V33,330)","v":0.72791980970899706},{"$f":"[2]!rho_(11,W33,330)","v":0.72791980970899706},{"$f":"[2]!rho_(11,X33,330)","v":0.72791980970899706},{"$f":"[2]!rho_(11,Y33,330)","v":0.72791980970899706}]
[null,"Wheel","mm",35.799999999999997,null,null,null,{"$f":"$D$35","v":35.799999999999997},{"$f":"$D$35","v":35.799999999999997},35.799999999999997,35.799999999999997,35.799999999999997,35.799999999999997,35.799999999999997,35.799999999999997,35.799999999999997,35.799999999999997,35.799999999999997,35.799999999999997,35.799999999999997,35.799999999999997,35.799999999999997,35.799999999999997,35.799999999999997,35.799999999999997]
[null,"a = mÖT/P",null,{"$f":"D23*D25^0.5/D24","v":82.031580287488268},null,null,null,{"$f":"+$D$36","v":82.031580287488268},{"$f":"+$D$36","v":82.031580287488268},82.031580287488268,82.031580287488268,82.031580287488268,82.031580287488268,82.031580287488268,82.031580287488268,82.031580287488268,82.031580287488268,82.031580287488268,82.031580287488268,82.031580287488268,82.031580287488268,82.031580287488268,82.031580287488268,82.031580287488268,82.031580287488268,null,null,null,null,null,null,null,null,null,null,null,"T1 out",63,31,"x"]
[null,"Rho (in)","kg/m3",{"$f":"[2]!rho_(11,D24,D25)","v":17.087672541642732},null,null,null,{"$f":"[2]!rho_(11,H24,H25)","v":6.8207006087461206},{"$f":"[2]!rho_(11,I24,I25)","v":7.2097258936483577},{"$f":"[2]!rho_(11,J24,J25)","v":7.6497565053536611},{"$f":"[2]!rho_(11,K24,K25)","v":8.4312866720161672},{"$f":"[2]!rho_(11,L24,L25)","v":9.0574513810389661},{"$f":"[2]!rho_(11,M24,M25)","v":9.7958059321539359},{"$f":"[2]!rho_(11,N24,N25)","v":10.682949625104165},{"$f":"[2]!rho_(11,O24,O25)","v":11.775528056684704},{"$f":"[2]!rho_(11,P24,P25)","v":13.168231144944331},{"$f":"[2]!rho_(11,Q24,Q25)","v":15.0382428881233},{"$f":"[2]!rho_(11,R24,R25)","v":15.320931168786426},{"$f":"[2]!rho_(11,S24,S25)","v":15.61766023293892},{"$f":"[2]!rho_(11,T24,T25)","v":15.929734898363112},{"$f":"[2]!rho_(11,U24,U25)","v":16.258647011177583},{"$f":"[2]!rho_(11,V24,V25)","v":16.606111805042953},{"$f":"[2]!rho_(11,W24,W25)","v":16.974113550589177},{"$f":"[2]!rho_(11,X24,X25)","v":17.364962689404631},{"$f":"[2]!rho_(11,Y24,Y25)","v":17.781368532866477},null,null,null,null,null,null,null,null,null,null,null,"T2 in",62,18,"y"]
[null,"Sound Speed @inlet",null,{"$f":"[2]!Sound_speed(11,D24,D25)","v":391.2334216977045},null,null,null,{"$f":"[2]!Sound_speed(11,H24,H25)","v":537.34696724469177},{"$f":"[2]!Sound_speed(11,I24,I25)","v":524.37413698369437},{"$f":"[2]!Sound_speed(11,J24,J25)","v":511.07881051288234},{"$f":"[2]!Sound_speed(11,K24,K25)","v":490.47807072811639},{"$f":"[2]!Sound_speed(11,L24,L25)","v":476.26635904686287},{"$f":"[2]!Sound_speed(11,M24,M25)","v":461.63798975854132},{"$f":"[2]!Sound_speed(11,N24,N25)","v":446.56252130543885},{"$f":"[2]!Sound_speed(11,O24,O25)","v":431.01261748531073},{"$f":"[2]!Sound_speed(11,P24,P25)","v":414.97483903421613},{"$f":"[2]!Sound_speed(11,Q24,Q25)","v":398.48209340679887},{"$f":"[2]!Sound_speed(11,R24,R25)","v":396.39467894072266},{"$f":"[2]!Sound_speed(11,S24,S25)","v":394.30323002764749},{"$f":"[2]!Sound_speed(11,T24,T25)","v":392.20855276524236},{"$f":"[2]!Sound_speed(11,U24,U25)","v":390.11161495363615},{"$f":"[2]!Sound_speed(11,V24,V25)","v":388.01358087809945},{"$f":"[2]!Sound_speed(11,W24,W25)","v":385.91585549057726},{"$f":"[2]!Sound_speed(11,X24,X25)","v":383.82014021655397},{"$f":"[2]!Sound_speed(11,Y24,Y25)","v":381.72850473798167},null,null,null,null,null,null,null,null,null,null,null,"slope",{"$f":"SLOPE(AL37:AM37,AL36:AM36)","v":1.375}]
[null,"S=Q/(rho*V) = cte",null,{"$f":"D23/(D37*D38)","v":2.8645071953707371E-2},null,null,null,{"$f":"H23/(H37*H38)","v":2.8948041068784472E-2},2.894157024550998E-2,2.8933498927269412E-2,2.891727426986546E-2,2.890262154923838E-2,2.8883583332199196E-2,2.8858396015574588E-2,2.8824296999264101E-2,2.8776693593398812E-2,2.8707248307164774E-2,2.8696335200643647E-2,2.8684787501925713E-2,2.8672549594999496E-2,2.8659558624057124E-2,2.8645743175626806E-2,2.8631021641162279E-2,2.8615300176352509E-2,2.8598470124223382E-2,null,null,null,null,null,null,null,null,null,null,null,"intercept",{"$f":"INTERCEPT(AL37:AM37,AL36:AM36)","v":-24.625}]
[null,"Hin",null,{"$f":"[2]!H_(11,D24,D25)","v":223.57106614117126},null,null,null,{"$f":"[2]!H_(11,H24,H25)","v":433.59885604961028},{"$f":"[2]!H_(11,I24,I25)","v":412.72413154210858},{"$f":"[2]!H_(11,J24,J25)","v":391.83401039244882},{"$f":"[2]!H_(11,K24,K25)","v":360.46259768488272},{"$f":"[2]!H_(11,L24,L25)","v":339.5175491495574},{"$f":"[2]!H_(11,M24,M25)","v":318.54056369584094},{"$f":"[2]!H_(11,N24,N25)","v":297.52270217130808},{"$f":"[2]!H_(11,O24,O25)","v":276.45117930193686},{"$f":"[2]!H_(11,P24,P25)","v":255.30673858557543},{"$f":"[2]!H_(11,Q24,Q25)","v":234.05800411516284},{"$f":"[2]!H_(11,R24,R25)","v":231.39216412810913},{"$f":"[2]!H_(11,S24,S25)","v":228.72370541825617},{"$f":"[2]!H_(11,T24,T25)","v":226.05245307713869},{"$f":"[2]!H_(11,U24,U25)","v":223.37821252315288},{"$f":"[2]!H_(11,V24,V25)","v":220.70076617857225},{"$f":"[2]!H_(11,W24,W25)","v":218.01986941266208},{"$f":"[2]!H_(11,X24,X25)","v":215.33524552413058},{"$f":"[2]!H_(11,Y24,Y25)","v":212.64657950554874},null,null,null,null,null,null,null,null,null,null,null,"x","y"]
[null,"Hout",null,{"$f":"[2]!H_(11,D26,D27)","v":175.9342848561293},null,null,null,{"$f":"[2]!H_(11,H26,H27)","v":350.92372735729566},{"$f":"[2]!H_(11,I26,I27)","v":332.55711134061181},{"$f":"[2]!H_(11,J26,J27)","v":314.29122348062799},{"$f":"[2]!H_(11,K26,K27)","v":287.11142799782152},{"$f":"[2]!H_(11,L26,L27)","v":269.16421331165333},{"$f":"[2]!H_(11,M26,M27)","v":251.38452611460247},{"$f":"[2]!H_(11,N26,N27)","v":233.80909282047602},{"$f":"[2]!H_(11,O26,O27)","v":216.49295684041937},{"$f":"[2]!H_(11,P26,P27)","v":199.52555181035933},{"$f":"[2]!H_(11,Q26,Q27)","v":183.06854820406048},{"$f":"[2]!H_(11,R26,R27)","v":181.06083092071796},{"$f":"[2]!H_(11,S26,S27)","v":179.066770750383},{"$f":"[2]!H_(11,T26,T27)","v":177.08743405255956},{"$f":"[2]!H_(11,U26,U27)","v":175.1240182854323},{"$f":"[2]!H_(11,V26,V27)","v":173.17787322606466},{"$f":"[2]!H_(11,W26,W27)","v":171.25052542766946},{"$f":"[2]!H_(11,X26,X27)","v":169.34370804193716},{"$f":"[2]!H_(11,Y26,Y27)","v":167.45939597497906},null,null,null,null,null,null,null,null,null,null,null,277,{"$f":"m*AK41+p","v":356.25}]
[null,"Sin = Sout",null,{"$f":"[2]!S_(11,D24,D25)","v":15.488244062210457},null,null,null,{"$f":"[2]!S_(11,H24,H25)","v":19.655146228579529},{"$f":"[2]!S_(11,I24,I25)","v":19.3765172196515},{"$f":"[2]!S_(11,J24,J25)","v":19.080880529117202},{"$f":"[2]!S_(11,K24,K25)","v":18.600273917541095},{"$f":"[2]!S_(11,L24,L25)","v":18.250604534566243},{"$f":"[2]!S_(11,M24,M25)","v":17.872776018578424},{"$f":"[2]!S_(11,N24,N25)","v":17.461210835597278},{"$f":"[2]!S_(11,O24,O25)","v":17.008127082111411},{"$f":"[2]!S_(11,P24,P25)","v":16.501909282144688},{"$f":"[2]!S_(11,Q24,Q25)","v":15.923352628419423},{"$f":"[2]!S_(11,R24,R25)","v":15.844427943748512},{"$f":"[2]!S_(11,S24,S25)","v":15.763742910570906},{"$f":"[2]!S_(11,T24,T25)","v":15.681182072483475},{"$f":"[2]!S_(11,U24,U25)","v":15.596615812506165},{"$f":"[2]!S_(11,V24,V25)","v":15.509897871218822},{"$f":"[2]!S_(11,W24,W25)","v":15.420862262190374},{"$f":"[2]!S_(11,X24,X25)","v":15.329319501021169},{"$f":"[2]!S_(11,Y24,Y25)","v":15.235051887057329},null,null,null,null,null,null,null,null,null,null,null,31,{"$f":"m*AK42+p","v":18}]
[null,"Tout(iso)",null,{"$f":"[1]!HeCalc(2,0,1,D26*10^5,8,D42*1000,1)","v":28.580768861485691},null,null,null,{"$f":"[1]!HeCalc(2,0,1,H26*10^5,8,H42*1000,1)","v":56.600372350900081},{"$f":"[1]!HeCalc(2,0,1,I26*10^5,8,I42*1000,1)","v":53.704410509210284},{"$f":"[1]!HeCalc(2,0,1,J26*10^5,8,J42*1000,1)","v":50.813940030072182},{"$f":"[1]!HeCalc(2,0,1,K26*10^5,8,K42*1000,1)","v":46.492083368970597},{"$f":"[1]!HeCalc(2,0,1,L26*10^5,8,L42*1000,1)","v":43.623509464211317},{"$f":"[1]!HeCalc(2,0,1,M26*10^5,8,M42*1000,1)","v":40.769199018070502},{"$f":"[1]!HeCalc(2,0,1,N26*10^5,8,N42*1000,1)","v":37.934741264276781},{"$f":"[1]!HeCalc(2,0,1,O26*10^5,8,O42*1000,1)","v":35.129068251802344},{"$f":"[1]!HeCalc(2,0,1,P26*10^5,8,P42*1000,1)","v":32.367466423444554},{"$f":"[1]!HeCalc(2,0,1,Q26*10^5,8,Q42*1000,1)","v":29.678542624432723},{"$f":"[1]!HeCalc(2,0,1,R26*10^5,8,R42*1000,1)","v":29.349959144869015},{"$f":"[1]!HeCalc(2,0,1,S26*10^5,8,S42*1000,1)","v":29.023529514283961},{"$f":"[1]!HeCalc(2,0,1,T26*10^5,8,T42*1000,1)","v":28.699444332668442},{"$f":"[1]!HeCalc(2,0,1,U26*10^5,8,U42*1000,1)","v":28.377917113671284},{"$f":"[1]!HeCalc(2,0,1,V26*10^5,8,V42*1000,1)","v":28.059187851853135},{"$f":"[1]!HeCalc(2,0,1,W26*10^5,8,W42*1000,1)","v":27.743527033289936},{"$f":"[1]!HeCalc(2,0,1,X26*10^5,8,X42*1000,1)","v":27.431240534638672},{"$f":"[1]!HeCalc(2,0,1,Y26*10^5,8,Y42*1000,1)","v":27.122675299940717},null,null,null,null,null,null,null,null,null,null,null,31,{"$f":"m*AK43+p","v":18}]
[null,"Hout(iso)",null,{"$f":"[2]!H_(11,D26,D43)","v":162.49826962188638},null,null,null,{"$f":"[2]!H_(11,H26,H43)","v":309.98772881075598},{"$f":"[2]!H_(11,I26,I43)","v":294.86456616726934},{"$f":"[2]!H_(11,J26,J43)","v":279.75866777014562},{"$f":"[2]!H_(11,K26,K43)","v":257.14544578594246},{"$f":"[2]!H_(11,L26,L43)","v":242.11348988110379},{"$f":"[2]!H_(11,M26,M43)","v":227.13252131909871},{"$f":"[2]!H_(11,N26,N43)","v":212.22491892840063},{"$f":"[2]!H_(11,O26,O43)","v":197.42716480774439},{"$f":"[2]!H_(11,P26,P43)","v":182.8027668718864},{"$f":"[2]!H_(11,Q26,Q43)","v":168.47189864077652},{"$f":"[2]!H_(11,R26,R43)","v":166.71137428467176},{"$f":"[2]!H_(11,S26,S43)","v":164.95971642119173},{"$f":"[2]!H_(11,T26,T43)","v":163.21772069292714},{"$f":"[2]!H_(11,U26,U43)","v":161.48627540110866},{"$f":"[2]!H_(11,V26,V43)","v":159.76637509497812},{"$f":"[2]!H_(11,W26,W43)","v":158.05913525108841},{"$f":"[2]!H_(11,X26,X43)","v":156.36581006592226},{"$f":"[2]!H_(11,Y26,Y43)","v":154.68781228210975}]
[null,"ΔHs",null,{"$f":"D40-D44","v":61.072796519284879},null,null,null,123.61112723885429,117.85956537483924,112.0753426223032,103.31715189894027,97.404059268453608,91.40804237674223,85.297783242907457,79.024014494192471,72.503971713689026,65.586105474386329,64.680789843437367,63.763988997064445,62.834732384211549,61.891937122044226,60.934391083594136,59.960734161573669,58.969435458208324,57.958767223438997]
[null,"u1","m/s",{"$f":"(2*52.7%*D45*1000*D28)^0.5","v":224.07402231056255},null,null,null,{"$f":"PI()*$D$47*H30","v":224.07402231056253},{"$f":"PI()*$D$47*I30","v":224.07402231056253},224.07402231056253,224.07402231056253,224.07402231056253,224.07402231056253,224.07402231056253,224.07402231056253,224.07402231056253,224.07402231056253,224.07402231056253,224.07402231056253,224.07402231056253,224.07402231056253,224.07402231056253,224.07402231056253,224.07402231056253,224.07402231056253]
[null,"D1",null,{"$f":"D46/PI()/D30","v":3.5751867939057311E-2}]
[null,"Co = (2*ΔHs)^0,5",null,{"$f":"(2000*D45)^0.5","v":349.49333761685608},null,null,null,497.21449544206632,485.50914589704536,473.44554622955997,454.57046076255386,441.37072686904287,427.56997644068093,413.03216156349731,397.55254871322978,380.79908538148834,362.17704365237267,359.66870823978383,357.11059630614278,354.49889247841537,351.82932544642784,349.09709561551534,346.29679225073301,343.42229239875599,340.4666421940305]
[null,"u1/Co",null,{"$f":"D46/D48","v":0.64113961038138956},null,null,null,0.45065866816964278,0.46152379250560716,0.47328362067200769,0.49293573087585252,0.50767757957143933,0.52406397702634178,0.54250986524233324,0.56363372096551667,0.58843109375140157,0.61868643040124549,0.62300115961485569,0.62746394150250573,0.63208666392154067,0.63688273291670705,0.64186733468946033,0.64705774735656174,0.65247372482851151,0.65813796284589809]
[null,"U1/C0 off de / U1/C0 nom",null,{"$f":"D49/$D$49","v":1},null,null,null,{"$f":"H49/$D49","v":0.70290255175711747},{"$f":"I49/$D49","v":0.71984913275138973},0.73819120361393564,0.7688430458736184,0.79183624182795576,0.81739447780273011,0.84616494825458499,0.87911230539980589,0.9177893304726038,0.96497926564420577,0.97170904671488945,0.97866974890110336,0.98587991396372521,0.99336045161497621,1.0011350481178942,1.0092306525432919,1.0176780755136619,1.0265127160906451]
[null,"Rdt",null,{"$f":"(0.321*D50^4-1.6098*D50^3+1.316*D50^2+0.9448*D50)*($D28/0.97215493)","v":0.77987569327041328},null,null,null,{"$f":"(0.321*H50^4-1.6098*H50^3+1.316*H50^2+0.9448*H50)*($D28/0.97)","v":0.6703182774395634},0.68170213575645389,0.69341794894550079,0.71153843897972602,0.72388801598944175,0.73631628203786348,0.74861446139193255,0.76041978724172521,0.77106271109366742,0.77917010867263814,0.77987835766707858,0.78049149951993901,0.78099797258988957,0.78138440821218469,0.78163526190509069,0.78173235125064799,0.78165427361813411,0.7813756662222977]
[]
[]
[null,"TURBINE 2"]
[null,null,null,null,null,null,null,5]
[null,null,null,"DESIGN",null,null,null,{"$f":"H21","v":"start-up"},{"$f":"I21","v":"start-up"},"start-up","start-up","start-up","start-up","start-up","start-up","start-up","start-up",0,0,0,0,0,0,0,0]
[null,"Delta Debit",null,null,null,null,null,{"$f":"H58-H23","v":-27.422672868317434},{"$f":"I58-I23","v":-27.414296264357631},{"$f":"J58-J23","v":-27.296444704250476},-26.799244452429619,-26.129813897885711,-25.023203714664049,-23.229040245939473,-20.307743163218035,-15.433043299223442,-6.9028347754183983,-5.4249496106897936,-3.8233127069360648,-2.0846387429801609,-0.19380132754184842,1.8664903939556439,4.1160834465846392,6.5778633391341543,9.2783492845603632]
[null,"m","g/s",191.20000000000002,null,null,null,{"$f":"H71*H59/H60^0.5","v":78.674294158493495},{"$f":"I71*I59/I60^0.5","v":82.002024576223931},85.822786018093439,92.784130169961301,98.549141248863293,105.59171518969117,114.44296575673033,125.98712755079568,141.81675567330154,165.12450404868704,168.8517850483816,172.82030152359025,177.05509357422531,181.58480980079358,186.4423833400495,191.66586836405082,197.29948040651828,203.39490437149482]
[null,"Pin","Bara",6.3070000000000004,null,null,null,4.8648442828706333,4.8749470369194778,4.8900582675092412,4.926261723222316,4.9637310001802595,5.0174710467590122,5.0957088330809759,5.2127541468270833,5.3956808651743886,5.702092132838291,5.7545341855530507,5.8113091128544658,5.872924698366937,5.9399693637357851,6.013128605254467,6.0932055837465464,6.1811470911073343,6.2780766155336671]
[null,"Tin","K",18.21,null,null,null,{"$f":"m*H27+p","v":63.99001861143708},{"$f":"m*I27+p","v":59.146726475132979},54.33290304280375,47.176706763845104,42.457150835191044,37.787670605014114,33.179593511960597,28.649839669849605,24.225763749616192,{"$f":"m*Q27+p","v":19.956550146794093},19.437888922356919,18.923370669948476,18.413318874837792,17.908097031536343,17.408115217928035,16.913837752621362,16.425792551925987,15.944582268338863]
[null,"Pout","Bara",1.35,null,null,null,1.1499999999999999,1.1499999999999999,1.1499999999999999,1.1499999999999999,1.1499999999999999,1.1499999999999999,1.1499999999999999,1.1499999999999999,1.1499999999999999,1.1499999999999999,1.1499999999999999,1.1499999999999999,1.1499999999999999,1.1499999999999999,1.1499999999999999,1.1499999999999999,1.1499999999999999,1.1499999999999999]
[null,"Tout","K",{"$f":"[2]!T2_turb(11,D59,D60,D61,D63)","v":11.618357475588732},null,null,null,{"$f":"[2]!T2_turb(11,H59,H60,H61,H63)","v":49.486754249914846},{"$f":"[2]!T2_turb(11,I59,I60,I61,I63)","v":45.226046274436612},{"$f":"[2]!T2_turb(11,J59,J60,J61,J63)","v":41.023481985474177},{"$f":"[2]!T2_turb(11,K59,K60,K61,K63)","v":34.846529967859865},{"$f":"[2]!T2_turb(11,L59,L60,L61,L63)","v":30.828417932151755},{"$f":"[2]!T2_turb(11,M59,M60,M61,M63)","v":26.906189341484318},{"$f":"[2]!T2_turb(11,N59,N60,N61,N63)","v":23.098314293927196},{"$f":"[2]!T2_turb(11,O59,O60,O61,O63)","v":19.429686904509566},{"$f":"[2]!T2_turb(11,P59,P60,P61,P63)","v":15.935032850351334},{"$f":"[2]!T2_turb(11,Q59,Q60,Q61,Q63)","v":12.664731607796734},{"$f":"[2]!T2_turb(11,R59,R60,R61,R63)","v":12.275130142645626},{"$f":"[2]!T2_turb(11,S59,S60,S61,S63)","v":11.89035374374839},{"$f":"[2]!T2_turb(11,T59,T60,T61,T63)","v":11.510597109678917},{"$f":"[2]!T2_turb(11,U59,U60,U61,U63)","v":11.136065676293184},{"$f":"[2]!T2_turb(11,V59,V60,V61,V63)","v":10.766976144104159},{"$f":"[2]!T2_turb(11,W59,W60,W61,W63)","v":10.403556812660732},{"$f":"[2]!T2_turb(11,X59,X60,X61,X63)","v":10.046047927867395},{"$f":"[2]!T2_turb(11,Y59,Y60,Y61,Y63)","v":9.6947018124914859}]
[null,"Efficacity","%",0.76,null,null,null,{"$f":"(0.321*H85^4-1.6098*H85^3+1.316*H85^2+0.9448*H85)*($D$63/0.97215493)","v":0.51929193708231935},{"$f":"(0.321*I85^4-1.6098*I85^3+1.316*I85^2+0.9448*I85)*($D$63/0.97215493)","v":0.53832570561364601},0.55895183636083101,0.59317735698995133,0.61832769366220386,0.64532987935431363,0.67390677089009465,0.70324096155243965,0.73133216049441052,0.75349499632897088,0.75541020039948259,0.75704483227416264,0.75836248748235957,0.75932231074780865,0.75987838961674159,0.75997905272047361,0.75956605357811835,0.75857361781388766]
[null,"Power","W",{"$f":"+D58*(D75-D76)","v":6144.650345780522},null,null,null,5991.0340871315884,5991.0340871263224,5991.0340871188782,5991.0340871045819,5991.0340870961882,5991.03408709408,5991.0340869370111,5991.0340870421915,5991.0340868781914,5991.03408677277,5991.0340870357022,5991.0340866634888,5991.0340871001581,5991.0340867728,5991.0340870669243,5991.0340869882457,5991.0340871374128,5991.034087123976]
[null,"Speed","Hz",1496,null,null,null,1496,1496,1496,1496,1496,1496,1496,1496,1496,1496,1496,1496,1496,1496,1496,1496,1496,1496]
[null,null,null,null,null,null,null,{"$f":"(H64/$D64*$D68/H68)^(1/3)*$D65","v":1495.9999999996319},{"$f":"(I64/$D64*$D68/I68)^(1/3)*$D65","v":1495.9999999991937},1495.9999999985741,1495.9999999973841,1495.9999999966853,1495.99999999651,1495.9999999834363,1495.9999999921911,1495.9999999785405,1495.9999999697657,1495.9999999916508,1495.9999999606696,1495.9999999970159,1495.9999999697682,1495.9999999942497,1495.9999999877007,1496.0000000001169,1495.9999999989984]
[null,"Delta Speed Frein & Turbine",null,null,null,null,null,{"$f":"H65-H66","v":3.681179805425927E-10},{"$f":"I65-I66","v":8.0626705312170088E-10},1.4258603187045082E-9,2.6159341359743848E-9,3.314653440611437E-9,3.4899585443781689E-9,1.6563717508688569E-8,7.8089215094223619E-9,2.1459527488332242E-8,{"$f":"Q65-Q66","v":3.0234332371037453E-8},{"$f":"R65-R66","v":8.3491613622754812E-9},3.9330416257143952E-8,2.9840521165169775E-9,3.0231831260607578E-8,5.7502802519593388E-9,1.2299324225750752E-8,-1.1687006917782128E-10,1.0015810403274372E-9]
[null,"Brake Pressure",null,8,null,null,null,{"$f":"($D68-$D61)+H61","v":7.8000000000000007},{"$f":"($D68-$D61)+I61","v":7.8000000000000007},7.8000000000000007,7.8000000000000007,7.8000000000000007,7.8000000000000007,7.8000000000000007,7.8000000000000007,7.8000000000000007,7.8000000000000007,7.8000000000000007,7.8000000000000007,7.8000000000000007,7.8000000000000007,7.8000000000000007,7.8000000000000007,7.8000000000000007,7.8000000000000007]
[null,"Rho (brake)",null,{"$f":"[2]!rho_(11,D68,330)","v":1.1632432504804469},null,null,null,{"$f":"[2]!rho_(11,H68,330)","v":1.1342549379241607},{"$f":"[2]!rho_(11,I68,330)","v":1.1342549379241607},{"$f":"[2]!rho_(11,J68,330)","v":1.1342549379241607},{"$f":"[2]!rho_(11,K68,330)","v":1.1342549379241607},{"$f":"[2]!rho_(11,L68,330)","v":1.1342549379241607},{"$f":"[2]!rho_(11,M68,330)","v":1.1342549379241607},{"$f":"[2]!rho_(11,N68,330)","v":1.1342549379241607},{"$f":"[2]!rho_(11,O68,330)","v":1.1342549379241607},{"$f":"[2]!rho_(11,P68,330)","v":1.1342549379241607},{"$f":"[2]!rho_(11,Q68,330)","v":1.1342549379241607},{"$f":"[2]!rho_(11,R68,330)","v":1.1342549379241607},{"$f":"[2]!rho_(11,S68,330)","v":1.1342549379241607},{"$f":"[2]!rho_(11,T68,330)","v":1.1342549379241607},{"$f":"[2]!rho_(11,U68,330)","v":1.1342549379241607},{"$f":"[2]!rho_(11,V68,330)","v":1.1342549379241607},{"$f":"[2]!rho_(11,W68,330)","v":1.1342549379241607},{"$f":"[2]!rho_(11,X68,330)","v":1.1342549379241607},{"$f":"[2]!rho_(11,Y68,330)","v":1.1342549379241607}]
[null,"Wheel","mm",39.5,null,null,null,{"$f":"$D$35","v":35.799999999999997},{"$f":"$D$35","v":35.799999999999997},35.799999999999997,35.799999999999997,35.799999999999997,35.799999999999997,35.799999999999997,35.799999999999997,35.799999999999997,35.799999999999997,35.799999999999997,35.799999999999997,35.799999999999997,35.799999999999997,35.799999999999997,35.799999999999997,35.799999999999997,35.799999999999997]
[null,"a = mÖT/P",null,{"$f":"D58*D60^0.5/D59","v":129.36596422035444},null,null,null,{"$f":"$D$71","v":129.36596422035444},129.36596422035444,129.36596422035444,129.36596422035444,129.36596422035444,129.36596422035444,129.36596422035444,129.36596422035444,129.36596422035444,129.36596422035444,129.36596422035444,129.36596422035444,129.36596422035444,129.36596422035444,129.36596422035444,129.36596422035444,129.36596422035444,129.36596422035444]
[null,"Rho (in)","kg/m3",{"$f":"[2]!rho_(11,D59,D60)","v":16.817250243896773},null,null,null,{"$f":"[2]!rho_(11,H59,H60)","v":3.6225364975506773},{"$f":"[2]!rho_(11,I59,I60)","v":3.9250425508969169},{"$f":"[2]!rho_(11,J59,J60)","v":4.2834668971466456},{"$f":"[2]!rho_(11,K59,K60)","v":4.9653197629524595},{"$f":"[2]!rho_(11,L59,L60)","v":5.5564111829551104},{"$f":"[2]!rho_(11,M59,M60)","v":6.3087297168304932},{"$f":"[2]!rho_(11,N59,N60)","v":7.2982014467038452},{"$f":"[2]!rho_(11,O59,O60)","v":8.6567135517087284},{"$f":"[2]!rho_(11,P59,P60)","v":10.634451553256186},{"$f":"[2]!rho_(11,Q59,Q60)","v":13.76743637989002},{"$f":"[2]!rho_(11,R59,R60)","v":14.29142897365462},{"$f":"[2]!rho_(11,S59,S60)","v":14.856052737710192},{"$f":"[2]!rho_(11,T59,T60)","v":15.466108083860259},{"$f":"[2]!rho_(11,U59,U60)","v":16.127165066662116},{"$f":"[2]!rho_(11,V59,V60)","v":16.845720285511145},{"$f":"[2]!rho_(11,W59,W60)","v":17.629392996690076},{"$f":"[2]!rho_(11,X59,X60)","v":18.48717142526985},{"$f":"[2]!rho_(11,Y59,Y60)","v":19.429724735305907}]
[null,"Sound Speed",null,{"$f":"[2]!Sound_speed(11,D59,D60)","v":258.39146376447951},null,null,null,{"$f":"[2]!Sound_speed(11,H59,H60)","v":475.87607050814597},{"$f":"[2]!Sound_speed(11,I59,I60)","v":457.90987584885238},{"$f":"[2]!Sound_speed(11,J59,J60)","v":439.31639779651942},{"$f":"[2]!Sound_speed(11,K59,K60)","v":410.0932418327713},{"$f":"[2]!Sound_speed(11,L59,L60)","v":389.59418528959492},{"$f":"[2]!Sound_speed(11,M59,M60)","v":368.15393207032912},{"$f":"[2]!Sound_speed(11,N59,N60)","v":345.63508895900139},{"$f":"[2]!Sound_speed(11,O59,O60)","v":321.86896646919303},{"$f":"[2]!Sound_speed(11,P59,P60)","v":296.65437078241479},{"$f":"[2]!Sound_speed(11,Q59,Q60)","v":269.78692631420131},{"$f":"[2]!Sound_speed(11,R59,R60)","v":266.30626118631369},{"$f":"[2]!Sound_speed(11,S59,S60)","v":262.79902273185087},{"$f":"[2]!Sound_speed(11,T59,T60)","v":259.26597126593077},{"$f":"[2]!Sound_speed(11,U59,U60)","v":255.7082371842408},{"$f":"[2]!Sound_speed(11,V59,V60)","v":252.12743427485526},{"$f":"[2]!Sound_speed(11,W59,W60)","v":248.52580938527777},{"$f":"[2]!Sound_speed(11,X59,X60)","v":244.90644535373434},{"$f":"[2]!Sound_speed(11,Y59,Y60)","v":241.27353631849809}]
[null,"S=Q/(rho*V) = cte",null,{"$f":"D58/(D72*D73)","v":4.4000208975996838E-2},null,null,null,4.5637959509947493E-2,4.562471825262969E-2,4.5606818768404042E-2,4.5566310619433219E-2,4.5524585590822612E-2,4.5463040746040469E-2,4.5368605600550373E-2,4.5216195901970214E-2,4.4953312288370871E-2,4.4456733334319987E-2,4.4365831312535478E-2,4.4265724852356053E-2,4.4155200897901904E-2,4.4032846984338521E-2,4.3897011694071418E-2,4.3745755874553281E-2,4.3576792280394398E-2,4.3387410501045019E-2]
[null,"Hin",null,{"$f":"[2]!H_(11,D59,D60)","v":105.90220745591094},null,null,null,{"$f":"[2]!H_(11,H59,H60)","v":348.53976600967707},{"$f":"[2]!H_(11,I59,I60)","v":323.28001922359067},{"$f":"[2]!H_(11,J59,J60)","v":298.15018908459007},{"$f":"[2]!H_(11,K59,K60)","v":260.73077905947883},{"$f":"[2]!H_(11,L59,L60)","v":235.9940165068642},{"$f":"[2]!H_(11,M59,M60)","v":211.45086092152738},{"$f":"[2]!H_(11,N59,N60)","v":187.12996531798069},{"$f":"[2]!H_(11,O59,O60)","v":163.06841047629896},{"$f":"[2]!H_(11,P59,P60)","v":139.31606808781771},{"$f":"[2]!H_(11,Q59,Q60)","v":115.94283288735825},{"$f":"[2]!H_(11,R59,R60)","v":113.05239757366947},{"$f":"[2]!H_(11,S59,S60)","v":110.16961290434323},{"$f":"[2]!H_(11,T59,T60)","v":107.29471079261661},{"$f":"[2]!H_(11,U59,U60)","v":104.42792571544564},{"$f":"[2]!H_(11,V59,V60)","v":101.56949201279384},{"$f":"[2]!H_(11,W59,W60)","v":98.719638849939315},{"$f":"[2]!H_(11,X59,X60)","v":95.878584353285547},{"$f":"[2]!H_(11,Y59,Y60)","v":93.046526993049937}]
[null,"Hout",null,{"$f":"[2]!H_(11,D61,D62)","v":73.764914852456329},null,null,null,{"$f":"[2]!H_(11,H61,H62)","v":272.389936497863},{"$f":"[2]!H_(11,I61,I62)","v":250.22043175502233},{"$f":"[2]!H_(11,J61,J62)","v":228.34315571869783},{"$f":"[2]!H_(11,K61,K62)","v":196.1611799682307},{"$f":"[2]!H_(11,L61,L62)","v":175.20166447644718},{"$f":"[2]!H_(11,M61,M62)","v":154.71313224336893},{"$f":"[2]!H_(11,N61,N62)","v":134.78044739590882},{"$f":"[2]!H_(11,O61,O62)","v":115.51566279874979},{"$f":"[2]!H_(11,P61,P62)","v":97.071172141392779},{"$f":"[2]!H_(11,Q61,Q62)","v":79.660912640038021},{"$f":"[2]!H_(11,R61,R62)","v":77.571374466220092},{"$f":"[2]!H_(11,S61,S62)","v":75.503349543810302},{"$f":"[2]!H_(11,T61,T62)","v":73.45759283029949},{"$f":"[2]!H_(11,U61,U62)","v":71.434890156220035},{"$f":"[2]!H_(11,V61,V62)","v":69.436057652324607},{"$f":"[2]!H_(11,W61,W62)","v":67.461939510332044},{"$f":"[2]!H_(11,X61,X62)","v":65.51340511006903},{"$f":"[2]!H_(11,Y61,Y62)","v":63.59134420154043}]
[null,"Sin = Sout",null,{"$f":"[2]!S_(11,D59,D60)","v":13.041567593259808},null,null,null,{"$f":"[2]!S_(11,H59,H60)","v":20.295345571907735},{"$f":"[2]!S_(11,I59,I60)","v":19.880505013610161},{"$f":"[2]!S_(11,J59,J60)","v":19.430838647969683},{"$f":"[2]!S_(11,K59,K60)","v":18.676828730365838},{"$f":"[2]!S_(11,L59,L60)","v":18.108415649778841},{"$f":"[2]!S_(11,M59,M60)","v":17.473335244686407},{"$f":"[2]!S_(11,N59,N60)","v":16.754355698754644},{"$f":"[2]!S_(11,O59,O60)","v":15.926797440588436},{"$f":"[2]!S_(11,P59,P60)","v":14.953718445589042},{"$f":"[2]!S_(11,Q59,Q60)","v":13.776717910825422},{"$f":"[2]!S_(11,R59,R60)","v":13.610982125704078},{"$f":"[2]!S_(11,S59,S60)","v":13.440358212124927},{"$f":"[2]!S_(11,T59,T60)","v":13.264571284703859},{"$f":"[2]!S_(11,U59,U60)","v":13.083324102877413},{"$f":"[2]!S_(11,V59,V60)","v":12.896294702713062},{"$f":"[2]!S_(11,W59,W60)","v":12.70313363203895},{"$f":"[2]!S_(11,X59,X60)","v":12.503460841681411},{"$f":"[2]!S_(11,Y59,Y60)","v":12.296862069730325}]
[null,"Tout(iso)",null,{"$f":"[1]!HeCalc(2,0,1,D61*10^5,8,D77*1000,1)","v":9.7639107105745424},null,null,null,{"$f":"[1]!HeCalc(2,0,1,H61*10^5,8,H77*1000,1)","v":35.947103438643005},{"$f":"[1]!HeCalc(2,0,1,I61*10^5,8,I77*1000,1)","v":33.197752244297476},{"$f":"[1]!HeCalc(2,0,1,J61*10^5,8,J77*1000,1)","v":30.456638271221998},{"$f":"[1]!HeCalc(2,0,1,K61*10^5,8,K77*1000,1)","v":26.363826148126638},{"$f":"[1]!HeCalc(2,0,1,L61*10^5,8,L77*1000,1)","v":23.650965006561574},{"$f":"[1]!HeCalc(2,0,1,M61*10^5,8,M77*1000,1)","v":20.954167971623924},{"$f":"[1]!HeCalc(2,0,1,N61*10^5,8,N77*1000,1)","v":18.277902606733804},{"$f":"[1]!HeCalc(2,0,1,O61*10^5,8,O77*1000,1)","v":15.628888838466809},{"$f":"[1]!HeCalc(2,0,1,P61*10^5,8,P77*1000,1)","v":13.017937656422019},{"$f":"[1]!HeCalc(2,0,1,Q61*10^5,8,Q77*1000,1)","v":10.464112510387567},{"$f":"[1]!HeCalc(2,0,1,R61*10^5,8,R77*1000,1)","v":10.150457262628809},{"$f":"[1]!HeCalc(2,0,1,S61*10^5,8,S77*1000,1)","v":9.8383432454338173},{"$f":"[1]!HeCalc(2,0,1,T61*10^5,8,T77*1000,1)","v":9.5278899343344516},{"$f":"[1]!HeCalc(2,0,1,U61*10^5,8,U77*1000,1)","v":9.2192311353453924},{"$f":"[1]!HeCalc(2,0,1,V61*10^5,8,V77*1000,1)","v":8.9125174281755406},{"$f":"[1]!HeCalc(2,0,1,W61*10^5,8,W77*1000,1)","v":8.60791903177401},{"$f":"[1]!HeCalc(2,0,1,X61*10^5,8,X77*1000,1)","v":8.3056294361162006},{"$f":"[1]!HeCalc(2,0,1,Y61*10^5,8,Y77*1000,1)","v":8.0058698488834654}]
[null,"Hout(iso)",null,{"$f":"[2]!H_(11,D61,D78)","v":63.616296135548602},null,null,null,{"$f":"[2]!H_(11,H61,H78)","v":201.89811018180592},{"$f":"[2]!H_(11,I61,I78)","v":187.56369227374427},{"$f":"[2]!H_(11,J61,J78)","v":173.26101469635464},{"$f":"[2]!H_(11,K61,K78)","v":151.87699640853057},{"$f":"[2]!H_(11,L61,L78)","v":137.67664749115869},{"$f":"[2]!H_(11,M61,M78)","v":123.53035624114978},{"$f":"[2]!H_(11,N61,N78)","v":109.44931246902843},{"$f":"[2]!H_(11,O61,O78)","v":95.448988006120203},{"$f":"[2]!H_(11,P61,P78)","v":81.551760392302825},{"$f":"[2]!H_(11,Q61,Q78)","v":67.791325015262842},{"$f":"[2]!H_(11,R61,R78)","v":66.083183908450238},{"$f":"[2]!H_(11,S61,S78)","v":64.378053563796058},{"$f":"[2]!H_(11,T61,T78)","v":62.676050823471002},{"$f":"[2]!H_(11,U61,U78)","v":60.977292048737773},{"$f":"[2]!H_(11,V61,V78)","v":59.281890722395282},{"$f":"[2]!H_(11,W61,W78)","v":57.589953437119739},{"$f":"[2]!H_(11,X61,X78)","v":55.90157498040211},{"$f":"[2]!H_(11,Y61,Y78)","v":54.216831232741818}]
[null,"ΔHs",null,{"$f":"D75-D79","v":42.285911320362338},null,null,null,146.64165582787115,135.7163269498464,124.88917438823543,108.85378265094826,98.317369015705509,87.920504680377604,77.680652848952263,67.619422470178762,57.764307695514887,48.151507872095408,46.969213665219229,45.791559340547167,44.618659969145611,43.450633666707866,42.287601290398563,41.129685412819576,39.977009372883437,38.82969576030812]
[null,"u1","m/s",{"$f":"(2*52.7%*D80*1000*D63)^0.5","v":184.04539223806461},null,null,null,{"$f":"PI()*$D$82*H65","v":184.04539223806461},184.04539223806461,184.04539223806461,184.04539223806461,184.04539223806461,184.04539223806461,184.04539223806461,184.04539223806461,184.04539223806461,{"$f":"PI()*$D$82*Q65","v":184.04539223806461},{"$f":"PI()*$D$82*R65","v":184.04539223806461},184.04539223806461,184.04539223806461,184.04539223806461,184.04539223806461,184.04539223806461,184.04539223806461,184.04539223806461]
[null,"D1",null,{"$f":"D81/PI()/D65","v":3.9160072096222902E-2}]
[null,"Co = (2*ΔHs)^0,5",null,{"$f":"(2000*D80)^0.5","v":290.81234953269205},null,null,null,541.55637901860439,520.99199024523671,499.77829962541477,466.59143294953083,443.43515651266421,419.33400692139816,394.15898530656955,367.74834457867723,339.89500642261544,310.32727199553506,306.49376393401292,302.62702899954974,298.7261621256016,294.79020901891522,290.81816067913832,286.80894481455624,282.76141664973824,278.67434672143082]
[null,"u1/Co",null,{"$f":"D81/D83","v":0.6328664946100403},null,null,null,0.33984530395817197,0.35325954272623733,0.36825406860603421,0.39444657411438583,0.41504465655241385,0.43889927647237753,0.46693187038452899,0.50046558999177049,0.54147718783849386,0.59306870148593527,0.60048658046331072,0.60815913517869691,0.61610068207109814,0.62432667913422912,0.63285384863266214,0.64170032199331828,0.65088580478448022,0.66043177064317493]
[null,"U1/C0 off de / U1/C0 nom",null,{"$f":"D84/$D$49","v":0.98709623358564935},null,null,null,{"$f":"H84/$D84","v":0.53699367378830487},{"$f":"I84/$D84","v":0.5581896746546976},0.58188270629328387,0.62326980093556061,0.65581708004332906,0.69351005340047034,0.73780469397774495,0.79079172977888079,0.85559465139980473,0.93711502589716389,0.94883610615745828,0.96095960263061864,0.97350813689501303,0.98650613431340961,0.99998001793824476,1.0139584374564199,1.0284725298746351,1.0435562259463897]
[null,"Rdt",null,{"$f":"(0.321*D85^4-1.6098*D85^3+1.316*D85^2+0.9448*D85)*($D63/0.97215493)","v":0.75935604730996153},null,null,null,{"$f":"(0.321*H85^4-1.6098*H85^3+1.316*H85^2+0.9448*H85)*($D63/0.97215493)","v":0.51929193708231935},{"$f":"(0.321*I85^4-1.6098*I85^3+1.316*I85^2+0.9448*I85)*($D63/0.97215493)","v":0.53832570561364601},0.55895183636083101,0.59317735698995133,0.61832769366220386,0.64532987935431363,0.67390677089009465,0.70324096155243965,0.73133216049441052,0.75349499632897088,0.75541020039948259,0.75704483227416264,0.75836248748235957,0.75932231074780865,0.75987838961674159,0.75997905272047361,0.75956605357811835,0.75857361781388766]
[]
[null,"TURBINE 3"]
[]
[null,null,null,"DESIGN",null,{"$f":"F56","v":0},{"$f":"G56","v":0},{"$f":"H56","v":"start-up"},{"$f":"I56","v":"start-up"}]
[]
[null,"m","g/s",399.8,null,{"$f":"F105/(F95*F94)^0.5*F93","v":161.47618188513178},{"$f":"G105/(G95*G94)^0.5*G93","v":95.080415199611181},{"$error":"#DIV/0!"},117.10102732642108]
[null,"Pin","Bara",13.07,null,13.07,7.3689999999999998,null,10.48]
[null,"Tin","K",7.2919999999999998,null,9.16,7.9119999999999999,null,10.55]
[null,"Pout","Bara",4.88,null,4.88,5.18,null,5.18]
[null,"Tout","K",{"$f":"[2]!T2_turb(11,D93,D94,D95,D97)","v":6.1198408797506243},null,{"$f":"[2]!T2_turb(11,F93,F94,F95,F97)","v":7.0494463059442776},{"$f":"[2]!T2_turb(11,G93,G94,G95,G97)","v":7.1447253899950391},{"$f":"[2]!T2_turb(11,H93,H94,H95,H97)","v":{"$error":"#VALUE!"}},{"$f":"[2]!T2_turb(11,I93,I94,I95,I97)","v":8.6903815136344829}]
[null,"Efficacity","%",0.72,null,{"$f":"(0.321*F119^4-1.6098*F119^3+1.316*F119^2+0.9448*F119)*($D$97/0.97215493)","v":0.58179731360313081},{"$f":"(0.321*G119^4-1.6098*G119^3+1.316*G119^2+0.9448*G119)*($D$97/0.97215493)","v":0.582724483494652},{"$f":"(0.321*H119^4-1.6098*H119^3+1.316*H119^2+0.9448*H119)*($D$97/0.97215493)","v":{"$error":"#VALUE!"}},{"$f":"(0.321*I119^4-1.6098*I119^3+1.316*I119^2+0.9448*I119)*($D$97/0.97215493)","v":0.50201641458397539}]
[null,"Power","W",{"$f":"+D92*(D109-D110)","v":2075.5404202052005},null,954.74184184263254,182.5140950412455,{"$error":"#DIV/0!"},610.67834348723773]
[null,"Speed","Hz",2076,null,1602.552519659416,914.20818650847264,862.66257848011605,1367.3629344539765]
[null,null,null,null,null,{"$f":"(F98/$D98*$D102/F102)^(1/3)*$D99","v":1602.5525123839127},{"$f":"(G98/$D98*$D102/G102)^(1/3)*$D99","v":914.20817108894096},{"$f":"(H98/$D98*$D102/H102)^(1/3)*$D99","v":{"$error":"#DIV/0!"}},{"$f":"(I98/$D98*$D102/I102)^(1/3)*$D99","v":1367.3629301538849}]
[null,null,null,null,null,{"$f":"F99-F100","v":7.2755033215798903E-6},{"$f":"G99-G100","v":1.5419531678162457E-5},{"$f":"H99-H100","v":{"$error":"#DIV/0!"}},{"$f":"I99-I100","v":4.300091632103431E-6}]
[null,"Brake Pressure",null,10.1,null,{"$f":"($D102-$D95)+F95","v":10.1},{"$f":"($D102-$D95)+G95","v":10.399999999999999},{"$f":"($D102-$D95)+H95","v":5.22},{"$f":"($D102-$D95)+I95","v":10.399999999999999}]
[null,"Rho (brake)",null,{"$f":"[2]!rho_(11,D102,330)","v":1.4673342046153373},null,{"$f":"[2]!rho_(11,F102,330)","v":1.4673342046153373},{"$f":"[2]!rho_(11,G102,330)","v":1.5107331217743123},{"$f":"[2]!rho_(11,H102,330)","v":0.75987987169063398},{"$f":"[2]!rho_(11,I102,330)","v":1.5107331217743123}]
[null,"Wheel","mm",29.5,null,{"$f":"$D$104","v":29.5},{"$f":"$D$104","v":29.5},{"$f":"$D$104","v":29.5},{"$f":"$D$104","v":29.5}]
[null,"a = mÖT/P",null,{"$f":"D92*D94^0.5/D93","v":82.601994178997316},null,{"$f":"$D$105","v":82.601994178997316},{"$f":"$D$105","v":82.601994178997316},82.601994178997316,82.601994178997316]
[null,"Rho (in)","kg/m3",{"$f":"[2]!rho_(11,D93,D94)","v":122.0413850208848},null,{"$f":"[2]!rho_(11,F93,F94)","v":92.042022544510019},{"$f":"[2]!rho_(11,G93,G94)","v":70.649649504414128},{"$f":"[2]!rho_(11,H93,H94)","v":"NUM"},{"$f":"[2]!rho_(11,I93,I94)","v":58.789985568547117}]
[null,"Sound Speed",null,{"$f":"[2]!Sound_speed(11,D93,D94)","v":249.05671288435045},null,{"$f":"[2]!Sound_speed(11,F93,F94)","v":219.03534618547846},{"$f":"[2]!Sound_speed(11,G93,G94)","v":170.78644408370695},{"$f":"[2]!Sound_speed(11,H93,H94)","v":"NUM"},{"$f":"[2]!Sound_speed(11,I93,I94)","v":204.26692373410398}]
[null,"S=Q/(rho*V) = cte",null,{"$f":"D92/(D106*D107)","v":1.3153381307708404E-2},null,8.0095499679843866E-3,7.8800262035761022E-3,{"$error":"#DIV/0!"},9.7512278209034905E-3]
[null,"Hin",null,{"$f":"[2]!H_(11,D93,D94)","v":28.150884578454882},null,{"$f":"[2]!H_(11,F93,F94)","v":40.890140453818937},{"$f":"[2]!H_(11,G93,G94)","v":36.811643961665368},{"$f":"[2]!H_(11,H93,H94)","v":{"$error":"#VALUE!"}},{"$f":"[2]!H_(11,I93,I94)","v":54.059832308617963}]
[null,"Hout",null,{"$f":"[2]!H_(11,D95,D96)","v":22.959437804554931},null,{"$f":"[2]!H_(11,F95,F96)","v":34.977554271159498},{"$f":"[2]!H_(11,G95,G96)","v":34.892067835939827},{"$f":"[2]!H_(11,H95,H96)","v":{"$error":"#VALUE!"}},{"$f":"[2]!H_(11,I95,I96)","v":48.844862317065612}]
[null,"Sin = Sout",null,{"$f":"[2]!S_(11,D93,D94)","v":5.0600046690749361},null,{"$f":"[2]!S_(11,F93,F94)","v":6.606972813997622},{"$f":"[2]!S_(11,G93,G94)","v":6.9458302073485418},{"$f":"[2]!S_(11,H93,H94)","v":{"$error":"#VALUE!"}},{"$f":"[2]!S_(11,I93,I94)","v":8.3000204511344844}]
[null,"Tout(iso)",null,{"$f":"[1]!HeCalc(2,0,1,D95*10^5,8,D111*1000,1)","v":5.9351387842537191},null,{"$f":"[1]!HeCalc(2,0,1,F95*10^5,8,F111*1000,1)","v":6.6999950291002683},{"$f":"[1]!HeCalc(2,0,1,G95*10^5,8,G111*1000,1)","v":7.0241819850115181},{"$f":"[1]!HeCalc(2,0,1,H95*10^5,8,H111*1000,1)","v":{"$error":"#VALUE!"}},{"$f":"[1]!HeCalc(2,0,1,I95*10^5,8,I111*1000,1)","v":8.0488946725573083}]
[null,"Hout(iso)",null,{"$f":"[2]!H_(11,D95,D112)","v":20.940541836947467},null,{"$f":"[2]!H_(11,F95,F112)","v":30.727518437529557},{"$f":"[2]!H_(11,G95,G112)","v":33.517503797489027},{"$f":"[2]!H_(11,H95,H112)","v":{"$error":"#VALUE!"}},{"$f":"[2]!H_(11,I95,I112)","v":43.671785543492518}]
[null,"ΔHs",null,{"$f":"D109-D113","v":7.2103427415074144},null,10.162622016289379,3.2941401641763406,{"$error":"#VALUE!"},10.388046765125445]
[null,"u1","m/s",{"$f":"(2*52.7%*D114*1000*D97)^0.5","v":73.971514109656738},null,{"$f":"PI()*$D$116*F99","v":57.101751598965535},{"$f":"PI()*$D$116*G99","v":32.574838038282842},30.738177791866459,48.72153497060885]
[null,"D1",null,{"$f":"D115/PI()/D99","v":1.1341938457171245E-2},null,null,null,null,null,null,null,null,"T3"]
[null,"Co = (2*ΔHs)^0,5",null,{"$f":"(2000*D114)^0.5","v":120.0861585821398},null,142.56663015088333,81.16822240478524,{"$error":"#VALUE!"},144.13914641848999,null,null,"MAX",{"$f":"ROUND(F92,0)&\"g/s @ \"&F93&\" b ; \"&F94&\"K\"","v":"161g/s @ 13,07 b ; 9,16K"}]
[null,"u1/Co",null,{"$f":"D115/D117","v":0.61598701285010871},null,0.40052676799986592,0.40132501455843644,{"$error":"#VALUE!"},0.33801736850273811,null,null,"MIN",{"$f":"ROUND(G92,0)&\"g/s @ \"&G93&\" b ; \"&G94&\"K\"","v":"95g/s @ 7,369 b ; 7,912K"}]
[null,"U1/C0 off de / U1/C0 nom",null,{"$f":"D118/$D$49","v":0.96076892283052273},null,{"$f":"F118/$D118","v":0.65021950080841751},{"$f":"G118/$D118","v":0.65151538293242062},{"$f":"H118/$D118","v":{"$error":"#VALUE!"}},{"$f":"I118/$D118","v":0.54874106344996854},null,null,"STS",{"$f":"ROUND(H92,0)&\"g/s @ \"&H93&\" b ; \"&H94&\"K\"","v":{"$error":"#DIV/0!"}}]
[null,"Rdt",null,{"$f":"(0.321*D119^4-1.6098*D119^3+1.316*D119^2+0.9448*D119)*($D97/0.97215493)","v":0.7171786087866604},null,{"$f":"(0.321*F119^4-1.6098*F119^3+1.316*F119^2+0.9448*F119)*($D97/0.97215493)","v":0.58179731360313081},{"$f":"(0.321*G119^4-1.6098*G119^3+1.316*G119^2+0.9448*G119)*($D97/0.97215493)","v":0.582724483494652},{"$f":"(0.321*H119^4-1.6098*H119^3+1.316*H119^2+0.9448*H119)*($D97/0.97215493)","v":{"$error":"#VALUE!"}},{"$f":"(0.321*I119^4-1.6098*I119^3+1.316*I119^2+0.9448*I119)*($D97/0.97215493)","v":0.50201641458397539},null,null,"BAKING",{"$f":"ROUND(I92,0)&\"g/s @ \"&I93&\" b ; \"&I94&\"K\"","v":"117g/s @ 10,48 b ; 10,55K"}]
[]
[null,null,null,null,null,null,null,null,null,null,null,null,{"$f":"M47","v":0},{"$f":"M116","v":"T3"},"T1+T2"]
[null,"Courbe de rendement TC3",null,null,null,null,null,null,null,null,null,{"$f":"L117","v":"MAX"},{"$f":"M48","v":427.56997644068093},{"$f":"M117","v":"161g/s @ 13,07 b ; 9,16K"},{"$f":"F92+F58","v":161.47618188513178}]
[null,null,null,null,null,null,null,null,null,null,null,{"$f":"L118","v":"MIN"},{"$f":"M49","v":0.52406397702634178},{"$f":"M118","v":"95g/s @ 7,369 b ; 7,912K"},{"$f":"G92+G58","v":95.080415199611181}]
[null,null,null,null,null,null,null,null,null,null,null,{"$f":"L119","v":"STS"},{"$f":"M50","v":0.81739447780273011},{"$f":"M119","v":{"$error":"#DIV/0!"}},{"$f":"H92+H58","v":{"$error":"#DIV/0!"}}]
[null,null,null,null,null,null,null,null,null,null,null,{"$f":"L120","v":"BAKING"},{"$f":"M51","v":0.73631628203786348},{"$f":"M120","v":"117g/s @ 10,48 b ; 10,55K"},{"$f":"I92+I58","v":199.10305190264501}]
[null,null,null,null,"d : mm"]
[null,null,null,null,"N : Hz"]
[null,null,null,null,"H : J/kG"]
[]
[]
[]
[]
[]
[null,"rendement=(0,321*rap^4 - 1,6098*rap^3 + 1,316*rap^2 + 0,9448*rap)*(ETAgar/0,97)",null,null,null,null,null,null,"U1/CO _nom",0.64]
[null,null,null,null,null,null,null,null,"Eta_gar",0.8]
[null,"U1/C0",{"$f":"D28","v":0.78},{"$f":"D63","v":0.76},{"$f":"D97","v":0.72}]
[null,0,{"$f":"(0.321*B138^4-1.6098*B138^3+1.316*B138^2+0.9448*B138)*$D$28/0.97215493","v":0}]
[null,{"$f":"B138+0.05","v":0.05},{"$f":"(0.321*$B139^4-1.6098*$B139^3+1.316*$B139^2+0.9448*$B139)*$C$137/0.97215493","v":4.0382461852042459E-2},{"$f":"(0.321*$B139^4-1.6098*$B139^3+1.316*$B139^2+0.9448*$B139)*$D$137/0.97215493","v":3.9347014112246496E-2},{"$f":"(0.321*$B139^4-1.6098*$B139^3+1.316*$B139^2+0.9448*$B139)*$E$137/0.97215493","v":3.7276118632654578E-2}]
[null,0.1,{"$f":"(0.321*$B140^4-1.6098*$B140^3+1.316*$B140^2+0.9448*$B140)*$C$137/0.97215493","v":8.5098158171146673E-2},{"$f":"(0.321*$B140^4-1.6098*$B140^3+1.316*$B140^2+0.9448*$B140)*$D$137/0.97215493","v":8.2916154115476232E-2},{"$f":"(0.321*$B140^4-1.6098*$B140^3+1.316*$B140^2+0.9448*$B140)*$E$137/0.97215493","v":7.8552146004135376E-2}]
[null,0.15000000000000002,0.13323633134792623,0.12982001515951785,0.12298738278270113]
[null,0.2,0.18392485650409657,0.17920883454245307,0.16977679061916603]
[null,0.25,0.23633024149247489,0.23027049171061653,0.21815099214689987]
[null,0.3,0.28965762689698032,0.28223050825859619,0.26737627098182798]
[null,0.35,0.34315078603263366,0.33435204792923284,0.3167545717224311]
[null,0.39999999999999997,0.39609212494555779,0.38593591661362037,0.36562349994974563]
[null,0.44999999999999996,0.4478026824129771,0.43632056235110589,0.41335632222736346]
[null,0.49999999999999994,0.49764212994321799,0.48488207532928934,0.45936196610143198]
[null,0.54999999999999993,0.54500877177570861,0.53103418788402379,0.50308502010065403]
[null,0.6,0.58933954488097895,0.57422827449941549,0.54400573373628835]
[null,0.65,0.63011001896066099,0.61395335180782351,0.58164001750214867]
[null,0.70000000000000007,0.66683439644748832,0.64973607858986027,0.61553944287460449]
[null,0.75000000000000011,0.69906551250529614,0.68114075577439104,0.64529124231258095]
[null,0.80000000000000016,0.7263948350290218,0.70776932643853407,0.67051830925755851]
[null,0.8500000000000002,0.74845246464470438,0.72926137580766071,0.69087919813357312]
[null,0.90000000000000024,0.76490713470948513,0.74529413125539579,0.70606812434721711]
[null,0.95000000000000029,0.77546621131160665,0.7555824623036167,0.71581496428763691]
[null,1.0000000000000002,0.77987569327041351,0.75987888062245412,0.71988525532653547]
[null,1.0500000000000003,0.77792021213635165,0.75797354003029138,0.71808019581817073]
[null,1.1000000000000003,0.76942303219096997,0.74969423649376565,0.7102366450993568]
[null,1.1500000000000004,0.75424605044691839,0.73490640812776653,0.69622712348946292]
[null,1.2000000000000004,0.7322897966479478,0.71351313519543635,0.67595981229041324,null,"F Let u be the peripheral speed of the wheel : u = p . Æ . N / 60                      (in m/s)"]
[null,1.2500000000000004,0.70349343326891334,0.68545514010817188,0.64937855378668918,null,"F Let n, be the speed ratio of the turbine : n =  u / [ 2 . (H1 - H2S ) ] 0.5       (dimensionless number)"]
[null,1.3000000000000005,0.66783475551576954,0.65071078742562172,0.61646285124532574,null,null,"N = speed of rotation of the turbine (in rpm)"]
[null,1.3500000000000005,0.62533019132557388,0.60929608385568745,0.57722786891591438,null,null,"Æ = diameter of the wheel of the turbine (in m)"]
[null,1.4000000000000006,0.57603480136648577,0.56126467825452464,0.53172443203060227]
[null,1.4500000000000006,0.5200422790377659,0.50670786162654113,0.48003902680409161]
[null,1.5000000000000007,0.45748495046977738,0.44575456712439848,0.42229380043364062]

{"sheet":"Turbines_JT60SA (2)","index":5,"n_rows":159,"n_cols":15,"rows_kept":159,"cut":false,"hidden":false,"merged":[]}
[]
[]
[]
[]
[null,null,null,null,"Vitesse de la roue ajustée en fonction de la puissance du frein",null,null,null,null,null,null,{"$f":"D56*0.3","v":448.8}]
[]
[]
[null,"Relation entre la puissance et la vitesse de rotation",null,null,null,null,null,null,null,null,null,null,"²"]
[]
[null,"TURBINE 1"]
[]
[null,null,null,"DESIGN",null,"D3","STS","test",{"$f":"L42","v":"BAKING"}]
[]
[null,"m","g/s",191.5,null,{"$f":"F27/(F17*F16)^0.5*F15","v":67.345412094718213},{"$f":"G27/(G17*G16)^0.5*G15","v":69.557933504226568},76.159281124200461,61.809582516086259]
[null,"Pin","Bara",14.77,null,14.77,12.39,8,9.25]
[null,"Tin","K",40.03,null,50.44,40.729999999999997,55,37.119999999999997]
[null,"Pout","Bara",6.36,null,6.4169999999999998,5.242,1.35,4.0599999999999996]
[null,"Tout","K",{"$f":"[2]!T2_turb(11,D15,D16,D17,D19)","v":31.094586910112792},null,{"$f":"[2]!T2_turb(11,F15,F16,F17,F19)","v":41.7925989903474},{"$f":"[2]!T2_turb(11,G15,G16,G17,G19)","v":32.514839363849774},{"$f":"[2]!T2_turb(11,H15,H16,H17,H19)","v":46.315036459366233},{"$f":"[2]!T2_turb(11,I15,I16,I17,I19)","v":29.372250640597315}]
[null,"Efficacity","%",0.78,null,{"$f":"(0.321*F41^4-1.6098*F41^3+1.316*F41^2+0.9448*F41)*($D$19/0.97215493)","v":0.60962117374688851},{"$f":"(0.321*G41^4-1.6098*G41^3+1.316*G41^2+0.9448*G41)*($D$19/0.97215493)","v":0.69285540878309548},{"$f":"(0.321*H41^4-1.6098*H41^3+1.316*H41^2+0.9448*H41)*($D$19/0.97215493)","v":0.31442797350118995},{"$f":"(0.321*I41^4-1.6098*I41^3+1.316*I41^2+0.9448*I41)*($D$19/0.97215493)","v":0.74204227260897582}]
[null,"Power","W",{"$f":"+D14*(D31-D32)","v":9122.4436160855366},null,3130.6844311015102,3033.7443419532642,3519.2480229703187,2521.103291214944]
[null,"Speed","Hz",1995,null,1391.6843277296848,1498.3350869984386,1000,1578.7177791475433]
[null,"Speed calculated from P=K.rho.N^3",null,null,null,{"$f":"(F20/$D20*$D24/F24)^(1/3)*$D21","v":1391.6842880827912},{"$f":"(G20/$D20*$D24/G24)^(1/3)*$D21","v":1498.335070864048},{"$f":"(H20/$D20*$D24/H24)^(1/3)*$D21","v":4376.6220436959629},{"$f":"(I20/$D20*$D24/I24)^(1/3)*$D21","v":1578.7177763051557}]
[null,null,null,null,null,{"$f":"F21-F22","v":3.9646893583267229E-5},{"$f":"G21-G22","v":1.6134390534716658E-5},{"$f":"H21-H22","v":-3376.6220436959629},{"$f":"I21-I22","v":2.8423876301530981E-6}]
[null,"Brake Pressure",null,5.2,null,{"$f":"($D24-$D17)+F17","v":5.2569999999999997},{"$f":"($D24-$D17)+G17","v":4.0819999999999999},{"$f":"($D24-$D17)+H17","v":0.18999999999999995},{"$f":"($D24-$D17)+I17","v":2.8999999999999995}]
[null,"Rho (brake)",null,{"$f":"[2]!rho_(11,D24,330)","v":0.75697464940773784},null,{"$f":"[2]!rho_(11,F24,330)","v":0.76525440749261975},{"$f":"[2]!rho_(11,G24,330)","v":0.59449703414110489},{"$f":"[2]!rho_(11,H24,330)","v":2.7715477303010091E-2},{"$f":"[2]!rho_(11,I24,330)","v":0.42255652641901498}]
[null,"Wheel","mm",35.799999999999997,null,{"$f":"$D$26","v":35.799999999999997},{"$f":"$D$26","v":35.799999999999997},{"$f":"$D$26","v":35.799999999999997},{"$f":"$D$26","v":35.799999999999997}]
[null,"a = mÖT/P",null,{"$f":"D14*D16^0.5/D15","v":82.031580287488268},null,{"$f":"+$D$27","v":82.031580287488268},{"$f":"+$D$27","v":82.031580287488268},{"$f":"+$D$27","v":82.031580287488268},{"$f":"+$D$27","v":82.031580287488268}]
[null,"Rho (in)","kg/m3",{"$f":"[2]!rho_(11,D15,D16)","v":17.087672541642732},null,{"$f":"[2]!rho_(11,F15,F16)","v":13.60304093359863},{"$f":"[2]!rho_(11,G15,G16)","v":14.178141597167654},{"$f":"[2]!rho_(11,H15,H16)","v":6.8737083497099274},{"$f":"[2]!rho_(11,I15,I16)","v":11.708162912666104}]
[null,"Sound Speed @inlet",null,{"$f":"[2]!Sound_speed(11,D15,D16)","v":391.2334216977045},null,{"$f":"[2]!Sound_speed(11,F15,F16)","v":435.3518858856504},{"$f":"[2]!Sound_speed(11,G15,G16)","v":391.28919888209964},{"$f":"[2]!Sound_speed(11,H15,H16)","v":445.49229392998768},{"$f":"[2]!Sound_speed(11,I15,I16)","v":370.51577371924787}]
[null,"S=Q/(rho*V) = cte",null,{"$f":"D14/(D28*D29)","v":2.8645071953707371E-2},null,1.1371861972371593E-2,1.2538035694620982E-2,2.4870902148344934E-2,1.4248211455909057E-2]
[null,"Hin",null,{"$f":"[2]!H_(11,D15,D16)","v":223.57106614117126},null,{"$f":"[2]!H_(11,F15,F16)","v":279.05861768841004},{"$f":"[2]!H_(11,G15,G16)","v":227.21274224322462},{"$f":"[2]!H_(11,H15,H16)","v":302.11378504089129},{"$f":"[2]!H_(11,I15,I16)","v":207.89085729231627}]
[null,"Hout",null,{"$f":"[2]!H_(11,D17,D18)","v":175.9342848561293},null,{"$f":"[2]!H_(11,F17,F18)","v":232.57164353940124},{"$f":"[2]!H_(11,G17,G18)","v":183.59810061835628},{"$f":"[2]!H_(11,H17,H18)","v":255.90473512573868},{"$f":"[2]!H_(11,I17,I18)","v":167.10263015037086}]
[null,"Sin = Sout",null,{"$f":"[2]!S_(11,D15,D16)","v":15.488244062210457},null,{"$f":"[2]!S_(11,F15,F16)","v":16.720664436151374},{"$f":"[2]!S_(11,G15,G16)","v":15.956591869557485},{"$f":"[2]!S_(11,H15,H16)","v":18.465694482536527},{"$f":"[2]!S_(11,I15,I16)","v":16.084358655112414}]
[null,"Tout(iso)",null,{"$f":"[1]!HeCalc(2,0,1,D17*10^5,8,D33*1000,1)","v":28.580768861485691},null,{"$f":"[1]!HeCalc(2,0,1,F17*10^5,8,F33*1000,1)","v":36.153868894880652},{"$f":"[1]!HeCalc(2,0,1,G17*10^5,8,G33*1000,1)","v":28.875086473743544},{"$f":"[1]!HeCalc(2,0,1,H17*10^5,8,H33*1000,1)","v":26.999291724623038},{"$f":"[1]!HeCalc(2,0,1,I17*10^5,8,I33*1000,1)","v":26.699737772795068}]
[null,"Hout(iso)",null,{"$f":"[2]!H_(11,D17,D34)","v":162.49826962188638},null,{"$f":"[2]!H_(11,F17,F34)","v":202.80310664162681},{"$f":"[2]!H_(11,G17,G34)","v":164.26361740133086},{"$f":"[2]!H_(11,H17,H34)","v":155.15151129466645},{"$f":"[2]!H_(11,I17,I34)","v":152.92333233105427}]
[null,"ΔHs",null,{"$f":"D31-D35","v":61.072796519284879},null,76.255511046783226,62.949124841893763,146.96227374622484,54.967524961262001]
[null,"u1","m/s",{"$f":"(2*52.7%*D36*1000*D19)^0.5","v":224.07402231056255},null,{"$f":"PI()*$D$38*F21","v":156.31092987516874},{"$f":"PI()*$D$38*G21","v":168.28970912921642},{"$f":"PI()*$D$38*H21","v":112.3178056694549},{"$f":"PI()*$D$38*I21","v":177.31811672520718}]
[null,"D1",null,{"$f":"D37/PI()/D21","v":3.5751867939057311E-2},null,null,null,null,null,null,null,null,"T1"]
[null,"Co = (2*ΔHs)^0,5",null,{"$f":"(2000*D36)^0.5","v":349.49333761685608},null,390.52659588505168,354.82143351802682,542.14808631263259,331.56454865157707,null,null,"MAX",{"$f":"ROUND(F14,0)&\"g/s @ \"&F15&\" b ; \"&F16&\"K\"","v":"67g/s @ 14,77 b ; 50,44K"}]
[null,"u1/Co",null,{"$f":"D37/D39","v":0.64113961038138956},null,0.40025681098855964,0.4742940905813865,0.20717181984976377,0.53479214664635644,null,null,"MIN",{"$f":"ROUND(G14,0)&\"g/s @ \"&G15&\" b ; \"&G16&\"K\"","v":"70g/s @ 12,39 b ; 40,73K"}]
[null,"U1/C0 off de / U1/C0 nom",null,{"$f":"D40/$D$40","v":1},null,{"$f":"F40/$D40","v":0.62428963131830539},{"$f":"G40/$D40","v":0.73976725646267116},{"$f":"H40/$D40","v":0.32313058886897528},{"$f":"I40/$D40","v":0.83412744741855671},null,null,"STS",{"$f":"ROUND(H14,0)&\"g/s @ \"&H15&\" b ; \"&H16&\"K\"","v":"76g/s @ 8 b ; 55K"}]
[null,"Rdt",null,{"$f":"(0.321*D41^4-1.6098*D41^3+1.316*D41^2+0.9448*D41)*($D19/0.97215493)","v":0.77987569327041328},null,{"$f":"(0.321*F41^4-1.6098*F41^3+1.316*F41^2+0.9448*F41)*($D19/0.97215493)","v":0.60962117374688851},{"$f":"(0.321*G41^4-1.6098*G41^3+1.316*G41^2+0.9448*G41)*($D19/0.97215493)","v":0.69285540878309548},{"$f":"(0.321*H41^4-1.6098*H41^3+1.316*H41^2+0.9448*H41)*($D19/0.97)","v":0.31512649955576411},{"$f":"(0.321*I41^4-1.6098*I41^3+1.316*I41^2+0.9448*I41)*($D19/0.97215493)","v":0.74204227260897582},null,null,"BAKING",{"$f":"ROUND(I14,0)&\"g/s @ \"&I15&\" b ; \"&I16&\"K\"","v":"62g/s @ 9,25 b ; 37,12K"}]
[]
[]
[null,"TURBINE 2"]
[]
[null,null,null,"DESIGN",null,{"$f":"F12","v":"D3"},{"$f":"G12","v":"STS"},{"$f":"H12","v":"test"},{"$f":"I12","v":"BAKING"}]
[]
[null,"m","g/s",191.20000000000002,null,{"$f":"F62/(F52*F51)^0.5*F50","v":149.23747011578729},{"$f":"G62/(G52*G51)^0.5*G50","v":141.71734668092299},{"$f":"H62/(H52*H51)^0.5*H50","v":27.965429571357426},{"$f":"I62/(I52*I51)^0.5*I50","v":109.09228329173929}]
[null,"Pin","Bara",6.3070000000000004,null,6.4169999999999998,5.242,1.35,4.0599999999999996]
[null,"Tin","K",18.21,null,22.92,17.75,30,17.170000000000002]
[null,"Pout","Bara",1.35,null,1.35,1.29,1.3,1.35]
[null,"Tout","K",{"$f":"[2]!T2_turb(11,D50,D51,D52,D54)","v":11.618357475588732},null,{"$f":"[2]!T2_turb(11,F50,F51,F52,F54)","v":14.934394415965505},{"$f":"[2]!T2_turb(11,G50,G51,G52,G54)","v":11.85507099059971},{"$f":"[2]!T2_turb(11,H50,H51,H52,H54)","v":29.775889818722707},{"$f":"[2]!T2_turb(11,I50,I51,I52,I54)","v":12.550937597957923}]
[null,"Efficacity","%",0.76,null,{"$f":"(0.321*F76^4-1.6098*F76^3+1.316*F76^2+0.9448*F76)*($D$54/0.97215493)","v":0.73617440710513871},{"$f":"(0.321*G76^4-1.6098*G76^3+1.316*G76^2+0.9448*G76)*($D$54/0.97215493)","v":0.74840735754157472},{"$f":"(0.321*H76^4-1.6098*H76^3+1.316*H76^2+0.9448*H76)*($D$54/0.97215493)","v":0.49670786028564828},{"$f":"(0.321*I76^4-1.6098*I76^3+1.316*I76^2+0.9448*I76)*($D$54/0.97215493)","v":0.73148870755398121}]
[null,"Power","W",{"$f":"+D49*(D66-D67)","v":6144.650345780522},null,6016.5440035091169,4088.7985292422336,32.522723439499444,2480.8845946575275]
[null,"Speed","Hz",1496,null,1480.2636567352852,1303.3718922863225,1320.034490255443,1098.0517093965677]
[null,null,null,null,null,{"$f":"(F55/$D55*$D59/F59)^(1/3)*$D56","v":1485.530482166668},{"$f":"(G55/$D55*$D59/G59)^(1/3)*$D56","v":1309.3455222269272},{"$f":"(H55/$D55*$D59/H59)^(1/3)*$D56","v":261.25771454590381},{"$f":"(I55/$D55*$D59/I59)^(1/3)*$D56","v":1105.6934137834776}]
[null,null,null,null,null,{"$f":"F56-F57","v":-5.2668254313828129},{"$f":"G56-G57","v":-5.9736299406047237},{"$f":"H56-H57","v":1058.7767757095392},{"$f":"I56-I57","v":-7.6417043869098507}]
[null,"Brake Pressure",null,8,null,{"$f":"($D59-$D52)+F52","v":8},{"$f":"($D59-$D52)+G52","v":7.94},{"$f":"($D59-$D52)+H52","v":7.95},{"$f":"($D59-$D52)+I52","v":8}]
[null,"Rho (brake)",null,{"$f":"[2]!rho_(11,D59,330)","v":1.1632432504804469},null,{"$f":"[2]!rho_(11,F59,330)","v":1.1632432504804469},{"$f":"[2]!rho_(11,G59,330)","v":1.1545472550104166},{"$f":"[2]!rho_(11,H59,330)","v":1.1559966172478962},{"$f":"[2]!rho_(11,I59,330)","v":1.1632432504804469}]
[null,"Wheel","mm",39.5,null,{"$f":"$D$26","v":35.799999999999997},{"$f":"$D$26","v":35.799999999999997},{"$f":"$D$26","v":35.799999999999997},{"$f":"$D$26","v":35.799999999999997}]
[null,"a = mÖT/P",null,{"$f":"D49*D51^0.5/D50","v":129.36596422035444},null,{"$f":"$D$62","v":129.36596422035444},{"$f":"$D$62","v":129.36596422035444},129.36596422035444,129.36596422035444]
[null,"Rho (in)","kg/m3",{"$f":"[2]!rho_(11,D50,D51)","v":16.817250243896773},null,{"$f":"[2]!rho_(11,F50,F51)","v":13.375291153857948},{"$f":"[2]!rho_(11,G50,G51)","v":14.359191477750651},{"$f":"[2]!rho_(11,H50,H51)","v":2.159549883675286},{"$f":"[2]!rho_(11,I50,I51)","v":11.505933047185708}]
[null,"Sound Speed",null,{"$f":"[2]!Sound_speed(11,D50,D51)","v":258.39146376447951},null,{"$f":"[2]!Sound_speed(11,F50,F51)","v":290.04823018762818},{"$f":"[2]!Sound_speed(11,G50,G51)","v":253.64425936604641},{"$f":"[2]!Sound_speed(11,H50,H51)","v":324.04409152255937},{"$f":"[2]!Sound_speed(11,I50,I51)","v":247.92823053689861}]
[null,"S=Q/(rho*V) = cte",null,{"$f":"D49/(D63*D64)","v":4.4000208975996838E-2},null,3.8468425741379667E-2,3.8910605430234162E-2,3.9962637851455929E-2,3.8242494085549791E-2]
[null,"Hin",null,{"$f":"[2]!H_(11,D50,D51)","v":105.90220745591094},null,{"$f":"[2]!H_(11,F50,F51)","v":131.89535213089164},{"$f":"[2]!H_(11,G50,G51)","v":103.97945828770561},{"$f":"[2]!H_(11,H50,H51)","v":170.84491042210561},{"$f":"[2]!H_(11,I50,I51)","v":101.54892418840952}]
[null,"Hout",null,{"$f":"[2]!H_(11,D52,D53)","v":73.764914852456329},null,{"$f":"[2]!H_(11,F52,F53)","v":91.580114953250359},{"$f":"[2]!H_(11,G52,G53)","v":75.12767249716174},{"$f":"[2]!H_(11,H52,H53)","v":169.68194872482457},{"$f":"[2]!H_(11,I52,I53)","v":78.807768537436118}]
[null,"Sin = Sout",null,{"$f":"[2]!S_(11,D50,D51)","v":13.041567593259808},null,{"$f":"[2]!S_(11,F50,F51)","v":14.275813975533033},{"$f":"[2]!S_(11,G50,G51)","v":13.315255392328808},{"$f":"[2]!S_(11,H50,H51)","v":19.01686410394105},{"$f":"[2]!S_(11,I50,I51)","v":13.701310752755484}]
[null,"Tout(iso)",null,{"$f":"[1]!HeCalc(2,0,1,D52*10^5,8,D68*1000,1)","v":9.7639107105745424},null,{"$f":"[1]!HeCalc(2,0,1,F52*10^5,8,F68*1000,1)","v":12.240423559213966},{"$f":"[1]!HeCalc(2,0,1,G52*10^5,8,G68*1000,1)","v":10.073861840183332},{"$f":"[1]!HeCalc(2,0,1,H52*10^5,8,H68*1000,1)","v":29.550386617947556},{"$f":"[1]!HeCalc(2,0,1,I52*10^5,8,I68*1000,1)","v":11.010714114185083}]
[null,"Hout(iso)",null,{"$f":"[2]!H_(11,D52,D69)","v":63.616296135548602},null,{"$f":"[2]!H_(11,F52,F69)","v":77.132191677960307},{"$f":"[2]!H_(11,G52,G69)","v":65.428546809061586},{"$f":"[2]!H_(11,H52,H69)","v":168.50357099451483},{"$f":"[2]!H_(11,I52,I69)","v":70.460056491444234}]
[null,"ΔHs",null,{"$f":"D66-D70","v":42.285911320362338},null,54.763160452931331,38.550911478644025,2.341339427590782,31.088867696965281]
[null,"u1","m/s",{"$f":"(2*52.7%*D71*1000*D54)^0.5","v":184.04539223806461},null,{"$f":"PI()*$D$73*F56","v":182.10942868957045},{"$f":"PI()*$D$73*G56","v":160.34732028603256},162.39723631473041,135.08780585131595]
[null,"D1",null,{"$f":"D72/PI()/D56","v":3.9160072096222902E-2},null,null,null,null,null,null,null,null,"T2"]
[null,"Co = (2*ΔHs)^0,5",null,{"$f":"(2000*D71)^0.5","v":290.81234953269205},null,330.94761051541474,277.67215012904705,68.430101966762876,249.35463780313083,null,null,"MAX",{"$f":"ROUND(F49,0)&\"g/s @ \"&F50&\" b ; \"&F51&\"K\"","v":"149g/s @ 6,417 b ; 22,92K"}]
[null,"u1/Co",null,{"$f":"D72/D74","v":0.6328664946100403},null,0.55026663708480905,0.57746994148139008,2.3731841930267503,0.54174972256970721,null,null,"MIN",{"$f":"ROUND(G49,0)&\"g/s @ \"&G50&\" b ; \"&G51&\"K\"","v":"142g/s @ 5,242 b ; 17,75K"}]
[null,"U1/C0 off de / U1/C0 nom",null,{"$f":"D75/$D$40","v":0.98709623358564935},null,{"$f":"F75/$D75","v":0.86948296642544232},{"$f":"G75/$D75","v":0.9124672366123846},{"$f":"H75/$D75","v":3.7498970371137426},{"$f":"I75/$D75","v":0.85602528682375989},null,null,"STS",{"$f":"ROUND(H49,0)&\"g/s @ \"&H50&\" b ; \"&H51&\"K\"","v":"28g/s @ 1,35 b ; 30K"}]
[null,"Rdt",null,{"$f":"(0.321*D76^4-1.6098*D76^3+1.316*D76^2+0.9448*D76)*($D54/0.97215493)","v":0.75935604730996153},null,{"$f":"(0.321*F76^4-1.6098*F76^3+1.316*F76^2+0.9448*F76)*($D54/0.97215493)","v":0.73617440710513871},{"$f":"(0.321*G76^4-1.6098*G76^3+1.316*G76^2+0.9448*G76)*($D54/0.97215493)","v":0.74840735754157472},{"$f":"(0.321*H76^4-1.6098*H76^3+1.316*H76^2+0.9448*H76)*($D54/0.97215493)","v":0.49670786028564828},{"$f":"(0.321*I76^4-1.6098*I76^3+1.316*I76^2+0.9448*I76)*($D54/0.97215493)","v":0.73148870755398121},null,null,"BAKING",{"$f":"ROUND(I49,0)&\"g/s @ \"&I50&\" b ; \"&I51&\"K\"","v":"109g/s @ 4,06 b ; 17,17K"}]
[]
[null,"TURBINE 3"]
[]
[null,null,null,"DESIGN",null,{"$f":"F47","v":"D3"},{"$f":"G47","v":"STS"},{"$f":"H47","v":"test"},{"$f":"I47","v":"BAKING"}]
[]
[null,"m","g/s",399.8,null,{"$f":"F96/(F86*F85)^0.5*F84","v":161.47618188513178},{"$f":"G96/(G86*G85)^0.5*G84","v":95.080415199611181},{"$error":"#DIV/0!"},117.10102732642108]
[null,"Pin","Bara",13.07,null,13.07,7.3689999999999998,null,10.48]
[null,"Tin","K",7.2919999999999998,null,9.16,7.9119999999999999,null,10.55]
[null,"Pout","Bara",4.88,null,4.88,5.18,null,5.18]
[null,"Tout","K",{"$f":"[2]!T2_turb(11,D84,D85,D86,D88)","v":6.1198408797506243},null,{"$f":"[2]!T2_turb(11,F84,F85,F86,F88)","v":7.0494463059442776},{"$f":"[2]!T2_turb(11,G84,G85,G86,G88)","v":7.1447253899950391},{"$f":"[2]!T2_turb(11,H84,H85,H86,H88)","v":{"$error":"#VALUE!"}},{"$f":"[2]!T2_turb(11,I84,I85,I86,I88)","v":8.6903815136344829}]
[null,"Efficacity","%",0.72,null,{"$f":"(0.321*F110^4-1.6098*F110^3+1.316*F110^2+0.9448*F110)*($D$88/0.97215493)","v":0.58179731360313081},{"$f":"(0.321*G110^4-1.6098*G110^3+1.316*G110^2+0.9448*G110)*($D$88/0.97215493)","v":0.582724483494652},{"$f":"(0.321*H110^4-1.6098*H110^3+1.316*H110^2+0.9448*H110)*($D$88/0.97215493)","v":{"$error":"#VALUE!"}},{"$f":"(0.321*I110^4-1.6098*I110^3+1.316*I110^2+0.9448*I110)*($D$88/0.97215493)","v":0.50201641458397539}]
[null,"Power","W",{"$f":"+D83*(D100-D101)","v":2075.5404202052005},null,954.74184184263254,182.5140950412455,{"$error":"#DIV/0!"},610.67834348723773]
[null,"Speed","Hz",2076,null,1602.552519659416,914.20818650847264,862.66257848011605,1367.3629344539765]
[null,null,null,null,null,{"$f":"(F89/$D89*$D93/F93)^(1/3)*$D90","v":1602.5525123839127},{"$f":"(G89/$D89*$D93/G93)^(1/3)*$D90","v":914.20817108894096},{"$f":"(H89/$D89*$D93/H93)^(1/3)*$D90","v":{"$error":"#DIV/0!"}},{"$f":"(I89/$D89*$D93/I93)^(1/3)*$D90","v":1367.3629301538849}]
[null,null,null,null,null,{"$f":"F90-F91","v":7.2755033215798903E-6},{"$f":"G90-G91","v":1.5419531678162457E-5},{"$f":"H90-H91","v":{"$error":"#DIV/0!"}},{"$f":"I90-I91","v":4.300091632103431E-6}]
[null,"Brake Pressure",null,10.1,null,{"$f":"($D93-$D86)+F86","v":10.1},{"$f":"($D93-$D86)+G86","v":10.399999999999999},{"$f":"($D93-$D86)+H86","v":5.22},{"$f":"($D93-$D86)+I86","v":10.399999999999999}]
[null,"Rho (brake)",null,{"$f":"[2]!rho_(11,D93,330)","v":1.4673342046153373},null,{"$f":"[2]!rho_(11,F93,330)","v":1.4673342046153373},{"$f":"[2]!rho_(11,G93,330)","v":1.5107331217743123},{"$f":"[2]!rho_(11,H93,330)","v":0.75987987169063398},{"$f":"[2]!rho_(11,I93,330)","v":1.5107331217743123}]
[null,"Wheel","mm",29.5,null,{"$f":"$D$95","v":29.5},{"$f":"$D$95","v":29.5},{"$f":"$D$95","v":29.5},{"$f":"$D$95","v":29.5}]
[null,"a = mÖT/P",null,{"$f":"D83*D85^0.5/D84","v":82.601994178997316},null,{"$f":"$D$96","v":82.601994178997316},{"$f":"$D$96","v":82.601994178997316},82.601994178997316,82.601994178997316]
[null,"Rho (in)","kg/m3",{"$f":"[2]!rho_(11,D84,D85)","v":122.0413850208848},null,{"$f":"[2]!rho_(11,F84,F85)","v":92.042022544510019},{"$f":"[2]!rho_(11,G84,G85)","v":70.649649504414128},{"$f":"[2]!rho_(11,H84,H85)","v":"NUM"},{"$f":"[2]!rho_(11,I84,I85)","v":58.789985568547117}]
[null,"Sound Speed",null,{"$f":"[2]!Sound_speed(11,D84,D85)","v":249.05671288435045},null,{"$f":"[2]!Sound_speed(11,F84,F85)","v":219.03534618547846},{"$f":"[2]!Sound_speed(11,G84,G85)","v":170.78644408370695},{"$f":"[2]!Sound_speed(11,H84,H85)","v":"NUM"},{"$f":"[2]!Sound_speed(11,I84,I85)","v":204.26692373410398}]
[null,"S=Q/(rho*V) = cte",null,{"$f":"D83/(D97*D98)","v":1.3153381307708404E-2},null,8.0095499679843866E-3,7.8800262035761022E-3,{"$error":"#DIV/0!"},9.7512278209034905E-3]
[null,"Hin",null,{"$f":"[2]!H_(11,D84,D85)","v":28.150884578454882},null,{"$f":"[2]!H_(11,F84,F85)","v":40.890140453818937},{"$f":"[2]!H_(11,G84,G85)","v":36.811643961665368},{"$f":"[2]!H_(11,H84,H85)","v":{"$error":"#VALUE!"}},{"$f":"[2]!H_(11,I84,I85)","v":54.059832308617963}]
[null,"Hout",null,{"$f":"[2]!H_(11,D86,D87)","v":22.959437804554931},null,{"$f":"[2]!H_(11,F86,F87)","v":34.977554271159498},{"$f":"[2]!H_(11,G86,G87)","v":34.892067835939827},{"$f":"[2]!H_(11,H86,H87)","v":{"$error":"#VALUE!"}},{"$f":"[2]!H_(11,I86,I87)","v":48.844862317065612}]
[null,"Sin = Sout",null,{"$f":"[2]!S_(11,D84,D85)","v":5.0600046690749361},null,{"$f":"[2]!S_(11,F84,F85)","v":6.606972813997622},{"$f":"[2]!S_(11,G84,G85)","v":6.9458302073485418},{"$f":"[2]!S_(11,H84,H85)","v":{"$error":"#VALUE!"}},{"$f":"[2]!S_(11,I84,I85)","v":8.3000204511344844}]
[null,"Tout(iso)",null,{"$f":"[1]!HeCalc(2,0,1,D86*10^5,8,D102*1000,1)","v":5.9351387842537191},null,{"$f":"[1]!HeCalc(2,0,1,F86*10^5,8,F102*1000,1)","v":6.6999950291002683},{"$f":"[1]!HeCalc(2,0,1,G86*10^5,8,G102*1000,1)","v":7.0241819850115181},{"$f":"[1]!HeCalc(2,0,1,H86*10^5,8,H102*1000,1)","v":{"$error":"#VALUE!"}},{"$f":"[1]!HeCalc(2,0,1,I86*10^5,8,I102*1000,1)","v":8.0488946725573083}]
[null,"Hout(iso)",null,{"$f":"[2]!H_(11,D86,D103)","v":20.940541836947467},null,{"$f":"[2]!H_(11,F86,F103)","v":30.727518437529557},{"$f":"[2]!H_(11,G86,G103)","v":33.517503797489027},{"$f":"[2]!H_(11,H86,H103)","v":{"$error":"#VALUE!"}},{"$f":"[2]!H_(11,I86,I103)","v":43.671785543492518}]
[null,"ΔHs",null,{"$f":"D100-D104","v":7.2103427415074144},null,10.162622016289379,3.2941401641763406,{"$error":"#VALUE!"},10.388046765125445]
[null,"u1","m/s",{"$f":"(2*52.7%*D105*1000*D88)^0.5","v":73.971514109656738},null,{"$f":"PI()*$D$107*F90","v":57.101751598965535},{"$f":"PI()*$D$107*G90","v":32.574838038282842},30.738177791866459,48.72153497060885]
[null,"D1",null,{"$f":"D106/PI()/D90","v":1.1341938457171245E-2},null,null,null,null,null,null,null,null,"T3"]
[null,"Co = (2*ΔHs)^0,5",null,{"$f":"(2000*D105)^0.5","v":120.0861585821398},null,142.56663015088333,81.16822240478524,{"$error":"#VALUE!"},144.13914641848999,null,null,"MAX",{"$f":"ROUND(F83,0)&\"g/s @ \"&F84&\" b ; \"&F85&\"K\"","v":"161g/s @ 13,07 b ; 9,16K"}]
[null,"u1/Co",null,{"$f":"D106/D108","v":0.61598701285010871},null,0.40052676799986592,0.40132501455843644,{"$error":"#VALUE!"},0.33801736850273811,null,null,"MIN",{"$f":"ROUND(G83,0)&\"g/s @ \"&G84&\" b ; \"&G85&\"K\"","v":"95g/s @ 7,369 b ; 7,912K"}]
[null,"U1/C0 off de / U1/C0 nom",null,{"$f":"D109/$D$40","v":0.96076892283052273},null,{"$f":"F109/$D109","v":0.65021950080841751},{"$f":"G109/$D109","v":0.65151538293242062},{"$f":"H109/$D109","v":{"$error":"#VALUE!"}},{"$f":"I109/$D109","v":0.54874106344996854},null,null,"STS",{"$f":"ROUND(H83,0)&\"g/s @ \"&H84&\" b ; \"&H85&\"K\"","v":{"$error":"#DIV/0!"}}]
[null,"Rdt",null,{"$f":"(0.321*D110^4-1.6098*D110^3+1.316*D110^2+0.9448*D110)*($D88/0.97215493)","v":0.7171786087866604},null,{"$f":"(0.321*F110^4-1.6098*F110^3+1.316*F110^2+0.9448*F110)*($D88/0.97215493)","v":0.58179731360313081},{"$f":"(0.321*G110^4-1.6098*G110^3+1.316*G110^2+0.9448*G110)*($D88/0.97215493)","v":0.582724483494652},{"$f":"(0.321*H110^4-1.6098*H110^3+1.316*H110^2+0.9448*H110)*($D88/0.97215493)","v":{"$error":"#VALUE!"}},{"$f":"(0.321*I110^4-1.6098*I110^3+1.316*I110^2+0.9448*I110)*($D88/0.97215493)","v":0.50201641458397539},null,null,"BAKING",{"$f":"ROUND(I83,0)&\"g/s @ \"&I84&\" b ; \"&I85&\"K\"","v":"117g/s @ 10,48 b ; 10,55K"}]
[]
[null,null,null,null,null,null,null,null,null,null,null,null,{"$f":"M38","v":"T1"},{"$f":"M107","v":"T3"},"T1+T2"]
[null,"Courbe de rendement TC3",null,null,null,null,null,null,null,null,null,{"$f":"L108","v":"MAX"},{"$f":"M39","v":"67g/s @ 14,77 b ; 50,44K"},{"$f":"M108","v":"161g/s @ 13,07 b ; 9,16K"},{"$f":"F83+F49","v":310.71365200091907}]
[null,null,null,null,null,null,null,null,null,null,null,{"$f":"L109","v":"MIN"},{"$f":"M40","v":"70g/s @ 12,39 b ; 40,73K"},{"$f":"M109","v":"95g/s @ 7,369 b ; 7,912K"},{"$f":"G83+G49","v":236.79776188053415}]
[null,null,null,null,null,null,null,null,null,null,null,{"$f":"L110","v":"STS"},{"$f":"M41","v":"76g/s @ 8 b ; 55K"},{"$f":"M110","v":{"$error":"#DIV/0!"}},{"$f":"H83+H49","v":{"$error":"#DIV/0!"}}]
[null,null,null,null,null,null,null,null,null,null,null,{"$f":"L111","v":"BAKING"},{"$f":"M42","v":"62g/s @ 9,25 b ; 37,12K"},{"$f":"M111","v":"117g/s @ 10,48 b ; 10,55K"},{"$f":"I83+I49","v":226.19331061816035}]
[null,null,null,null,"d : mm"]
[null,null,null,null,"N : Hz"]
[null,null,null,null,"H : J/kG"]
[]
[]
[]
[]
[]
[null,"rendement=(0,321*rap^4 - 1,6098*rap^3 + 1,316*rap^2 + 0,9448*rap)*(ETAgar/0,97)",null,null,null,null,null,null,"U1/CO _nom",0.64]
[null,null,null,null,null,null,null,null,"Eta_gar",0.8]
[null,"U1/C0",{"$f":"D19","v":0.78},{"$f":"D54","v":0.76},{"$f":"D88","v":0.72}]
[null,0,{"$f":"(0.321*B129^4-1.6098*B129^3+1.316*B129^2+0.9448*B129)*$D$19/0.97215493","v":0}]
[null,{"$f":"B129+0.05","v":0.05},{"$f":"(0.321*$B130^4-1.6098*$B130^3+1.316*$B130^2+0.9448*$B130)*$C$128/0.97215493","v":4.0382461852042459E-2},{"$f":"(0.321*$B130^4-1.6098*$B130^3+1.316*$B130^2+0.9448*$B130)*$D$128/0.97215493","v":3.9347014112246496E-2},{"$f":"(0.321*$B130^4-1.6098*$B130^3+1.316*$B130^2+0.9448*$B130)*$E$128/0.97215493","v":3.7276118632654578E-2}]
[null,0.1,{"$f":"(0.321*$B131^4-1.6098*$B131^3+1.316*$B131^2+0.9448*$B131)*$C$128/0.97215493","v":8.5098158171146673E-2},{"$f":"(0.321*$B131^4-1.6098*$B131^3+1.316*$B131^2+0.9448*$B131)*$D$128/0.97215493","v":8.2916154115476232E-2},{"$f":"(0.321*$B131^4-1.6098*$B131^3+1.316*$B131^2+0.9448*$B131)*$E$128/0.97215493","v":7.8552146004135376E-2}]
[null,0.15000000000000002,0.13323633134792623,0.12982001515951785,0.12298738278270113]
[null,0.2,0.18392485650409657,0.17920883454245307,0.16977679061916603]
[null,0.25,0.23633024149247489,0.23027049171061653,0.21815099214689987]
[null,0.3,0.28965762689698032,0.28223050825859619,0.26737627098182798]
[null,0.35,0.34315078603263366,0.33435204792923284,0.3167545717224311]
[null,0.39999999999999997,0.39609212494555779,0.38593591661362037,0.36562349994974563]
[null,0.44999999999999996,0.4478026824129771,0.43632056235110589,0.41335632222736346]
[null,0.49999999999999994,0.49764212994321799,0.48488207532928934,0.45936196610143198]
[null,0.54999999999999993,0.54500877177570861,0.53103418788402379,0.50308502010065403]
[null,0.6,0.58933954488097895,0.57422827449941549,0.54400573373628835]
[null,0.65,0.63011001896066099,0.61395335180782351,0.58164001750214867]
[null,0.70000000000000007,0.66683439644748832,0.64973607858986027,0.61553944287460449]
[null,0.75000000000000011,0.69906551250529614,0.68114075577439104,0.64529124231258095]
[null,0.80000000000000016,0.7263948350290218,0.70776932643853407,0.67051830925755851]
[null,0.8500000000000002,0.74845246464470438,0.72926137580766071,0.69087919813357312]
[null,0.90000000000000024,0.76490713470948513,0.74529413125539579,0.70606812434721711]
[null,0.95000000000000029,0.77546621131160665,0.7555824623036167,0.71581496428763691]
[null,1.0000000000000002,0.77987569327041351,0.75987888062245412,0.71988525532653547]
[null,1.0500000000000003,0.77792021213635165,0.75797354003029138,0.71808019581817073]
[null,1.1000000000000003,0.76942303219096997,0.74969423649376565,0.7102366450993568]
[null,1.1500000000000004,0.75424605044691839,0.73490640812776653,0.69622712348946292]
[null,1.2000000000000004,0.7322897966479478,0.71351313519543635,0.67595981229041324,null,"F Let u be the peripheral speed of the wheel : u = p . Æ . N / 60                      (in m/s)"]
[null,1.2500000000000004,0.70349343326891334,0.68545514010817188,0.64937855378668918,null,"F Let n, be the speed ratio of the turbine : n =  u / [ 2 . (H1 - H2S ) ] 0.5       (dimensionless number)"]
[null,1.3000000000000005,0.66783475551576954,0.65071078742562172,0.61646285124532574,null,null,"N = speed of rotation of the turbine (in rpm)"]
[null,1.3500000000000005,0.62533019132557388,0.60929608385568745,0.57722786891591438,null,null,"Æ = diameter of the wheel of the turbine (in m)"]
[null,1.4000000000000006,0.57603480136648577,0.56126467825452464,0.53172443203060227]
[null,1.4500000000000006,0.5200422790377659,0.50670786162654113,0.48003902680409161]
[null,1.5000000000000007,0.45748495046977738,0.44575456712439848,0.42229380043364062]

{"sheet":"Fluides","index":6,"n_rows":53,"n_cols":8,"rows_kept":53,"cut":false,"hidden":false,"merged":[]}
[null,null,"Liste des fluides disponibles"]
[1,1,"Ammoniac","C:\\Program files\\GaspakDemo5\\NH379.gas",null,null,null,1]
[2,2,"Argon","C:\\Program files\\GaspakDemo5\\ARGON83.gas",null,null,null,2]
[3,21,"Azote","C:\\Program files\\GaspakDemo5\\N273.gas",null,null,null,21]
[4,22,"Azote","C:\\Program files\\GaspakDemo5\\N286.gas",null,null,null,22]
[5,4,"Butane Normal","C:\\Program files\\GaspakDemo5\\NORB86.gas",null,null,null,4]
[6,7,"Deutérium","C:\\Program files\\GaspakDemo5\\D286.gas",null,null,null,7]
[7,5,"Dioxide de carbone","C:\\Program files\\GaspakDemo5\\CO289.gas",null,null,null,5]
[8,27,"Eau","C:\\Program files\\GaspakDemo5\\H2O89.gas",null,null,null,27]
[9,8,"Ethane","C:\\Program files\\GaspakDemo5\\C2H686.gas",null,null,null,8]
[10,9,"Ethylène","C:\\Program files\\GaspakDemo5\\C2H481.gas",null,null,null,9]
[11,10,"Ethylène","C:\\Program files\\GaspakDemo5\\C2H486.gas",null,null,null,10]
[12,11,"Helium","C:\\Program files\\GaspakDemo5\\HE89.gas",null,null,null,11]
[13,16,"Hydrogen Sulfide","C:\\Program files\\GaspakDemo5\\H2S93.gas",null,null,null,16]
[14,3,"Isobutane","C:\\Program files\\GaspakDemo5\\ISOB86.gas",null,null,null,3]
[15,17,"Krypton","C:\\Program files\\GaspakDemo5\\KR90.gas",null,null,null,17]
[16,18,"Méthane","C:\\Program files\\GaspakDemo5\\METH86.gas",null,null,null,18]
[17,19,"Méthane","C:\\Program files\\GaspakDemo5\\CH489.gas",null,null,null,19]
[18,6,"Monoxide de carbone","C:\\Program files\\GaspakDemo5\\CO85.gas",null,null,null,6]
[19,20,"Néon","C:\\Program files\\GaspakDemo5\\NE91.gas",null,null,null,20]
[20,23,"Nitrogene Trifluoride","C:\\Program files\\GaspakDemo5\\NF380.gas",null,null,null,23]
[21,13,"Normal Hydrogene","C:\\Program files\\GaspakDemo5\\NH291.gas",null,null,null,13]
[22,24,"Oxygène","C:\\Program files\\GaspakDemo5\\O278.gas",null,null,null,24]
[23,25,"Oxygène","C:\\Program files\\GaspakDemo5\\O285.gas",null,null,null,25]
[24,15,"Hydrogène Para","C:\\Program files\\GaspakDemo5\\PH275.gas",null,null,null,15]
[25,26,"Propane","C:\\Program files\\GaspakDemo5\\C3H886.gas",null,null,null,26]
[26,29,"R11","C:\\Program files\\GaspakDemo5\\R1191.gas",null,null,null,29]
[27,30,"R12","C:\\Program files\\GaspakDemo5\\R1291.gas",null,null,null,30]
[28,33,"R123","C:\\Program files\\GaspakDemo5\\R123N93.gas",null,null,null,33]
[29,34,"R124","C:\\Program files\\GaspakDemo5\\R124N93.gas",null,null,null,34]
[30,35,"R125","C:\\Program files\\GaspakDemo5\\R125N93.gas",null,null,null,35]
[31,36,"R134","C:\\Program files\\GaspakDemo5\\R134AN92.gas",null,null,null,36]
[32,37,"R134","C:\\Program files\\GaspakDemo5\\R134AT93.gas",null,null,null,37]
[33,38,"R152","C:\\Program files\\GaspakDemo5\\R152AT94.gas",null,null,null,38]
[34,31,"R22","C:\\Program files\\GaspakDemo5\\R2291.gas",null,null,null,31]
[35,32,"R32","C:\\Program files\\GaspakDemo5\\R32N93.gas",null,null,null,32]
[36,50,"R32","C:\\Program files\\GaspakDemo5\\R32N94.gas",null,null,null,50]
[37,28,"Xénon","C:\\Program files\\GaspakDemo5\\\\XE90.gas",null,null,null,28]
[38,"Phosphine",1.45,10.6]
[39,"Protoxyde d'azote",1.8720000000000001,13.6]
[40,"R11 gaz",6.2,10.16]
[41,"R12 gaz",5.75,11.99]
[42,"R22 gaz",4.2300000000000004,11.8]
[43,"Silane",1.36,10.8]
[44,"Sulfure d'hydrogène",1.45,11.79]
[45,"R11 liq",1500,567.5]
[46,"R12 liq",1350,260]
[47,"R22 liq",1250,210]
[48,"R32 liq",1000,193.2]
[49,"R123 liq",1500,569.6]
[50,"R124 liq",1400,346]
[51,"R125 liq",1250,205]
[52,"R152a liq",950,214]

{"sheet":"Turbines_Hefei","index":7,"n_rows":159,"n_cols":15,"rows_kept":159,"cut":false,"hidden":false,"merged":[]}
[]
[]
[]
[]
[]
[]
[]
[null,"Relation entre la puissance et la vitesse de rotation",null,null,null,null,null,null,null,null,null,null,"²"]
[]
[null,"TURBINE 1"]
[]
[null,null,null,null,null,"ESSAI"]
[null,null,null,"LIQUE","REFRIG"]
[null,"m","g/s",26.3,26.6,26]
[null,"Pin","Bara",13.83,12.17,12.11]
[null,"Tin","K",43.18,31.18,41.44]
[null,"Pout","Bara",6.53,5.55,5.28]
[null,"Tout","K",{"$f":"[2]!T2_turb(11,D15,D16,D17,D19)","v":35.022927904324874},{"$f":"[2]!T2_turb(11,E15,E16,E17,E19)","v":25.125351080036832},{"$f":"[2]!T2_turb(11,F15,F16,F17,F19)","v":32.880608687226122}]
[null,"Efficacity","%",0.73,0.71279999999999999,{"$f":"(0.321*F41^4-1.6098*F41^3+1.316*F41^2+0.9448*F41)*($D$19/0.97)","v":0.73135958219850672}]
[null,"Power","W",{"$f":"+D14*(D31-D32)","v":1145.7660192315839},842.55240196071315,1181.7951135975291]
[null,"Speed","Hz",2696,2463,2737.6819165537222]
[null,null,null,null,null,{"$f":"(F20/$D20*$D24/F24)^(1/3)*$D21","v":2737.6821698408871}]
[null,null,null,null,null,{"$f":"F21-F22","v":-2.5328716492367676E-4}]
[null,"Brake Pressure",null,5.35,4.8899999999999997,5.27]
[null,"Rho (brake)",null,{"$f":"[2]!rho_(11,D24,330)","v":0.77876265690570234},{"$f":"[2]!rho_(11,E24,330)","v":0.71193761959398882},{"$f":"[2]!rho_(11,F24,330)","v":0.76714271925513389}]
[null,"Wheel","mm",25.5,{"$f":"$D$26","v":25.5},{"$f":"$D$26","v":25.5}]
[null,"a = mÖT/P",null,{"$f":"D14*D16^0.5/D15","v":12.496111376757693},{"$f":"+$D$27","v":12.496111376757693},{"$f":"+$D$27","v":12.496111376757693}]
[null,"Rho (in)","kg/m3",{"$f":"[2]!rho_(11,D15,D16)","v":14.879796869338547},{"$f":"[2]!rho_(11,E15,E16)","v":18.219752593610284},{"$f":"[2]!rho_(11,F15,F16)","v":13.631897027299175}]
[null,"Sound Speed",null,{"$f":"[2]!Sound_speed(11,D15,D16)","v":403.94826470833328},{"$f":"[2]!Sound_speed(11,E15,E16)","v":345.07753482231766},{"$f":"[2]!Sound_speed(11,F15,F16)","v":394.1049516112281}]
[null,"S=Q/(rho*V) = cte",null,{"$f":"D14/(D28*D29)","v":4.3755535083431132E-3},4.2307997926800418E-3,4.8395519891523591E-3]
[null,"Hin",null,{"$f":"[2]!H_(11,D15,D16)","v":240.37201833506001},{"$f":"[2]!H_(11,E15,E16)","v":175.793789198182},{"$f":"[2]!H_(11,F15,F16)","v":230.98585196367696}]
[null,"Hout",null,{"$f":"[2]!H_(11,D17,D18)","v":196.8067704555321},{"$f":"[2]!H_(11,E17,E18)","v":144.11888686883188},{"$f":"[2]!H_(11,F17,F18)","v":185.53219374838739}]
[null,"Sin = Sout",null,{"$f":"[2]!S_(11,D15,D16)","v":16.034045276350056},{"$f":"[2]!S_(11,E15,E16)","v":14.555816928865609},{"$f":"[2]!S_(11,F15,F16)","v":16.097453351061993}]
[null,"Tout(iso)",null,{"$f":"[1]!HeCalc(2,0,1,D17*10^5,8,D33*1000,1)","v":31.991025425862453},{"$f":"[1]!HeCalc(2,0,1,E17*10^5,8,E33*1000,1)","v":22.764217726468384},{"$f":"[1]!HeCalc(2,0,1,F17*10^5,8,F33*1000,1)","v":29.735058090451112}]
[null,"Hout(iso)",null,{"$f":"[2]!H_(11,D17,D34)","v":180.69359658228194},{"$f":"[2]!H_(11,E17,E34)","v":131.35649636800315},{"$f":"[2]!H_(11,F17,F34)","v":168.83631660289936}]
[null,"ΔHs",null,{"$f":"D31-D35","v":59.678421752778064},44.437292830178848,62.149535360777605]
[null,"u1","m/s",{"$f":"(2*52.7%*D36*1000*D19)^0.5","v":214.28432342339582},{"$f":"PI()*$D$38*E21","v":195.76494383969731},{"$f":"PI()*$D$38*F21","v":217.59729867847921}]
[null,"D1",null,{"$f":"D37/PI()/D21","v":2.530000689906221E-2},null,null,null,null,null,null,null,null,"T1"]
[null,"Co = (2*ΔHs)^0,5",null,{"$f":"(2000*D36)^0.5","v":345.48059787136543},298.11840879146945,352.56073338015852,null,null,null,null,null,"MAX",{"$f":"ROUND(F14,0)&\"g/s @ \"&F15&\" b ; \"&F16&\"K\"","v":"26g/s @ 12,11 b ; 41,44K"}]
[null,"u1/Co",null,{"$f":"D37/D39","v":0.6202499496170879},0.65666841787228492,0.61719096336190338,null,null,null,null,null,"MIN",{"$f":"ROUND(G14,0)&\"g/s @ \"&G15&\" b ; \"&G16&\"K\"","v":"0g/s @  b ; K"}]
[null,"U1/C0 off de / U1/C0 nom",null,{"$f":"D40/$D$40","v":1},{"$f":"E40/$D40","v":1.0587157939757674},{"$f":"F40/$D40","v":0.99506813945398465},null,null,null,null,null,"STS",{"$f":"ROUND(H14,0)&\"g/s @ \"&H15&\" b ; \"&H16&\"K\"","v":"0g/s @  b ; K"}]
[null,"Rdt",null,{"$f":"(0.321*D41^4-1.6098*D41^3+1.316*D41^2+0.9448*D41)*($D19/0.97)","v":0.73150515463917531},0.72872732323122758,0.73135958219850672,null,null,null,null,null,"BAKING",{"$f":"ROUND(I14,0)&\"g/s @ \"&I15&\" b ; \"&I16&\"K\"","v":"0g/s @  b ; K"}]
[]
[]
[null,"TURBINE 2"]
[]
[null,null,null,"DESIGN",null,{"$f":"F12","v":"ESSAI"},{"$f":"G12","v":0},{"$f":"H12","v":0},{"$f":"I12","v":0}]
[]
[null,"m","g/s",248,232.50201830451695,274.39999999999998,264.89999999999998,202,199]
[null,"Pin","Bara",11,10.37,11,10.69,8.9909999999999997,8.4939999999999998]
[null,"Tin","K",20.6,20.83,19.29,19.489999999999998,23.4,21.74]
[null,"Pout","Bara",4.2770000000000001,4.1769999999999996,2.27,4.2270000000000003,3.9769999999999999,4.4770000000000003]
[null,"Tout","K",{"$f":"[2]!T2_turb(11,D50,D51,D52,D54)","v":15.363803304958967},{"$f":"[2]!T2_turb(11,E50,E51,E52,E54)","v":15.706193965367389},{"$f":"[2]!T2_turb(11,F50,F51,F52,F54)","v":11.943801869020682},{"$f":"[2]!T2_turb(11,G50,G51,G52,G54)","v":14.580843885518025},{"$f":"[2]!T2_turb(11,H50,H51,H52,H54)","v":18.242851223891211},{"$f":"[2]!T2_turb(11,I50,I51,I52,I54)","v":17.814530381937882}]
[null,"Efficacity","%",0.78,{"$f":"(0.321*E76^4-1.6098*E76^3+1.316*E76^2+0.9448*E76)*($D$54/0.97)","v":0.7808654646155484},{"$f":"(0.321*F76^4-1.6098*F76^3+1.316*F76^2+0.9448*F76)*($D$54/0.97)","v":0.78042050968331311},{"$f":"(0.321*G76^4-1.6098*G76^3+1.316*G76^2+0.9448*G76)*($D$54/0.97)","v":0.78076660910128171},{"$f":"(0.321*H76^4-1.6098*H76^3+1.316*H76^2+0.9448*H76)*($D$54/0.97)","v":0.77490491286183738},{"$f":"(0.321*I76^4-1.6098*I76^3+1.316*I76^2+0.9448*I76)*($D$54/0.97)","v":0.77926545775633205}]
[null,"Power","W",{"$f":"+D49*(D66-D67)","v":6410.9677720011541},5909.8194484461528,9688.556436742052,6344.3690121204836,5292.3122805234452,3940.8469916747836]
[null,"Speed","Hz",1400,1365,1703.9988094293917,1397.0224893917318,1324.0638691222946,1184.0331666692389]
[null,null,null,null,null,{"$f":"(F55/$D55*$D59/F59)^(1/3)*$D56","v":1703.9889790791685},{"$f":"(G55/$D55*$D59/G59)^(1/3)*$D56","v":1397.015502276163},{"$f":"(H55/$D55*$D59/H59)^(1/3)*$D56","v":1324.0796073443339},{"$f":"(I55/$D55*$D59/I59)^(1/3)*$D56","v":1184.0419119093897}]
[null,null,null,null,null,{"$f":"F56-F57","v":9.8303502231829043E-3},{"$f":"G56-G57","v":6.9871155687906139E-3},{"$f":"H56-H57","v":-1.5738222039317407E-2},{"$f":"I56-I57","v":-8.7452401508016919E-3}]
[null,"Brake Pressure",null,12.4,null,{"$f":"($D59-$D52)+F52","v":10.393000000000001},{"$f":"($D59-$D52)+G52","v":12.350000000000001},{"$f":"($D59-$D52)+H52","v":12.100000000000001},{"$f":"($D59-$D52)+I52","v":12.600000000000001}]
[null,"Rho (brake)",null,{"$f":"[2]!rho_(11,D59,330)","v":1.7997871404336276},null,{"$f":"[2]!rho_(11,F59,330)","v":1.5097206017696665},{"$f":"[2]!rho_(11,G59,330)","v":1.7925665531313912},{"$f":"[2]!rho_(11,H59,330)","v":1.7564591857919802},{"$f":"[2]!rho_(11,I59,330)","v":1.8286665362232972}]
[null,"Wheel","mm",37.5,{"$f":"$D$26","v":25.5},{"$f":"$D$26","v":25.5},{"$f":"$D$26","v":25.5},{"$f":"$D$26","v":25.5},{"$f":"$D$26","v":25.5}]
[null,"a = mÖT/P",null,{"$f":"D49*D51^0.5/D50","v":102.32755701969941},102.32755701969943,109.56139055719603,109.39819907343733,108.68041809518232,109.23720754170373]
[null,"Rho (in)","kg/m3",{"$f":"[2]!rho_(11,D50,D51)","v":25.540855637956792},{"$f":"[2]!rho_(11,E50,E51)","v":23.807556766461335},{"$f":"[2]!rho_(11,F50,F51)","v":27.48048465747328},{"$f":"[2]!rho_(11,G50,G51)","v":26.406682377280482},{"$f":"[2]!rho_(11,H50,H51)","v":18.257238934263505},{"$f":"[2]!rho_(11,I50,I51)","v":18.66731756848581}]
[null,"Sound Speed",null,{"$f":"[2]!Sound_speed(11,D50,D51)","v":281.98328846410919},{"$f":"[2]!Sound_speed(11,E50,E51)","v":282.4894474736368},{"$f":"[2]!Sound_speed(11,F50,F51)","v":273.17336875646583},{"$f":"[2]!Sound_speed(11,G50,G51)","v":274.0281512729216},{"$f":"[2]!Sound_speed(11,H50,H51)","v":296.72109855062985},{"$f":"[2]!Sound_speed(11,I50,I51)","v":285.54632194029665}]
[null,"S=Q/(rho*V) = cte",null,{"$f":"D49/(D63*D64)","v":3.4434427550877951E-2},3.4570819098406869E-2,3.6552859809052589E-2,3.6607741476904966E-2,3.7287892853458113E-2,3.733314612459418E-2]
[null,"Hin",null,{"$f":"[2]!H_(11,D50,D51)","v":117.19893024722134},{"$f":"[2]!H_(11,E50,E51)","v":118.76588483254763},{"$f":"[2]!H_(11,F50,F51)","v":109.62807186850429},{"$f":"[2]!H_(11,G50,G51)","v":110.9314560888928},{"$f":"[2]!H_(11,H50,H51)","v":133.68648404791796},{"$f":"[2]!H_(11,I50,I51)","v":124.62661687105937}]
[null,"Hout",null,{"$f":"[2]!H_(11,D52,D53)","v":91.348253747216688},{"$f":"[2]!H_(11,E52,E53)","v":93.34752721336416},{"$f":"[2]!H_(11,F52,F53)","v":74.319921588832088},{"$f":"[2]!H_(11,G52,G53)","v":86.981403193005733},{"$f":"[2]!H_(11,H52,H53)","v":107.48691830275239},{"$f":"[2]!H_(11,I52,I53)","v":104.82336565661322}]
[null,"Sin = Sout",null,{"$f":"[2]!S_(11,D50,D51)","v":12.471269933399629},{"$f":"[2]!S_(11,E50,E51)","v":12.670232847386409},{"$f":"[2]!S_(11,F50,F51)","v":12.091517398356705},{"$f":"[2]!S_(11,G50,G51)","v":12.218086211860863},{"$f":"[2]!S_(11,H50,H51)","v":13.645422775959359},{"$f":"[2]!S_(11,I50,I51)","v":13.363174953746494}]
[null,"Tout(iso)",null,{"$f":"[1]!HeCalc(2,0,1,D52*10^5,8,D68*1000,1)","v":14.074271984296702},{"$f":"[1]!HeCalc(2,0,1,E52*10^5,8,E68*1000,1)","v":14.437047364569063},{"$f":"[1]!HeCalc(2,0,1,F52*10^5,8,F68*1000,1)","v":10.18382109815426},{"$f":"[1]!HeCalc(2,0,1,G52*10^5,8,G68*1000,1)","v":13.401601278072976},{"$f":"[1]!HeCalc(2,0,1,H52*10^5,8,H68*1000,1)","v":16.855854125595496},{"$f":"[1]!HeCalc(2,0,1,I52*10^5,8,I68*1000,1)","v":16.80071466056123}]
[null,"Hout(iso)",null,{"$f":"[2]!H_(11,D52,D69)","v":84.057037298965582},{"$f":"[2]!H_(11,E52,E69)","v":86.214365049964513},{"$f":"[2]!H_(11,F52,F69)","v":64.38560342813183},{"$f":"[2]!H_(11,G52,G69)","v":80.256408493578149},{"$f":"[2]!H_(11,H52,H69)","v":99.876444505903692},{"$f":"[2]!H_(11,I52,I69)","v":99.213901579601895}]
[null,"ΔHs",null,{"$f":"D66-D70","v":33.141892948255759},32.551519782583114,45.242468440372463,30.675047595314652,33.810039542014266,25.412715291457474]
[null,"u1","m/s",{"$f":"(2*52.7%*D71*1000*D54)^0.5","v":165.06548103895022},{"$f":"PI()*$D$73*E56","v":160.93884401297646},{"$f":"PI()*$D$73*F56","v":200.90813083447216},164.71442088119855,156.11231391640371,139.60214587309247]
[null,"D1",null,{"$f":"D72/PI()/D56","v":3.7529981773129217E-2},null,null,null,null,null,null,null,null,"T2"]
[null,"Co = (2*ΔHs)^0,5",null,{"$f":"(2000*D71)^0.5","v":257.45637668644275},255.15297287150355,300.80714233665549,247.68951368725584,260.038610756227,225.44496131631539,null,null,"MAX",{"$f":"ROUND(F49,0)&\"g/s @ \"&F50&\" b ; \"&F51&\"K\"","v":"274g/s @ 11 b ; 19,29K"}]
[null,"u1/Co",null,{"$f":"D72/D74","v":0.64113961038138978},0.63075433612143783,0.66789681014163227,0.66500361048459466,0.60034282394606042,0.61922938999386501,null,null,"MIN",{"$f":"ROUND(G49,0)&\"g/s @ \"&G50&\" b ; \"&G51&\"K\"","v":"265g/s @ 10,69 b ; 19,49K"}]
[null,"U1/C0 off de / U1/C0 nom",null,{"$f":"D75/$D$40","v":1.0336794235569033},{"$f":"E75/$D75","v":0.98380185205875181},{"$f":"F75/$D75","v":1.0417338116799952},{"$f":"G75/$D75","v":1.0372212225181487},{"$f":"H75/$D75","v":0.93636832637580936},{"$f":"I75/$D75","v":0.96582613204245604},null,null,"STS",{"$f":"ROUND(H49,0)&\"g/s @ \"&H50&\" b ; \"&H51&\"K\"","v":"202g/s @ 8,991 b ; 23,4K"}]
[null,"Rdt",null,{"$f":"(0.321*D76^4-1.6098*D76^3+1.316*D76^2+0.9448*D76)*($D54/0.97)","v":0.78100105922686858},0.7808654646155484,0.78042050968331311,0.78076660910128171,0.77490491286183738,0.77926545775633205,null,null,"BAKING",{"$f":"ROUND(I49,0)&\"g/s @ \"&I50&\" b ; \"&I51&\"K\"","v":"199g/s @ 8,494 b ; 21,74K"}]
[]
[null,"TURBINE 3"]
[]
[null,null,null,"DESIGN",null,{"$f":"F47","v":"ESSAI"},{"$f":"G47","v":0},{"$f":"H47","v":0},{"$f":"I47","v":0}]
[]
[null,"m","g/s",454,433,427,408,340,370]
[null,"Pin","Bara",15.69,14.69,15.34,14.84,13.54,14.2]
[null,"Tin","K",7.03,7.37,8.08,8.3010000000000002,9.7219999999999995,9.1839999999999993]
[null,"Pout","Bara",2.8,2.8,5.1230000000000002,5.1230000000000002,5.0030000000000001,5]
[null,"Tout","K",{"$f":"[2]!T2_turb(11,D84,D85,D86,D88)","v":5.3921383594836865},{"$f":"[2]!T2_turb(11,E84,E85,E86,E88)","v":5.4398165000286154},{"$f":"[2]!T2_turb(11,F84,F85,F86,F88)","v":6.4211804644392645},{"$f":"[2]!T2_turb(11,G84,G85,G86,G88)","v":6.5276822232344989},{"$f":"[2]!T2_turb(11,H84,H85,H86,H88)","v":7.2650648995103211},{"$f":"[2]!T2_turb(11,I84,I85,I86,I88)","v":6.9113442710349418}]
[null,"Efficacity","%",0.73,{"$f":"(0.321*E110^4-1.6098*E110^3+1.316*E110^2+0.9448*E110)*($D$88/0.97)","v":0.73124589629827341},{"$f":"(0.321*F110^4-1.6098*F110^3+1.316*F110^2+0.9448*F110)*($D$88/0.97)","v":0.72160494577218692},{"$f":"(0.321*G110^4-1.6098*G110^3+1.316*G110^2+0.9448*G110)*($D$88/0.97)","v":0.71925001320033477},{"$f":"(0.321*H110^4-1.6098*H110^3+1.316*H110^2+0.9448*H110)*($D$88/0.97)","v":0.69943561116273223},{"$f":"(0.321*I110^4-1.6098*I110^3+1.316*I110^2+0.9448*I110)*($D$88/0.97)","v":0.70917518045315897}]
[null,"Power","W",{"$f":"+D83*(D100-D101)","v":3516.41626962996},3307.2848647874539,2914.0599266559489,2773.0578264299274,2723.1214930373581,2821.3323281883586]
[null,"Speed","Hz",1026,1010,888.88901054616645,878.46240471256397,898.50983793217677,899.62680726358053]
[null,null,null,null,null,{"$f":"(F89/$D89*$D93/F93)^(1/3)*$D90","v":910.09881961496023},{"$f":"(G89/$D89*$D93/G93)^(1/3)*$D90","v":895.1765567960681},{"$f":"(H89/$D89*$D93/H93)^(1/3)*$D90","v":892.20120712840082},{"$f":"(I89/$D89*$D93/I93)^(1/3)*$D90","v":902.8625212665396}]
[null,null,null,null,null,{"$f":"F90-F91","v":-21.209809068793788},{"$f":"G90-G91","v":-16.714152083504132},{"$f":"H90-H91","v":6.3086308037759409},{"$f":"I90-I91","v":-3.235714002959071}]
[null,"Brake Pressure",null,12.4,null,{"$f":"($D93-$D86)+F86","v":14.723000000000003},{"$f":"($D93-$D86)+G86","v":14.723000000000003},{"$f":"($D93-$D86)+H86","v":14.603000000000002},{"$f":"($D93-$D86)+I86","v":14.600000000000001}]
[null,"Rho (brake)",null,{"$f":"[2]!rho_(11,D93,330)","v":1.7997871404336276},null,{"$f":"[2]!rho_(11,F93,330)","v":2.1349302317911873},{"$f":"[2]!rho_(11,G93,330)","v":2.1349302317911873},{"$f":"[2]!rho_(11,H93,330)","v":2.1176332249962067},{"$f":"[2]!rho_(11,I93,330)","v":2.117200778075456}]
[null,"Wheel","mm",28,{"$f":"$D$95","v":28},{"$f":"$D$95","v":28},{"$f":"$D$95","v":28},{"$f":"$D$95","v":28},{"$f":"$D$95","v":28}]
[null,"a = mÖT/P",null,{"$f":"D83*D85^0.5/D84","v":76.720349355481659},80.02023905916586,79.123992989786956,79.212089423011363,78.295727006923869,78.964032250186492]
[null,"Rho (in)","kg/m3",{"$f":"[2]!rho_(11,D84,D85)","v":133.10041212976475},{"$f":"[2]!rho_(11,E84,E85)","v":126.15150431340835},{"$f":"[2]!rho_(11,F84,F85)","v":118.52007478205572},{"$f":"[2]!rho_(11,G84,G85)","v":113.5622187212817},{"$f":"[2]!rho_(11,H84,H85)","v":86.357771280008706},{"$f":"[2]!rho_(11,I84,I85)","v":97.527739457599623}]
[null,"Sound Speed",null,{"$f":"[2]!Sound_speed(11,D84,D85)","v":278.37037413368364},{"$f":"[2]!Sound_speed(11,E84,E85)","v":263.0805002567734},{"$f":"[2]!Sound_speed(11,F84,F85)","v":255.30523600661596},{"$f":"[2]!Sound_speed(11,G84,G85)","v":246.67040794527531},{"$f":"[2]!Sound_speed(11,H84,H85)","v":220.26513084300478},{"$f":"[2]!Sound_speed(11,I84,I85)","v":228.80664487050078}]
[null,"S=Q/(rho*V) = cte",null,{"$f":"D83/(D97*D98)","v":1.2253310522154687E-2},1.3046884076824011E-2,1.4111599309667234E-2,1.4564958182830321E-2,1.7874411011785177E-2,1.6580779092051731E-2]
[null,"Hin",null,{"$f":"[2]!H_(11,D84,D85)","v":27.297656061036612},{"$f":"[2]!H_(11,E84,E85)","v":28.806899242841915},{"$f":"[2]!H_(11,F84,F85)","v":32.929563952369485},{"$f":"[2]!H_(11,G84,G85)","v":34.299579059824019},{"$f":"[2]!H_(11,H84,H85)","v":44.864448113929591},{"$f":"[2]!H_(11,I84,I85)","v":40.504985501827527}]
[null,"Hout",null,{"$f":"[2]!H_(11,D86,D87)","v":19.552245775508066},{"$f":"[2]!H_(11,E86,E87)","v":21.168827961577588},{"$f":"[2]!H_(11,F86,F87)","v":26.105067637015974},{"$f":"[2]!H_(11,G86,G87)","v":27.502868700927138},{"$f":"[2]!H_(11,H86,H87)","v":36.855267252055008},{"$f":"[2]!H_(11,I86,I87)","v":32.879762993210342}]
[null,"Sin = Sout",null,{"$f":"[2]!S_(11,D84,D85)","v":4.6548744621978262},{"$f":"[2]!S_(11,E84,E85)","v":4.971471814103408},{"$f":"[2]!S_(11,F84,F85)","v":5.4363798982443239},{"$f":"[2]!S_(11,G84,G85)","v":5.656221826069662},{"$f":"[2]!S_(11,H84,H85)","v":6.9722021671127212},{"$f":"[2]!S_(11,I84,I85)","v":6.4350392283015685}]
[null,"Tout(iso)",null,{"$f":"[1]!HeCalc(2,0,1,D86*10^5,8,D102*1000,1)","v":5.2264698889085857},{"$f":"[1]!HeCalc(2,0,1,E86*10^5,8,E102*1000,1)","v":5.3402792096199763},{"$f":"[1]!HeCalc(2,0,1,F86*10^5,8,F102*1000,1)","v":6.2091585528103979},{"$f":"[1]!HeCalc(2,0,1,G86*10^5,8,G102*1000,1)","v":6.3231083063920845},{"$f":"[1]!HeCalc(2,0,1,H86*10^5,8,H102*1000,1)","v":6.9570296110913148},{"$f":"[1]!HeCalc(2,0,1,I86*10^5,8,I102*1000,1)","v":6.6631485316340617}]
[null,"Hout(iso)",null,{"$f":"[2]!H_(11,D86,D103)","v":16.687504985257792},{"$f":"[2]!H_(11,E86,E103)","v":18.361615060348232},{"$f":"[2]!H_(11,F86,F103)","v":23.472178224393527},{"$f":"[2]!H_(11,G86,G103)","v":24.849860276911517},{"$f":"[2]!H_(11,H86,H103)","v":33.413528638210821},{"$f":"[2]!H_(11,I86,I103)","v":29.75274442115229}]
[null,"ΔHs",null,{"$f":"D100-D104","v":10.61015107577882},10.445284182493683,9.4573857279759572,9.4497187829125018,11.45091947571877,10.752241080675237]
[null,"u1","m/s",{"$f":"(2*52.7%*D105*1000*D88)^0.5","v":90.352988001093465},{"$f":"PI()*$D$107*E90","v":88.943974542986751},{"$f":"PI()*$D$107*F90","v":78.278536163919711},77.360334417549723,79.125778367982861,79.224142419247883]
[null,"D1",null,{"$f":"D106/PI()/D90","v":2.8031432092586225E-2},null,null,null,null,null,null,null,null,"T3"]
[null,"Co = (2*ΔHs)^0,5",null,{"$f":"(2000*D105)^0.5","v":145.67189897697372},144.53569927525646,137.53098362169854,137.47522528013911,151.33353544881433,146.64406623300675,null,null,"MAX",{"$f":"ROUND(F83,0)&\"g/s @ \"&F84&\" b ; \"&F85&\"K\"","v":"427g/s @ 15,34 b ; 8,08K"}]
[null,"u1/Co",null,{"$f":"D106/D108","v":0.6202499496170879},0.61537720430992071,0.56917019061855634,0.56272200507334524,0.522856867999001,0.54024785628466199,null,null,"MIN",{"$f":"ROUND(G83,0)&\"g/s @ \"&G84&\" b ; \"&G85&\"K\"","v":"408g/s @ 14,84 b ; 8,301K"}]
[null,"U1/C0 off de / U1/C0 nom",null,{"$f":"D109/$D$40","v":1},{"$f":"E109/$D109","v":0.99214390051917711},{"$f":"F109/$D109","v":0.91764649230513329},{"$f":"G109/$D109","v":0.9072503841729328},{"$f":"H109/$D109","v":0.84297768717560939},{"$f":"I109/$D109","v":0.87101636464168142},null,null,"STS",{"$f":"ROUND(H83,0)&\"g/s @ \"&H84&\" b ; \"&H85&\"K\"","v":"340g/s @ 13,54 b ; 9,722K"}]
[null,"Rdt",null,{"$f":"(0.321*D110^4-1.6098*D110^3+1.316*D110^2+0.9448*D110)*($D88/0.97)","v":0.73150515463917531},0.73124589629827341,0.72160494577218692,0.71925001320033477,0.69943561116273223,0.70917518045315897,null,null,"BAKING",{"$f":"ROUND(I83,0)&\"g/s @ \"&I84&\" b ; \"&I85&\"K\"","v":"370g/s @ 14,2 b ; 9,184K"}]
[]
[null,null,null,null,null,null,null,null,null,null,null,null,{"$f":"M38","v":"T1"},{"$f":"M107","v":"T3"},"T1+T2"]
[null,"Courbe de rendement TC3",null,null,null,null,null,null,null,null,null,{"$f":"L108","v":"MAX"},{"$f":"M39","v":"26g/s @ 12,11 b ; 41,44K"},{"$f":"M108","v":"427g/s @ 15,34 b ; 8,08K"},{"$f":"F83+F49","v":701.4}]
[null,null,null,null,null,null,null,null,null,null,null,{"$f":"L109","v":"MIN"},{"$f":"M40","v":"0g/s @  b ; K"},{"$f":"M109","v":"408g/s @ 14,84 b ; 8,301K"},{"$f":"G83+G49","v":672.9}]
[null,null,null,null,null,null,null,null,null,null,null,{"$f":"L110","v":"STS"},{"$f":"M41","v":"0g/s @  b ; K"},{"$f":"M110","v":"340g/s @ 13,54 b ; 9,722K"},{"$f":"H83+H49","v":542}]
[null,null,null,null,null,null,null,null,null,null,null,{"$f":"L111","v":"BAKING"},{"$f":"M42","v":"0g/s @  b ; K"},{"$f":"M111","v":"370g/s @ 14,2 b ; 9,184K"},{"$f":"I83+I49","v":569}]
[null,null,null,null,"d : mm"]
[null,null,null,null,"N : Hz"]
[null,null,null,null,"H : J/kG"]
[]
[]
[]
[]
[]
[null,"rendement=(0,321*rap^4 - 1,6098*rap^3 + 1,316*rap^2 + 0,9448*rap)*(ETAgar/0,97)",null,null,null,null,null,null,"U1/CO _nom",0.64]
[null,null,null,null,null,null,null,null,"Eta_gar",0.8]
[null,"U1/C0",{"$f":"D19","v":0.73},{"$f":"D54","v":0.78},{"$f":"D88","v":0.73}]
[null,0,{"$f":"(0.321*B129^4-1.6098*B129^3+1.316*B129^2+0.9448*B129)*$D$19/0.97215493","v":0}]
[null,{"$f":"B129+0.05","v":0.05},{"$f":"(0.321*$B130^4-1.6098*$B130^3+1.316*$B130^2+0.9448*$B130)*$C$128/0.97215493","v":3.7793842502552556E-2},{"$f":"(0.321*$B130^4-1.6098*$B130^3+1.316*$B130^2+0.9448*$B130)*$D$128/0.97215493","v":4.0382461852042459E-2},{"$f":"(0.321*$B130^4-1.6098*$B130^3+1.316*$B130^2+0.9448*$B130)*$E$128/0.97215493","v":3.7793842502552556E-2}]
[null,0.1,7.964314803197059E-2,8.5098158171146673E-2,7.964314803197059E-2]
[null,0.15000000000000002,0.12469554087690531,0.13323633134792623,0.12469554087690531]
[null,0.2,0.17213480159998779,0.18392485650409657,0.17213480159998779]
[null,0.25,0.22118086703782905,0.23633024149247489,0.22118086703782905]
[null,0.3,0.27108983030102002,0.28965762689698032,0.27108983030102002]
[null,0.35,0.32115394077413151,0.34315078603263366,0.32115394077413151]
[null,0.39999999999999997,0.37070160411571434,0.39609212494555779,0.37070160411571434]
[null,0.44999999999999996,0.41909738225829907,0.4478026824129771,0.41909738225829907]
[null,0.49999999999999994,0.46574199340839634,0.49764212994321799,0.46574199340839634]
[null,0.54999999999999993,0.5100723120464965,0.54500877177570861,0.5100723120464965]
[null,0.6,0.55156136892707008,0.58933954488097895,0.55156136892707008]
[null,0.65,0.58971835107856729,0.63011001896066099,0.58971835107856729]
[null,0.70000000000000007,0.62408860180341841,0.66683439644748832,0.62408860180341841]
[null,0.75000000000000011,0.65425362067803339,0.69906551250529614,0.65425362067803339]
[null,0.80000000000000016,0.67983106355280232,0.7263948350290218,0.67983106355280232]
[null,0.8500000000000002,0.70047474255209508,0.74845246464470438,0.70047474255209508]
[null,0.90000000000000024,0.71587462607426167,0.76490713470948513,0.71587462607426167]
[null,0.95000000000000029,0.72575683879163178,0.77546621131160665,0.72575683879163178]
[null,1.0000000000000002,0.7298836616505151,0.77987569327041351,0.7298836616505151]
[null,1.0500000000000003,0.72805353187120092,0.77792021213635165,0.72805353187120092]
[null,1.1000000000000003,0.72010104294795907,0.76942303219096997,0.72010104294795907]
[null,1.1500000000000004,0.70589694464903885,0.75424605044691839,0.70589694464903885]
[null,1.2000000000000004,0.68534814301666902,0.7322897966479478,0.68534814301666902,null,"F Let u be the peripheral speed of the wheel : u = p . Æ . N / 60                      (in m/s)"]
[null,1.2500000000000004,0.6583977003670598,0.70349343326891334,0.6583977003670598,null,"F Let n, be the speed ratio of the turbine : n =  u / [ 2 . (H1 - H2S ) ] 0.5       (dimensionless number)"]
[null,1.3000000000000005,0.62502483529039965,0.66783475551576954,0.62502483529039965,null,null,"N = speed of rotation of the turbine (in rpm)"]
[null,1.3500000000000005,0.58524492265085759,0.62533019132557388,0.58524492265085759,null,null,"Æ = diameter of the wheel of the turbine (in m)"]
[null,1.4000000000000006,0.53910949358658278,0.57603480136648577,0.53910949358658278]
[null,1.4500000000000006,0.48670623550970399,0.5200422790377659,0.48670623550970399]
[null,1.5000000000000007,0.42815899210633013,0.45748495046977738,0.42815899210633013]