{"text_format":"1","workbook":"xlsx","n_sheets":10,"sheets":["Sheet1","JT60","JT60_after_test","rhea","Turbines_JT60SA_serial_indep","Turbines_JT60SA_serial","Turbines_JT60SA_serial_Frein T1","Turbines_JT60SA (2)","Fluides","Turbines_Hefei"],"not_rendered":{"charts":25,"images":9,"macros":1,"external_links":3,"defined_names":248,"comments":0,"pivot_tables":0},"unopened":[],"bounds":{"document_bytes":16777216,"sheet_cells":100000,"rows_first":2000,"rows_last":500,"rows_between":2000,"halvings":0,"cell_chars":16384,"cell_head_chars":4096},"cells_cut":0,"cells_raw":0,"read":"whole","date_system":"1900"}

{"sheet":"Sheet1","index":0,"n_rows":39,"n_cols":10,"rows_kept":39,"cut":false,"hidden":false,"merged":[]}
[]
[null,null,"Quelles sont la température d’échappement et la puissance"]
[null,null,"d’une turbine pour les conditions de fonctionnement suivantes :"]
[null,null,"– débit :",null,null,50]
[null,null,"– pression d’admission :",null,null,15]
[null,null,"– température d’admission : ",null,null,20]
[null,null,"– pression d’échappement : ",null,null,1.2]
[null,null,"– efficacité de la turbine :",null,null,0.75]
[]
[]
[]
[]
[null,null,null,{"$f":"F4","v":50},null,"h1 =",{"$f":"[3]!h_(11,D14,D15)","v":112.15237827852853}]
[null,null,null,15,null,"s1 =",{"$f":"[3]!S_(11,D14,D15)","v":11.573214772468591}]
[null,null,null,20]
[null,null,null,null,null,"h2_is =",{"$f":"+[1]!HeCalc(9,0,1,D25*10^5,8,G14*1000,1)/1000","v":49.353224321010146}]
[null,null,null,null,null,"Δhis = h1-h2_is =",{"$f":"G13-G16","v":62.799153957518385}]
[null,null,null,null,null,"ΔhR = Δhis x η = ",{"$f":"G17*C19","v":50.239323166014714}]
[null,null,0.8]
[null,null,null,null,null,"h2 =",{"$f":"G13-G18","v":61.913055112513817}]
[]
[null,null,null,null,null,"T2 = ",{"$f":"[1]!HeCalc(2,0,1,D25*10^5,9,G20*1000,1)","v":9.4060700932984762}]
[]
[null,null,null,null,null,"P=",{"$f":"D13*G18","v":2511.9661583007355}]
[null,null,null,1.2]
[]
[]
[]
[]
[]
[null,null,"P (bar)",13.71]
[null,null,"T (K)"]
[null,null,6.2759999999999998]
[]
[]
[]
[null,null,null,null,null,"H\n(J/g)","m\n(g/s)","Power\n(W)","a","Efficacité"]
[null,null,null,null,43.64,{"$f":"[3]!h_(11,D31,E38)","v":242.81566478060728},25,{"$f":"G38*(F38-F39)","v":1248.0020316016053},{"$f":"G38*(E38)^0.5/D31","v":12.046057304824028},{"$f":"C19","v":0.8}]
[null,null,null,null,{"$f":"[3]!T2_turb(11,D31,E38,C33,J38)","v":34.28308532549616},{"$f":"[3]!h_(11,C33,E39)","v":192.89558351654307}]

{"sheet":"JT60","index":1,"n_rows":201,"n_cols":32,"rows_kept":201,"cut":false,"hidden":false,"merged":[]}
[1,2,3,4,5,6,7,8,9,10,11,12,13,14,15,16,17,18,19,20,21,22,23,24,25,26,27,28]
[null,null,null,null,null,null,null,null,null,null,null,null,null,null,null,null,null,null,null,null,null,null,null,null,null,null,null,null,null,null,null,{"$f":"1-1/3","v":0.66666666666666674}]
[]
[]
[null,null,null,null,"Vitesse de la roue ajustée en fonction de la puissance du frein",null,null,null,null,null,null,{"$f":"D56*0.3","v":492}]
[]
[]
[null,"Relation entre la puissance et la vitesse de rotation",null,null,null,null,null,null,null,null,null,null,"²"]
[]
[null,"TURBINE 1"]
[null,null,null,null,null,{"$f":"IF(ISERROR(F14),\"\",\"X\")","v":"X"},"X",{"$f":"IF(ISERROR(H14),\"\",\"X\")","v":"X"},{"$f":"IF(ISERROR(I14),\"\",\"X\")","v":"X"}]
[null,null,null,"DESIGN",null,"D3","STS","start-up",{"$f":"L41","v":"BAKING"}]
[]
[null,"m","g/s",175.1,null,100,{"$f":"G26*G15/G16^0.5","v":159.38936459432313},{"$f":"H26*H15/H16^0.5","v":104.0903562510469},{"$f":"I26*I15/I16^0.5","v":124.64733194814868},null,{"$f":"F14/D14","v":0.57110222729868654}]
[null,"Pin","Bara",14.77,null,{"$f":"F14*F16^0.5/F26","v":7.2059091803185931},12.39,10.3,9.25]
[null,"Tin","K",47.96,null,35,40.729999999999997,66,37.119999999999997]
[null,"Pout","Bara",6.35,null,6.36,5.242,4.97,4.0599999999999996]
[null,"Tout","K",{"$f":"[3]!T2_turb(11,D15,D16,D17,D19)","v":37.275133595036564},null,{"$f":"[3]!T2_turb(11,F15,F16,F17,F19)","v":33.718742473196585},{"$f":"[3]!T2_turb(11,G15,G16,G17,G19)","v":31.551197774927278},{"$f":"[3]!T2_turb(11,H15,H16,H17,H19)","v":53.282254863550051},{"$f":"[3]!T2_turb(11,I15,I16,I17,I19)","v":29.202166575326608}]
[null,"Efficacity","%",0.78,null,{"$f":"(0.321*F40^4-1.6098*F40^3+1.316*F40^2+0.9448*F40)*($D$19/0.97215493)","v":0.75017046787317354},{"$f":"(0.321*G40^4-1.6098*G40^3+1.316*G40^2+0.9448*G40)*($D$19/0.97215493)","v":0.77400829380513414},{"$f":"(0.321*H40^4-1.6098*H40^3+1.316*H40^2+0.9448*H40)*($D$19/0.97215493)","v":0.76555522653230201},{"$f":"(0.321*I40^4-1.6098*I40^3+1.316*I40^2+0.9448*I40)*($D$19/0.97215493)","v":0.75842759903123302}]
[null,"Power","W",{"$f":"+D14*(D30-D31)","v":10009.689881122928},null,{"$f":"+F14*(F30-F31)","v":676.0595180402845},{"$f":"+G14*(G30-G31)","v":7765.9510772249396},{"$f":"+H14*(H30-H31)","v":7022.957940416667},{"$f":"+I14*(I30-I31)","v":5196.4086587242782}]
[null,"Speed","Hz",2170,null,883.13125588151024,2167.6215071346046,2147.4019498361417,2139.0494906717577,null,{"$f":"F21/D21","v":0.40697292897765447}]
[null,"Speed calculated from P=K.rho.N^3",null,null,null,{"$f":"(F20/$D20*$D23/F23)^(1/3)*$D21","v":883.13127088903138},{"$f":"(G20/$D20*$D23/G23)^(1/3)*$D21","v":2167.6215867855431},{"$f":"(H20/$D20*$D23/H23)^(1/3)*$D21","v":2147.4020340068364},{"$f":"(I20/$D20*$D23/I23)^(1/3)*$D21","v":2139.0496413395958}]
[null,"Brake Pressure",null,5,null,{"$f":"($D23-$D17)+F17","v":5.0100000000000007},{"$f":"($D23-$D17)+G17","v":3.8920000000000003},{"$f":"($D23-$D17)+H17","v":3.62},{"$f":"($D23-$D17)+I17","v":2.71}]
[null,"Rho (brake)",null,{"$f":"[3]!rho_(11,D23,330)","v":0.72791980970899706},null,{"$f":"[3]!rho_(11,F23,330)","v":0.72937266470245588},{"$f":"[3]!rho_(11,G23,330)","v":0.56686976847787252},{"$f":"[3]!rho_(11,H23,330)","v":0.52731167398441658},{"$f":"[3]!rho_(11,I23,330)","v":0.39490250420592704}]
[null,"Wheel","mm",35.75,null,{"$f":"$D$25","v":35.75},{"$f":"$D$25","v":35.75},{"$f":"$D$25","v":35.75},{"$f":"$D$25","v":35.75}]
[null,"a = mÖT/P",null,{"$f":"D14*D16^0.5/D15","v":82.100393372402309},null,{"$f":"+$D$26","v":82.100393372402309},{"$f":"+$D$26","v":82.100393372402309},{"$f":"+$D$26","v":82.100393372402309},{"$f":"+$D$26","v":82.100393372402309}]
[null,"Rho (in)","kg/m3",{"$f":"[3]!rho_(11,D15,D16)","v":14.294096859114665},null,{"$f":"[3]!rho_(11,F15,F16)","v":9.7272626001699756},{"$f":"[3]!rho_(11,G15,G16)","v":14.178141597167654},{"$f":"[3]!rho_(11,H15,H16)","v":7.3557574001558121},{"$f":"[3]!rho_(11,I15,I16)","v":11.708162912666104}]
[null,"Sound Speed @inlet",null,{"$f":"[3]!Sound_speed(11,D15,D16)","v":425.29271447964169},null,{"$f":"[3]!Sound_speed(11,F15,F16)","v":357.55297893381982},{"$f":"[3]!Sound_speed(11,G15,G16)","v":391.28919888209964},{"$f":"[3]!Sound_speed(11,H15,H16)","v":488.85573725029269},{"$f":"[3]!Sound_speed(11,I15,I16)","v":370.51577371924787}]
[null,"S=Q/(rho*V) = cte",null,{"$f":"D14/(D27*D28)","v":2.8803249236423915E-2},null,{"$f":"F14/(F27*F28)","v":2.8752059528018074E-2},{"$f":"G14/(G27*G28)","v":2.8730432920425243E-2},{"$f":"H14/(H27*H28)","v":2.8946921347814538E-2},{"$f":"I14/(I27*I28)","v":2.8733433728498289E-2}]
[null,"Hin",null,{"$f":"[3]!h_(11,D15,D16)","v":265.9017573841171},null,{"$f":"[3]!h_(11,F15,F16)","v":196.65614142710913},{"$f":"[3]!h_(11,G15,G16)","v":227.21274224322462},{"$f":"[3]!h_(11,H15,H16)","v":360.14220393657763},{"$f":"[3]!h_(11,I15,I16)","v":207.89085729231627}]
[null,"Hout",null,{"$f":"[3]!h_(11,D17,D18)","v":208.73619552733282},null,{"$f":"[3]!h_(11,F17,F18)","v":189.89554624670629},{"$f":"[3]!h_(11,G17,G18)","v":178.48959752782412},{"$f":"[3]!h_(11,H17,H18)","v":292.67238066612424},{"$f":"[3]!h_(11,I17,I18)","v":166.20196931125702}]
[null,"Sin = Sout",null,{"$f":"[3]!S_(11,D15,D16)","v":16.453189234967173},null,{"$f":"[3]!S_(11,F15,F16)","v":16.302696953936234},{"$f":"[3]!S_(11,G15,G16)","v":15.956591869557485},{"$f":"[3]!S_(11,H15,H16)","v":18.892034584941154},{"$f":"[3]!S_(11,I15,I16)","v":16.084358655112414}]
[null,"Tout(iso)",null,{"$f":"[1]!HeCalc(2,0,1,D17*10^5,8,D32*1000,1)","v":34.230530549481237},null,{"$f":"[1]!HeCalc(2,0,1,F17*10^5,8,F32*1000,1)","v":33.294835063569472},{"$f":"[1]!HeCalc(2,0,1,G17*10^5,8,G32*1000,1)","v":28.875086473743544},{"$f":"[1]!HeCalc(2,0,1,H17*10^5,8,H32*1000,1)","v":49.330781375480868},{"$f":"[1]!HeCalc(2,0,1,I17*10^5,8,I32*1000,1)","v":26.699737772795068}]
[null,"Hout(iso)",null,{"$f":"[3]!h_(11,D17,D33)","v":192.61257551644499},null,{"$f":"[3]!h_(11,F17,F33)","v":187.64406287972238},{"$f":"[3]!h_(11,G17,G33)","v":164.26361740133086},{"$f":"[3]!h_(11,H17,H33)","v":272.01032143860527},{"$f":"[3]!h_(11,I17,I33)","v":152.92333233105427}]
[null,"ΔHs",null,{"$f":"D30-D34","v":73.289181867672113},null,9.01207854738675,62.949124841893763,88.131882497972356,54.967524961262001]
[null,"u1","m/s",{"$f":"(2*52.7%*D35*1000*D19)^0.5","v":245.46385110042294},null,{"$f":"PI()*$D$37*F21","v":99.897142440473985},{"$f":"PI()*$D$37*G21","v":245.19480316560504},{"$f":"PI()*$D$37*H21","v":242.90762786513207},{"$f":"PI()*$D$37*I21","v":241.96282289156122}]
[null,"D1",null,{"$f":"D36/PI()/D21","v":3.6006253689405791E-2},null,null,null,null,null,null,null,null,"T1"]
[null,"Co = (2*ΔHs)^0,5",null,{"$f":"(2000*D35)^0.5","v":382.85553899002718},null,134.25407664117131,354.82143351802682,419.83778414519185,331.56454865157707,null,null,"MAX",{"$f":"ROUND(F14,0)&\"g/s @ \"&F15&\" b ; \"&F16&\"K\"","v":"100g/s @ 7,20590918031859 b ; 35K"}]
[null,"u1/Co",null,{"$f":"D36/D38","v":0.64113961038138956},null,0.7440901977783132,0.69103718096879807,0.578574956896037,0.72976083804974767,null,null,"MIN",{"$f":"ROUND(G14,0)&\"g/s @ \"&G15&\" b ; \"&G16&\"K\"","v":"159g/s @ 12,39 b ; 40,73K"}]
[null,"U1/C0 off de / U1/C0 nom",null,{"$f":"D39/$D$39","v":1},null,{"$f":"F39/$D39","v":1.1605743674699529},{"$f":"G39/$D39","v":1.0778263731946407},{"$f":"H39/$D39","v":0.90241649014925907},{"$f":"I39/$D39","v":1.1382245399182882},null,null,"STS",{"$f":"ROUND(H14,0)&\"g/s @ \"&H15&\" b ; \"&H16&\"K\"","v":"104g/s @ 10,3 b ; 66K"}]
[null,"Rdt",null,{"$f":"(0.321*D40^4-1.6098*D40^3+1.316*D40^2+0.9448*D40)*($D19/0.97215493)","v":0.77987569327041328},null,{"$f":"(0.321*F40^4-1.6098*F40^3+1.316*F40^2+0.9448*F40)*($D19/0.97215493)","v":0.75017046787317354},{"$f":"(0.321*G40^4-1.6098*G40^3+1.316*G40^2+0.9448*G40)*($D19/0.97215493)","v":0.77400829380513414},{"$f":"(0.321*H40^4-1.6098*H40^3+1.316*H40^2+0.9448*H40)*($D19/0.97)","v":0.76725596666045792},{"$f":"(0.321*I40^4-1.6098*I40^3+1.316*I40^2+0.9448*I40)*($D19/0.97215493)","v":0.75842759903123302},null,null,"BAKING",{"$f":"ROUND(I14,0)&\"g/s @ \"&I15&\" b ; \"&I16&\"K\"","v":"125g/s @ 9,25 b ; 37,12K"}]
["ligne_ToBeNull_T1","Converge brake Power",null,null,null,{"$f":"F21-F22","v":-1.500752114225179E-5},{"$f":"G21-G22","v":-7.9650938459963072E-5},{"$f":"H21-H22","v":-8.4170694663043832E-5},{"$f":"I21-I22","v":-1.5066783817019314E-4}]
["ligne_ToChange_T1","By changing turbine speed",null,null,null,{"$f":"CELL(\"address\",F21)","v":"$F$21"},{"$f":"CELL(\"address\",G21)","v":"$G$21"},{"$f":"CELL(\"address\",H21)","v":"$H$21"},{"$f":"CELL(\"address\",I21)","v":"$I$21"}]
[]
[null,"TURBINE 2"]
[null,null,null,null,null,{"$f":"IF(ISERROR(F49),\"\",\"X\")","v":"X"},"X",{"$f":"IF(ISERROR(H49),\"\",\"X\")","v":"X"},{"$f":"IF(ISERROR(I49),\"\",\"X\")","v":"X"}]
[null,null,null,"DESIGN",null,{"$f":"F12","v":"D3"},{"$f":"G12","v":"STS"},{"$f":"H12","v":"start-up"},{"$f":"I12","v":"BAKING"},null,null,null,null,null,null,null,null,null,"K.rho"]
[null,null,null,null,null,null,null,18,null,null,null,null,null,null,null,null,838,2075,{"$f":"R48/Q48^(3)","v":3.5260303420909438E-6}]
[null,"m","g/s",174.8,null,{"$f":"F14","v":100},{"$f":"G14","v":159.38936459432313},{"$f":"H61/(H52*H51)^0.5*H50","v":80.515031911483661},{"$f":"I14","v":124.64733194814868},null,null,null,null,null,null,null,650,{"$f":"S48*Q49^3","v":968.33608269672538}]
[null,"Pin","Bara",6.343,null,{"$f":"F49*F51^0.5/F61","v":3.7267540026774166},{"$f":"G49*G51^0.5/G61","v":5.2273543146123771},4.87,{"$f":"I49*I51^0.5/I61","v":4.0206063522286088},null,null,null,null,null,null,null,{"$f":"Q49/Q48","v":0.77565632458233891},{"$f":"R49/R48","v":0.46666799166107248}]
[null,"Tin","K",21.73,null,22.92,17.75,52.5,17.170000000000002]
[null,"Pout","Bara",1.35,null,1.35,1.29,1.1499999999999999,1.35]
[null,"Tout","K",{"$f":"[3]!T2_turb(11,D50,D51,D52,D54)","v":13.946206953428996},null,{"$f":"[3]!T2_turb(11,F50,F51,F52,F54)","v":17.249951640667003},{"$f":"[3]!T2_turb(11,G50,G51,G52,G54)","v":11.782714725874531},{"$f":"[3]!T2_turb(11,H50,H51,H52,H54)","v":38.886608977906057},{"$f":"[3]!T2_turb(11,I50,I51,I52,I54)","v":12.431557134172412}]
[null,"Efficacity","%",0.76,null,{"$f":"(0.321*F75^4-1.6098*F75^3+1.316*F75^2+0.9448*F75)*($D$54/0.97215493)","v":0.73153574861321635},{"$f":"(0.321*G75^4-1.6098*G75^3+1.316*G75^2+0.9448*G75)*($D$54/0.97215493)","v":0.7598604233601256},{"$f":"(0.321*H75^4-1.6098*H75^3+1.316*H75^2+0.9448*H75)*($D$54/0.97215493)","v":0.59253584008890492},{"$f":"(0.321*I75^4-1.6098*I75^3+1.316*I75^2+0.9448*I75)*($D$54/0.97215493)","v":0.75822695264831264}]
[null,"Power","W",{"$f":"+D49*(D65-D66)","v":6836.2013435692179},null,{"$f":"+F49*(F65-F66)","v":2898.2926811772686},{"$f":"+G49*(G65-G66)","v":4662.5031967824698},{"$f":"+H49*(H65-H66)","v":5745.2340360281414},{"$f":"+I49*(I65-I66)","v":2918.2634379396923}]
[null,"Speed","Hz",1640,null,1232.0253099391032,1447.4648898855867,1561.6640068320348,1234.8485972457079]
[null,"Speed calculated from P=K.rho.N^3",null,null,null,{"$f":"(F55/$D55*$D58/F58)^(1/3)*$D56","v":1232.0253568455942},{"$f":"(G55/$D55*$D58/G58)^(1/3)*$D56","v":1447.4649507457495},{"$f":"(H55/$D55*$D58/H58)^(1/3)*$D56","v":1561.6640359913827},{"$f":"(I55/$D55*$D58/I58)^(1/3)*$D56","v":1234.8486490598375}]
[null,"Brake Pressure",null,7.5,null,{"$f":"($D58-$D52)+F52","v":7.5},{"$f":"($D58-$D52)+G52","v":7.44},{"$f":"($D58-$D52)+H52","v":7.3000000000000007},{"$f":"($D58-$D52)+I52","v":7.5}]
[null,"Rho (brake)",null,{"$f":"[3]!rho_(11,D58,345)","v":1.0434974503076984},null,{"$f":"[3]!rho_(11,F58,345)","v":1.0434974503076984},{"$f":"[3]!rho_(11,G58,345)","v":1.0351736195485253},{"$f":"[3]!rho_(11,H58,345)","v":1.0157498362222053},{"$f":"[3]!rho_(11,I58,345)","v":1.0434974503076984}]
[null,"Wheel","mm",39.5,null,{"$f":"$D$25","v":35.75},{"$f":"$D$25","v":35.75},{"$f":"$D$25","v":35.75},{"$f":"$D$25","v":35.75}]
[null,"a = mÖT/P",null,{"$f":"D49*D51^0.5/D50","v":128.46256227255276},null,{"$f":"$D$61","v":128.46256227255276},{"$f":"$D$61","v":128.46256227255276},128.46256227255276,128.46256227255276]
[null,"Rho (in)","kg/m3",{"$f":"[3]!rho_(11,D50,D51)","v":13.984625352843739},null,{"$f":"[3]!rho_(11,F50,F51)","v":7.7963630652726579},{"$f":"[3]!rho_(11,G50,G51)","v":14.318793134345936},{"$f":"[3]!rho_(11,H50,H51)","v":4.414094182882728},{"$f":"[3]!rho_(11,I50,I51)","v":11.393308586197715}]
[null,"Sound Speed",null,{"$f":"[3]!Sound_speed(11,D50,D51)","v":282.3968331330957},null,{"$f":"[3]!Sound_speed(11,F50,F51)","v":286.40289367517028},{"$f":"[3]!Sound_speed(11,G50,G51)","v":253.62559081263998},{"$f":"[3]!Sound_speed(11,H50,H51)","v":431.99130225370175},{"$f":"[3]!Sound_speed(11,I50,I51)","v":247.88257543852899},null,null,null,null,null,null,null,null,null,null,"T2"]
[null,"S=Q/(rho*V) = cte",null,{"$f":"D49/(D62*D63)","v":4.4261973113228083E-2},null,{"$f":"F49/(F62*F63)","v":4.4784790098572086E-2},{"$f":"G49/(G62*G63)","v":4.3889421123312337E-2},{"$f":"H49/(H62*H63)","v":4.2224097062430868E-2},{"$f":"I49/(I62*I63)","v":4.4135406090562969E-2},null,null,null,null,null,null,null,null,null,"MAX",{"$f":"ROUND(F49,0)&\"g/s @ \"&F50&\" b ; \"&F51&\"K\"","v":"100g/s @ 3,72675400267742 b ; 22,92K"}]
[null,"Hin",null,{"$f":"[3]!h_(11,D50,D51)","v":125.41005120529508},null,{"$f":"[3]!h_(11,F50,F51)","v":132.86569503127348},{"$f":"[3]!h_(11,G50,G51)","v":103.98873588204826},{"$f":"[3]!h_(11,H50,H51)","v":288.57025422464784},{"$f":"[3]!h_(11,I50,I51)","v":101.57612077740926},null,null,null,null,null,null,null,null,null,"MIN",{"$f":"ROUND(G49,0)&\"g/s @ \"&G50&\" b ; \"&G51&\"K\"","v":"159g/s @ 5,22735431461238 b ; 17,75K"}]
[null,"Hout",null,{"$f":"[3]!h_(11,D52,D53)","v":86.301347866798409},null,{"$f":"[3]!h_(11,F52,F53)","v":103.88276821950079},{"$f":"[3]!h_(11,G52,G53)","v":74.736450394560151},{"$f":"[3]!h_(11,H52,H53)","v":217.21421176111983},{"$f":"[3]!h_(11,I52,I53)","v":78.163959503442769},null,null,null,null,null,null,null,null,null,"STS",{"$f":"ROUND(H49,0)&\"g/s @ \"&H50&\" b ; \"&H51&\"K\"","v":"81g/s @ 4,87 b ; 52,5K"}]
[null,"Sin = Sout",null,{"$f":"[3]!S_(11,D50,D51)","v":14.009489986768525},null,{"$f":"[3]!S_(11,F50,F51)","v":15.453300140193745},{"$f":"[3]!S_(11,G50,G51)","v":13.321532380335615},{"$f":"[3]!S_(11,H50,H51)","v":19.260113557237521},{"$f":"[3]!S_(11,I50,I51)","v":13.722933357323198},null,null,null,null,null,null,null,null,null,"BAKING",{"$f":"ROUND(I49,0)&\"g/s @ \"&I50&\" b ; \"&I51&\"K\"","v":"125g/s @ 4,02060635222861 b ; 17,17K"}]
[null,"Tout(iso)",null,{"$f":"[1]!HeCalc(2,0,1,D52*10^5,8,D67*1000,1)","v":11.652703920775352},null,{"$f":"[1]!HeCalc(2,0,1,F52*10^5,8,F67*1000,1)","v":15.247077785823569},{"$f":"[1]!HeCalc(2,0,1,G52*10^5,8,G67*1000,1)","v":10.085380775646078},{"$f":"[1]!HeCalc(2,0,1,H52*10^5,8,H67*1000,1)","v":29.476863341337229},{"$f":"[1]!HeCalc(2,0,1,I52*10^5,8,I67*1000,1)","v":11.054468898008913}]
[null,"Hout(iso)",null,{"$f":"[3]!h_(11,D52,D68)","v":73.951231023065759},null,{"$f":"[3]!h_(11,F52,F68)","v":93.246405247122837},{"$f":"[3]!h_(11,G52,G68)","v":65.491816463422225},{"$f":"[3]!h_(11,H52,H68)","v":168.14539949717414},{"$f":"[3]!h_(11,I52,I68)","v":70.698609509588508}]
[null,"ΔHs",null,{"$f":"D65-D69","v":51.458820182229317},null,39.619289784150638,38.496919418626035,120.4248547274737,30.877511267820751]
[null,"u1","m/s",{"$f":"(2*52.7%*D70*1000*D54)^0.5","v":203.02850371012678},null,{"$f":"PI()*$D$72*F56","v":152.52210683533008},{"$f":"PI()*$D$72*G56","v":179.19306754049643},193.33067475918858,152.87162378496652]
[null,"D1",null,{"$f":"D71/PI()/D56","v":3.9406085309777919E-2}]
[null,"Co = (2*ΔHs)^0,5",null,{"$f":"(2000*D70)^0.5","v":320.80779349083565},null,281.49348050763319,277.47763664348173,490.76441339500911,248.50557847992368]
[null,"u1/Co",null,{"$f":"D71/D73","v":0.63286649461004008},null,0.54183175596208588,0.64579282751616263,0.39393784366263646,0.61516375093091413]
[null,"U1/C0 off de / U1/C0 nom",null,{"$f":"D74/$D$39","v":0.98709623358564902},null,{"$f":"F74/$D74","v":0.85615490877890765},{"$f":"G74/$D74","v":1.0204250549147613},{"$f":"H74/$D74","v":0.62246594979778991},{"$f":"I74/$D74","v":0.97202768067215495}]
[null,"Rdt",null,{"$f":"(0.321*D75^4-1.6098*D75^3+1.316*D75^2+0.9448*D75)*($D54/0.97215493)","v":0.7593560473099612},null,{"$f":"(0.321*F75^4-1.6098*F75^3+1.316*F75^2+0.9448*F75)*($D54/0.97215493)","v":0.73153574861321635},{"$f":"(0.321*G75^4-1.6098*G75^3+1.316*G75^2+0.9448*G75)*($D54/0.97215493)","v":0.7598604233601256},{"$f":"(0.321*H75^4-1.6098*H75^3+1.316*H75^2+0.9448*H75)*($D54/0.97215493)","v":0.59253584008890492},{"$f":"(0.321*I75^4-1.6098*I75^3+1.316*I75^2+0.9448*I75)*($D54/0.97215493)","v":0.75822695264831264}]
["ligne_ToBeNull_T2","Converge brake Power",null,null,null,{"$f":"F56-F57","v":-4.6906490979381488E-5},{"$f":"G56-G57","v":-6.0860162875542301E-5},{"$f":"H56-H57","v":-2.9159347832319327E-5},{"$f":"I56-I57","v":-5.1814129619742744E-5}]
["ligne_ToChange_T2","By changing turbine speed",null,null,null,{"$f":"CELL(\"address\",F56)","v":"$F$56"},{"$f":"CELL(\"address\",G56)","v":"$G$56"},{"$f":"CELL(\"address\",H56)","v":"$H$56"},{"$f":"CELL(\"address\",I56)","v":"$I$56"}]
[]
[null,"CV330"]
[null,"Pin","Bara",13.15,null,13.15,13.25,13.5,12.25,13.15,13.15,13.15,13.15,13.15,13.15,13.15,13.15,13.15,13.15,13.15,13.15,13.15,13.15,13.15,13.15,13.15,13.15,13.15]
[null,"Tin","K",{"$f":"[3]!T_P_H_(11,D81,[3]!h_(11,D96,D97))","v":8.83514415424081},null,{"$f":"[3]!T_P_H_(11,F81,[3]!h_(11,F96,F97))","v":9.1661496679837366},{"$f":"[3]!T_P_H_(11,G81,[3]!h_(11,G96,G97))","v":8.6223146254179426},{"$f":"+H97","v":8.8279999999999994},{"$f":"[3]!T_P_H_(11,I81,[3]!h_(11,I96,I97))","v":10.795640526772669},{"$f":"[3]!T_P_H_(11,J81,[3]!h_(11,J96,J97))","v":7.289570189226823},{"$f":"[3]!T_P_H_(11,K81,[3]!h_(11,K96,K97))","v":7.2875494761866335},{"$f":"[3]!T_P_H_(11,L81,[3]!h_(11,L96,L97))","v":7.286091223216423},{"$f":"[3]!T_P_H_(11,M81,[3]!h_(11,M96,M97))","v":7.2817678358976652},{"$f":"[3]!T_P_H_(11,N81,[3]!h_(11,N96,N97))","v":7.2801751232542466},{"$f":"[3]!T_P_H_(11,O81,[3]!h_(11,O96,O97))","v":7.2808852270882953},{"$f":"[3]!T_P_H_(11,P81,[3]!h_(11,P96,P97))","v":7.2835767670375562},{"$f":"[3]!T_P_H_(11,Q81,[3]!h_(11,Q96,Q97))","v":7.2929775419785274},{"$f":"[3]!T_P_H_(11,R81,[3]!h_(11,R96,R97))","v":7.309641747149449},{"$f":"[3]!T_P_H_(11,S81,[3]!h_(11,S96,S97))","v":7.3351707676476412},{"$f":"[3]!T_P_H_(11,T81,[3]!h_(11,T96,T97))","v":7.3715975333960877},{"$f":"[3]!T_P_H_(11,U81,[3]!h_(11,U96,U97))","v":7.4214865443397402},{"$f":"[3]!T_P_H_(11,V81,[3]!h_(11,V96,V97))","v":7.4880009996514749},{"$f":"[3]!T_P_H_(11,W81,[3]!h_(11,W96,W97))","v":7.574845195653733},{"$f":"[3]!T_P_H_(11,X81,[3]!h_(11,X96,X97))","v":7.6859260832822134},{"$f":"[3]!T_P_H_(11,Y81,[3]!h_(11,Y96,Y97))","v":7.8246161009732589},{"$f":"[3]!T_P_H_(11,Z81,[3]!h_(11,Z96,Z97))","v":7.9928254087617381},{"$f":"[3]!T_P_H_(11,AA81,[3]!h_(11,AA96,AA97))","v":8.190438152641093},{"$f":"[3]!T_P_H_(11,AB81,[3]!h_(11,AB96,AB97))","v":8.414996515030289}]
[null,"Rho",null,{"$f":"[3]!rho_(11,D81,D82)","v":97.618685329309102},null,{"$f":"[3]!rho_(11,F81,F82)","v":92.385436868539188},{"$f":"[3]!rho_(11,G81,G82)","v":101.58811590421918},{"$f":"[3]!rho_(11,H81,H82)","v":99.5385923004863},{"$f":"[3]!rho_(11,I81,I82)","v":66.476961067945879},{"$f":"[3]!rho_(11,J81,J82)","v":122.3554602961871},{"$f":"[3]!rho_(11,K81,K82)","v":122.38525605267236},{"$f":"[3]!rho_(11,L81,L82)","v":122.40675166263661},{"$f":"[3]!rho_(11,M81,M82)","v":122.47044880873382},{"$f":"[3]!rho_(11,N81,N82)","v":122.4939022601133},{"$f":"[3]!rho_(11,O81,O82)","v":122.48344645754396},{"$f":"[3]!rho_(11,P81,P82)","v":122.44380344539697},{"$f":"[3]!rho_(11,Q81,Q82)","v":122.30519433940992},{"$f":"[3]!rho_(11,R81,R82)","v":122.05892824408417},{"$f":"[3]!rho_(11,S81,S82)","v":121.68027091130101},{"$f":"[3]!rho_(11,T81,T82)","v":121.13709609048141},{"$f":"[3]!rho_(11,U81,U82)","v":120.3877662475066},{"$f":"[3]!rho_(11,V81,V82)","v":119.37920067123139},{"$f":"[3]!rho_(11,W81,W82)","v":118.04655161202567},{"$f":"[3]!rho_(11,X81,X82)","v":116.31729006265563},{"$f":"[3]!rho_(11,Y81,Y82)","v":114.12277996026393},{"$f":"[3]!rho_(11,Z81,Z82)","v":111.41624187103298},{"$f":"[3]!rho_(11,AA81,AA82)","v":108.18992422198602},{"$f":"[3]!rho_(11,AB81,AB82)","v":104.49208532283211}]
[null,"dP",null,{"$f":"(D81-D96)*1000","v":80.000000000000071},null,{"$f":"(F81-F96)*1000","v":80.000000000000071},5881,429.99999999999972,1769.9999999999995,25.000000000000355,150.00000000000034,{"$f":"(L81-L96)*1000","v":250},650.00000000000034,1150.0000000000005,1349.9999999999995,1650.0000000000005,{"$f":"(Q81-Q96)*1000","v":2150.0000000000005},2650.0000000000005,3150.0000000000005,3650.0000000000005,{"$f":"(U81-U96)*1000","v":4150},4650,5150,5650,6150,6650,7150,7650]
[null,"Cvs",null,30,null,30,30,30,30,30,30,30,30,30,30,30,30,30,30,30,30,30,30,30,30,30,30,30]
[null,"Range",null,250,null,250,250,250,250,250,250,250,250,250,250,250,250,250,250,250,250,250,250,250,250,250,250,250]
[null,"Flow",null,{"$f":"IF(D81/2>D96,\"S\",\"SS\")","v":"SS"},null,{"$f":"IF(F81/2>F96,\"S\",\"SS\")","v":"SS"},"SS","SS","SS","SS","SS",{"$f":"IF(L81/2>L96,\"S\",\"SS\")","v":"SS"},"SS","SS","SS","SS",{"$f":"IF(Q81/2>Q96,\"S\",\"SS\")","v":"SS"},"SS","SS","SS",{"$f":"IF(U81/2>U96,\"S\",\"SS\")","v":"SS"},"SS","SS","SS","SS","S","S","S"]
[null,"Cv",null,{"$f":"[3]!Cv_Simple(D82,D81,D81-D96,D83,D95,D87)","v":16.86490566711419},null,{"$f":"[3]!Cv_Simple(F82,F81,F81-F96,F83,F95,F87)","v":17.020850224491312},{"$f":"[3]!Cv_Simple(G82,G81,G81-G96,G83,G95,G87)","v":1.535313625509525},{"$f":"[3]!Cv_Simple(H82,H81,H81-H96,H83,H95,H87)","v":7.2999285506943572},{"$f":"[3]!Cv_Simple(I82,I81,I81-I96,I83,I95,I87)","v":3.4353841882096745},{"$f":"[3]!Cv_Simple(J82,J81,J81-J96,J83,J95,J87)","v":29.71954492298671},{"$f":"[3]!Cv_Simple(K82,K81,K81-K96,K83,K95,K87)","v":12.073569242544334},{"$f":"[3]!Cv_Simple(L82,L81,L81-L96,L83,L95,L87)","v":9.3152892592094663},{"$f":"[3]!Cv_Simple(M82,M81,M81-M96,M83,M95,M87)","v":5.6853454006552129},{"$f":"[3]!Cv_Simple(N82,N81,N81-N96,N83,N95,N87)","v":4.1875369167403242},{"$f":"[3]!Cv_Simple(O82,O81,O81-O96,O83,O95,O87)","v":3.8327421364979402},{"$f":"[3]!Cv_Simple(P82,P81,P81-P96,P83,P95,P87)","v":3.4230459044189856},{"$f":"[3]!Cv_Simple(Q82,Q81,Q81-Q96,Q83,Q95,Q87)","v":2.9344643822636391},{"$f":"[3]!Cv_Simple(R82,R81,R81-R96,R83,R95,R87)","v":2.5850033924246105},{"$f":"[3]!Cv_Simple(S82,S81,S81-S96,S83,S95,S87)","v":2.3174417142558483},{"$f":"[3]!Cv_Simple(T82,T81,T81-T96,T83,T95,T87)","v":2.1030566532563606},{"$f":"[3]!Cv_Simple(U82,U81,U81-U96,U83,U95,U87)","v":1.9256626596710031},{"$f":"[3]!Cv_Simple(V82,V81,V81-V96,V83,V95,V87)","v":1.7753861763520213},{"$f":"[3]!Cv_Simple(W82,W81,W81-W96,W83,W95,W87)","v":1.6458449052244624},{"$f":"[3]!Cv_Simple(X82,X81,X81-X96,X83,X95,X87)","v":1.5327045651923195},{"$f":"[3]!Cv_Simple(Y82,Y81,Y81-Y96,Y83,Y95,Y87)","v":1.4328458558145576},{"$f":"[3]!Cv_Simple(Z82,Z81,Z81-Z96,Z83,Z95,Z87)","v":1.0832246724633305},{"$f":"[3]!Cv_Simple(AA82,AA81,AA81-AA96,AA83,AA95,AA87)","v":1.0146991146733895},{"$f":"[3]!Cv_Simple(AB82,AB81,AB81-AB96,AB83,AB95,AB87)","v":0.94645600418806008}]
[null,"Cv",null,{"$f":"[3]!cv_gaz(11,D95,D81,D96,D82,0.87)","v":16.846503800667069},null,{"$f":"[3]!cv_gaz(11,F95,F81,F96,F82,0.87)","v":17.002105092951723},{"$f":"[3]!cv_gaz(11,G95,G81,G96,G82,0.87)","v":1.2627120317211815},{"$f":"[3]!cv_gaz(11,H95,H81,H96,H82,0.87)","v":7.2358281748606679},{"$f":"[3]!cv_gaz(11,I95,I81,I96,I82,0.87)","v":3.2823013310303684},{"$f":"[3]!cv_gaz(11,J95,J81,J96,J82,0.87)","v":29.726401811175741},{"$f":"[3]!cv_gaz(11,K95,K81,K96,K82,0.87)","v":12.047182454828723},{"$f":"[3]!cv_gaz(11,L95,L81,L96,L82,0.87)","v":9.2767027873387438},{"$f":"[3]!cv_gaz(11,M95,M81,M96,M82,0.87)","v":5.6160389856115964},{"$f":"[3]!cv_gaz(11,N95,N81,N96,N82,0.87)","v":4.0921253101196147},{"$f":"[3]!cv_gaz(11,O95,O81,O96,O82,0.87)","v":3.7284825006099074},{"$f":"[3]!cv_gaz(11,P95,P81,P96,P82,0.87)","v":3.3065369640272593},{"$f":"[3]!cv_gaz(11,Q95,Q81,Q96,Q82,0.87)","v":2.7994044920361576},{"$f":"[3]!cv_gaz(11,R95,R81,R96,R82,0.87)","v":2.4328936873258544},{"$f":"[3]!cv_gaz(11,S95,S81,S96,S82,0.87)","v":2.1492012149673534},{"$f":"[3]!cv_gaz(11,T95,T81,T96,T82,0.87)","v":1.9192194296596998},{"$f":"[3]!cv_gaz(11,U95,U81,U96,U82,0.87)","v":1.7264731351804079},{"$f":"[3]!cv_gaz(11,V95,V81,V96,V82,0.87)","v":1.5608501402798964},{"$f":"[3]!cv_gaz(11,W95,W81,W96,W82,0.87)","v":1.4157664503577014},{"$f":"[3]!cv_gaz(11,X95,X81,X96,X82,0.87)","v":1.2867353309083409},{"$f":"[3]!cv_gaz(11,Y95,Y81,Y96,Y82,0.87)","v":1.1705736499414225},{"$f":"[3]!cv_gaz(11,Z95,Z81,Z96,Z82,0.87)","v":1.0649246086326944},{"$f":"[3]!cv_gaz(11,AA95,AA81,AA96,AA82,0.87)","v":0.96795120053011252},{"$f":"[3]!cv_gaz(11,AB95,AB81,AB96,AB82,0.87)","v":0.87809277810225117}]
[null,"Trim",null,{"$f":"[3]!Trim_From_Cv(D88/D85,D86)","v":0.89568657369058546},null,{"$f":"[3]!Trim_From_Cv(F89/F85,F86)","v":0.89715399153910602},{"$f":"[3]!Trim_From_Cv(G89/G85,G86)","v":0.42625047703771818},{"$f":"[3]!Trim_From_Cv(H89/H85,H86)","v":0.74243183435680637},{"$f":"[3]!Trim_From_Cv(I89/I85,I86)","v":0.59926319992270949},{"$f":"[3]!Trim_From_Cv(J89/J85,J86)","v":0.99834069623954791},{"$f":"[3]!Trim_From_Cv(K89/K85,K86)","v":0.83475993331938558},{"$f":"[3]!Trim_From_Cv(L89/L85,L86)","v":0.78743104070687497},{"$f":"[3]!Trim_From_Cv(M89/M85,M86)","v":0.6965348848780647},{"$f":"[3]!Trim_From_Cv(N89/N85,N86)","v":0.63920184522168699},{"$f":"[3]!Trim_From_Cv(O89/O85,O86)","v":0.62234703856389673},{"$f":"[3]!Trim_From_Cv(P89/P85,P86)","v":0.60059556570308092},{"$f":"[3]!Trim_From_Cv(Q89/Q85,Q86)","v":0.57044146398941731},{"$f":"[3]!Trim_From_Cv(R89/R85,R86)","v":0.54502693176465988},{"$f":"[3]!Trim_From_Cv(S89/S85,S86)","v":0.52257180197537889},{"$f":"[3]!Trim_From_Cv(T89/T85,T86)","v":0.5020740223944562},{"$f":"[3]!Trim_From_Cv(U89/U85,U86)","v":0.48290556671756518},{"$f":"[3]!Trim_From_Cv(V89/V85,V86)","v":0.46464046543228915},{"$f":"[3]!Trim_From_Cv(W89/W85,W86)","v":0.44697130313757627},{"$f":"[3]!Trim_From_Cv(X89/X85,X86)","v":0.42966378479669848},{"$f":"[3]!Trim_From_Cv(Y89/Y85,Y86)","v":0.41252804245684033},{"$f":"[3]!Trim_From_Cv(Z89/Z85,Z86)","v":0.39539672114255575},{"$f":"[3]!Trim_From_Cv(AA89/AA85,AA86)","v":0.37810462875766587},{"$f":"[3]!Trim_From_Cv(AB89/AB85,AB86)","v":0.36045904239802407}]
[null,"TURBINE 3"]
[null,null,null,null,null,{"$f":"IF(ISERROR(F95),\"\",\"X\")","v":"X"},"X","X",{"$f":"IF(ISERROR(I95),\"\",\"X\")","v":"X"},"X",{"$f":"IF(ISERROR(K95),\"\",\"X\")","v":"X"},"X","X","X","X","X",{"$f":"IF(ISERROR(Q95),\"\",\"X\")","v":"X"},"X","X","X",{"$f":"IF(ISERROR(U95),\"\",\"X\")","v":"X"},"X","X","X","X","X","X","X"]
[null,null,null,"DESIGN",null,{"$f":"F47","v":"D3"},{"$f":"G47","v":"STS"},"D",{"$f":"I47","v":"BAKING"},"Lamin 1","Lamin 2","Lamin 3","Lamin 4","Lamin 5","Lamin 6","Lamin 7","Lamin 8","Lamin 9","Lamin 10","Lamin 11","Lamin 12","Lamin 13","Lamin 14","Lamin 15","Lamin 16","Lamin 17","Lamin 18","Lamin 19"]
[]
[null,"m","g/s",357,null,{"$f":"F107*F96/F97^0.5","v":350.51033754354637},212.63678514378054,357.04043722049556,261.88343767167311,394.55588750001016,390.79821238096241,387.79207228572432,375.76751190477154,360.73681142858072,354.72453123810442,345.70611095238991,330.67541047619898,315.6447100000081,300.61400952381729,285.58330904762641,270.55260857143554,255.52190809524467,240.49120761905382,225.46050714286298,210.42980666667208,195.39910619048121,180.36840571429036,165.33770523809949]
[null,"Pin","Bara",13.07,null,13.07,7.3689999999999998,13.07,10.48,13.125,13,12.9,12.5,12,11.8,11.5,11,10.5,10,{"$f":"S96-0.5","v":9.5},{"$f":"T96-0.5","v":9},8.5,8,7.5,7,6.5,6,5.5]
[null,"Tin","K",8.83,null,9.16,7.9119999999999999,8.8279999999999994,10.55,7.29,7.29,7.29,7.29,7.29,7.29,7.29,7.29,7.29,7.29,7.29,7.29,7.29,7.29,7.29,7.29,7.29,7.29,7.29]
[null,"Pout","Bara",4.88,null,4.88,5.18,4.88,5.18,4.88,4.88,4.88,4.88,4.88,4.88,4.88,4.88,4.88,4.88,4.88,4.88,4.88,4.88,4.88,4.88,4.88,4.88,4.88]
[null,"Tout","K",{"$f":"[3]!T2_turb(11,D96,D97,D98,D100)","v":6.7649101381879646},null,{"$f":"[3]!T2_turb(11,F96,F97,F98,F100)","v":6.9325192540873024},{"$f":"[3]!T2_turb(11,G96,G97,G98,G100)","v":7.105446541851685},{"$f":"[3]!T2_turb(11,H96,H97,H98,H100)","v":6.7658344437536924},{"$f":"[3]!T2_turb(11,I96,I97,I98,I100)","v":8.4481593663233578},{"$f":"[3]!T2_turb(11,J96,J97,J98,J100)","v":6.1181699260890161},{"$f":"[3]!T2_turb(11,K96,K97,K98,K100)","v":6.1222602067537357},{"$f":"[3]!T2_turb(11,L96,L97,L98,L100)","v":6.1256059489303052},{"$f":"[3]!T2_turb(11,M96,M97,M98,M100)","v":6.1396781122510493},{"$f":"[3]!T2_turb(11,N96,N97,N98,N100)","v":6.1589653860104612},{"$f":"[3]!T2_turb(11,O96,O97,O98,O100)","v":6.1672659065430064},{"$f":"[3]!T2_turb(11,P96,P97,P98,P100)","v":6.180410564785781},{"$f":"[3]!T2_turb(11,Q96,Q97,Q98,Q100)","v":6.2043835592276881},{"$f":"[3]!T2_turb(11,R96,R97,R98,R100)","v":6.2313672996790563},{"$f":"[3]!T2_turb(11,S96,S97,S98,S100)","v":6.2620037216966882},{"$f":"[3]!T2_turb(11,T96,T97,T98,T100)","v":6.297160696946059},{"$f":"[3]!T2_turb(11,U96,U97,U98,U100)","v":6.3380274635292411},{"$f":"[3]!T2_turb(11,V96,V97,V98,V100)","v":6.3862442617316511},{"$f":"[3]!T2_turb(11,W96,W97,W98,W100)","v":6.4440608821877765},{"$f":"[3]!T2_turb(11,X96,X97,X98,X100)","v":6.5144951752157985},{"$f":"[3]!T2_turb(11,Y96,Y97,Y98,Y100)","v":6.6014507119485506},{"$f":"[3]!T2_turb(11,Z96,Z97,Z98,Z100)","v":6.7098307590436441},{"$f":"[3]!T2_turb(11,AA96,AA97,AA98,AA100)","v":6.8458369162951769},{"$f":"[3]!T2_turb(11,AB96,AB97,AB98,AB100)","v":7.0187257691663865}]
[null,"Efficacity","%",0.72,null,{"$f":"(0.321*F121^4-1.6098*F121^3+1.316*F121^2+0.9448*F121)*($D$100/0.97215493)","v":0.71514585277537646},0.71677918954540221,0.71749105011421654,0.68349717583184066,0.71837960211293939,0.71849051229641492,{"$f":"(0.321*L121^4-1.6098*L121^3+1.316*L121^2+0.9448*L121)*($D$100/0.97215493)","v":0.71857659982535727},0.71889703874637101,0.71924218587747857,0.71936251750762514,0.71952362657433999,{"$f":"(0.321*Q121^4-1.6098*Q121^3+1.316*Q121^2+0.9448*Q121)*($D$100/0.97215493)","v":0.71973972245051587},0.71988992738413482,0.71997538811347495,0.71999989678551646,{"$f":"(0.321*U121^4-1.6098*U121^3+1.316*U121^2+0.9448*U121)*($D$100/0.97215493)","v":0.71997144285704284},0.7199048518210851,0.71982622054580458,0.71977904969856643,0.7198237878587902,0.71997329344823235,0.71970692721941065,0.7]
[null,"Power","W",{"$f":"+D95*(D111-D112)","v":2444.6944252945532},null,{"$f":"+F95*(F111-F112)","v":2547.4239551427522},502.07183551854661,2435.474434480745,1859.4249141543207,2053.761819044325,2010.5027657245344,1976.1783719538564,1841.4106214145447,1678.6981213598374,1615.419965533127,1522.4569296964903,1372.7769095207711,1229.7422858482178,1093.4251917337706,963.8728167864665,841.08405157872926,724.96558668393345,615.25428592023729,511.39307629792739,412.36837268115903,316.55897782470396,221.6291070237809,121.89472682652413]
[null,"Speed","Hz",920,null,899.03236545200411,518.36496558823876,886.31675848463021,798.41587659968297,840.54680702237465,834.54930007153769,829.72981338767113,810.25518802528688,785.4481545459854,775.37310539717589,760.08881015013503,734.1309444714999,707.51892199107192,680.18368622749267,652.03539865530593,622.94992412705847,592.74219325621345,561.11248411331167,527.53735823288378,491.04930133342305,449.77442726562066,399.76118544893671,327.64316327287037]
[null,"Speed calculated from P=K.rho.N^3",null,null,null,{"$f":"(F101/$D101*$D104/F104)^(1/3)*$D102","v":932.71016404023408},537.47200079734864,918.84197149027193,831.55971223679751,868.08647900287406,861.94824863834901,857.01484996994782,837.07270580017814,811.65319287870545,801.32393559935576,785.6479320510025,759.00788652612289,731.67407791431799,703.57325969312672,674.61015970774554,644.65313543333809,613.50592850263138,580.850698370543,546.13236503494875,508.32493788156387,465.44086560782864,413.29031877308887,338.61636196762896]
[null,"Brake Pressure",null,10,null,{"$f":"($D104-$D98)+F98","v":10},10.3,10,10.3,10,10,10,10,10,10,10,10,10,10,10,10,10,10,10,10,10,10,10]
[null,"Rho (brake)",null,{"$f":"[3]!rho_(11,D104,330)","v":1.4528655310615399},null,{"$f":"[3]!rho_(11,F104,330)","v":1.4528655310615399},{"$f":"[3]!rho_(11,G104,330)","v":1.496267999860327},{"$f":"[3]!rho_(11,H104,330)","v":1.4528655310615399},{"$f":"[3]!rho_(11,I104,330)","v":1.496267999860327},{"$f":"[3]!rho_(11,J104,330)","v":1.4528655310615399},{"$f":"[3]!rho_(11,K104,330)","v":1.4528655310615399},{"$f":"[3]!rho_(11,L104,330)","v":1.4528655310615399},{"$f":"[3]!rho_(11,M104,330)","v":1.4528655310615399},{"$f":"[3]!rho_(11,N104,330)","v":1.4528655310615399},{"$f":"[3]!rho_(11,O104,330)","v":1.4528655310615399},{"$f":"[3]!rho_(11,P104,330)","v":1.4528655310615399},{"$f":"[3]!rho_(11,Q104,330)","v":1.4528655310615399},{"$f":"[3]!rho_(11,R104,330)","v":1.4528655310615399},{"$f":"[3]!rho_(11,S104,330)","v":1.4528655310615399},{"$f":"[3]!rho_(11,T104,330)","v":1.4528655310615399},{"$f":"[3]!rho_(11,U104,330)","v":1.4528655310615399},{"$f":"[3]!rho_(11,V104,330)","v":1.4528655310615399},{"$f":"[3]!rho_(11,W104,330)","v":1.4528655310615399},{"$f":"[3]!rho_(11,X104,330)","v":1.4528655310615399},{"$f":"[3]!rho_(11,Y104,330)","v":1.4528655310615399},{"$f":"[3]!rho_(11,Z104,330)","v":1.4528655310615399},{"$f":"[3]!rho_(11,AA104,330)","v":1.4528655310615399},{"$f":"[3]!rho_(11,AB104,330)","v":1.4528655310615399}]
[null,"Wheel","mm",29.5,null,{"$f":"$D$106","v":29.5},29.5,29.5,29.5,29.5,29.5,{"$f":"$D$106","v":29.5},29.5,29.5,29.5,29.5,29.5,29.5,29.5,29.5,29.5,29.5,29.5,29.5,29.5,29.5,29.5,29.5]
[null,"a = mÖT/P",null,{"$f":"D95*D97^0.5/D96","v":81.165782571430668},null,{"$f":"$D$107","v":81.165782571430668},{"$f":"$D$107","v":81.165782571430668},81.165782571430668,81.165782571430668,{"$f":"$D$107","v":81.165782571430668},{"$f":"$D$107","v":81.165782571430668},{"$f":"$D$107","v":81.165782571430668},81.165782571430668,81.165782571430668,81.165782571430668,81.165782571430668,81.165782571430668,81.165782571430668,81.165782571430668,81.165782571430668,81.165782571430668,81.165782571430668,81.165782571430668,81.165782571430668,81.165782571430668,81.165782571430668,81.165782571430668,81.165782571430668]
[null,"Rho (in)","kg/m3",{"$f":"[3]!rho_(11,D96,D97)","v":97.277770726502126},null,{"$f":"[3]!rho_(11,F96,F97)","v":92.042022544510019},{"$f":"[3]!rho_(11,G96,G97)","v":70.649649504414128},{"$f":"[3]!rho_(11,H96,H97)","v":97.31015974976988},{"$f":"[3]!rho_(11,I96,I97)","v":58.789985568547117},{"$f":"[3]!rho_(11,J96,J97)","v":122.26254459716908},{"$f":"[3]!rho_(11,K96,K97)","v":121.82541276463277},{"$f":"[3]!rho_(11,L96,L97)","v":121.47048985373},{"$f":"[3]!rho_(11,M96,M97)","v":120.00158449336017},{"$f":"[3]!rho_(11,N96,N97)","v":118.04323398198385},{"$f":"[3]!rho_(11,O96,O97)","v":117.21740392188151},{"$f":"[3]!rho_(11,P96,P97)","v":115.92807252113009},{"$f":"[3]!rho_(11,Q96,Q97)","v":113.62831271086438},{"$f":"[3]!rho_(11,R96,R97)","v":111.10900572556152},{"$f":"[3]!rho_(11,S96,S97)","v":108.32592568043771},{"$f":"[3]!rho_(11,T96,T97)","v":105.22304974584799},{"$f":"[3]!rho_(11,U96,U97)","v":101.73006429167778},{"$f":"[3]!rho_(11,V96,V97)","v":97.761229789013782},{"$f":"[3]!rho_(11,W96,W97)","v":93.218746356413405},{"$f":"[3]!rho_(11,X96,X97)","v":88.006090815095931},{"$f":"[3]!rho_(11,Y96,Y97)","v":82.056091491693806},{"$f":"[3]!rho_(11,Z96,Z97)","v":75.368306411917857},{"$f":"[3]!rho_(11,AA96,AA97)","v":68.036211882297849},{"$f":"[3]!rho_(11,AB96,AB97)","v":60.256067667110017}]
[null,"Sound Speed",null,{"$f":"[3]!Sound_speed(11,D96,D97)","v":221.84427302752758},null,{"$f":"[3]!Sound_speed(11,F96,F97)","v":219.03534618547846},{"$f":"[3]!Sound_speed(11,G96,G97)","v":170.78644408370695},{"$f":"[3]!Sound_speed(11,H96,H97)","v":221.8649954478073},{"$f":"[3]!Sound_speed(11,I96,I97)","v":204.26692373410398},{"$f":"[3]!Sound_speed(11,J96,J97)","v":249.66480346852958},{"$f":"[3]!Sound_speed(11,K96,K97)","v":248.37992500152339},{"$f":"[3]!Sound_speed(11,L96,L97)","v":247.34215523540456},{"$f":"[3]!Sound_speed(11,M96,M97)","v":243.10023780227394},{"$f":"[3]!Sound_speed(11,N96,N97)","v":237.58176599011068},{"$f":"[3]!Sound_speed(11,O96,O97)","v":235.30303786825937},{"$f":"[3]!Sound_speed(11,P96,P97)","v":231.80443938215453},{"$f":"[3]!Sound_speed(11,Q96,Q97)","v":225.74814791917015},{"$f":"[3]!Sound_speed(11,R96,R97)","v":219.39459429677927},{"$f":"[3]!Sound_speed(11,S96,S97)","v":212.73080772596771},{"$f":"[3]!Sound_speed(11,T96,T97)","v":205.75546145318614},{"$f":"[3]!Sound_speed(11,U96,U97)","v":198.4897054969922},{"$f":"[3]!Sound_speed(11,V96,V97)","v":190.99426898824163},{"$f":"[3]!Sound_speed(11,W96,W97)","v":183.39236114735928},{"$f":"[3]!Sound_speed(11,X96,X97)","v":175.88971297032288},{"$f":"[3]!Sound_speed(11,Y96,Y97)","v":168.76799821216045},{"$f":"[3]!Sound_speed(11,Z96,Z97)","v":162.32650860903618},{"$f":"[3]!Sound_speed(11,AA96,AA97)","v":156.80049650025103},{"$f":"[3]!Sound_speed(11,AB96,AB97)","v":152.34946477870031}]
[null,"S=Q/(rho*V) = cte",null,{"$f":"D95/(D108*D109)","v":1.6542699653925842E-2},null,{"$f":"F95/(F108*F109)","v":1.7386031983634656E-2},1.762280313205894E-2,1.6537521923231567E-2,2.1807537658396658E-2,1.2925810242537576E-2,1.2915112255952132E-2,1.2907139468494564E-2,1.2880919468010052E-2,1.2862821912968997E-2,1.2860906791506387E-2,1.2864612000597865E-2,1.289113473455885E-2,1.294861538856284E-2,1.3045070128918913E-2,1.3190782660066624E-2,1.3398754175596748E-2,1.3684884924805166E-2,1.4067428066266275E-2,1.4565228728963556E-2,1.5195196836957126E-2,1.5971450823943443E-2,1.6907247415722786E-2,1.8010683180593488E-2]
[null,"Hin",null,{"$f":"[3]!h_(11,D96,D97)","v":38.410544300955863},null,{"$f":"[3]!h_(11,F96,F97)","v":40.890140453818937},{"$f":"[3]!h_(11,G96,G97)","v":36.811643961665368},{"$f":"[3]!h_(11,H96,H97)","v":38.395688158328092},{"$f":"[3]!h_(11,I96,I97)","v":54.059832308617963},{"$f":"[3]!h_(11,J96,J97)","v":28.14464519231036},{"$f":"[3]!h_(11,K96,K97)","v":28.133117975105385},{"$f":"[3]!h_(11,L96,L97)","v":28.124802568427114},{"$f":"[3]!h_(11,M96,M97)","v":28.100165246427569},{"$f":"[3]!h_(11,N96,N97)","v":28.091095004662005},{"$f":"[3]!h_(11,O96,O97)","v":28.095138531510841},{"$f":"[3]!h_(11,P96,P97)","v":28.110470745453465},{"$f":"[3]!h_(11,Q96,Q97)","v":28.164094353340676},{"$f":"[3]!h_(11,R96,R97)","v":28.259427461742323},{"$f":"[3]!h_(11,S96,S97)","v":28.406164507567226},{"$f":"[3]!h_(11,T96,T97)","v":28.616989129337512},{"$f":"[3]!h_(11,U96,U97)","v":28.908501436419211},{"$f":"[3]!h_(11,V96,V97)","v":29.302162143566285},{"$f":"[3]!h_(11,W96,W97)","v":29.824768459584782},{"$f":"[3]!h_(11,X96,X97)","v":30.50745846200121},{"$f":"[3]!h_(11,Y96,Y97)","v":31.382100647825098},{"$f":"[3]!h_(11,Z96,Z97)","v":32.475425675748092},{"$f":"[3]!h_(11,AA96,AA97)","v":33.803432781577705},{"$f":"[3]!h_(11,AB96,AB97)","v":35.365048561567498}]
[null,"Hout",null,{"$f":"[3]!h_(11,D98,D99)","v":31.562660756713417},null,{"$f":"[3]!h_(11,F98,F99)","v":33.622383465549603},{"$f":"[3]!h_(11,G98,G99)","v":34.450472844546304},{"$f":"[3]!h_(11,H98,H99)","v":31.574403562553631},{"$f":"[3]!h_(11,I98,I99)","v":46.9596318122219},{"$f":"[3]!h_(11,J98,J99)","v":22.939395735617683},{"$f":"[3]!h_(11,K98,K99)","v":22.98851213498288},{"$f":"[3]!h_(11,L98,L99)","v":23.028828428713879},{"$f":"[3]!h_(11,M98,M99)","v":23.199766560866902},{"$f":"[3]!h_(11,N98,N99)","v":23.437569031773627},{"$f":"[3]!h_(11,O98,O99)","v":23.541125985790408},{"$f":"[3]!h_(11,P98,P99)","v":23.706565574375478},{"$f":"[3]!h_(11,Q98,Q99)","v":24.012661056429174},{"$f":"[3]!h_(11,R98,R99)","v":24.363457572533072},{"$f":"[3]!h_(11,S98,S99)","v":24.768858337220099},{"$f":"[3]!h_(11,T98,T99)","v":25.241887061920391},{"$f":"[3]!h_(11,U98,U99)","v":25.799738020609627},{"$f":"[3]!h_(11,V98,V99)","v":26.464966726202285},{"$f":"[3]!h_(11,W98,W99)","v":27.266445051375943},{"$f":"[3]!h_(11,X98,X99)","v":28.239242698723949},{"$f":"[3]!h_(11,Y98,Y99)","v":29.422452538969662},{"$f":"[3]!h_(11,Z98,Z99)","v":30.85536208387008},{"$f":"[3]!h_(11,AA98,AA99)","v":32.574674861663233},{"$f":"[3]!h_(11,AB98,AB99)","v":34.627801563667134}]
[null,"Sin = Sout",null,{"$f":"[3]!S_(11,D96,D97)","v":6.3312954703050055},null,{"$f":"[3]!S_(11,F96,F97)","v":6.606972813997622},{"$f":"[3]!S_(11,G96,G97)","v":6.9458302073485418},{"$f":"[3]!S_(11,H96,H97)","v":6.3296128173799451},{"$f":"[3]!S_(11,I96,I97)","v":8.3000204511344844},{"$f":"[3]!S_(11,J96,J97)","v":5.0529733672692334},{"$f":"[3]!S_(11,K96,K97)","v":5.0654417470037325},{"$f":"[3]!S_(11,L96,L97)","v":5.0755773865215996},{"$f":"[3]!S_(11,M96,M97)","v":5.1176417880347849},{"$f":"[3]!S_(11,N96,N97)","v":5.1740184148189101},{"$f":"[3]!S_(11,O96,O97)","v":5.1978956859755527},{"$f":"[3]!S_(11,P96,P97)","v":5.2352994367007346},{"$f":"[3]!S_(11,Q96,Q97)","v":5.3024047191748664},{"$f":"[3]!S_(11,R96,R97)","v":5.3765112439126437},{"$f":"[3]!S_(11,S96,S97)","v":5.4591418721637179},{"$f":"[3]!S_(11,T96,T97)","v":5.5522839217210835},{"$f":"[3]!S_(11,U96,U97)","v":5.6585379719602162},{"$f":"[3]!S_(11,V96,V97)","v":5.7812790786999493},{"$f":"[3]!S_(11,W96,W97)","v":5.9247681165450805},{"$f":"[3]!S_(11,X96,X97)","v":6.0940797015742083},{"$f":"[3]!S_(11,Y96,Y97)","v":6.294692674085951},{"$f":"[3]!S_(11,Z96,Z97)","v":6.531792268753704},{"$f":"[3]!S_(11,AA96,AA97)","v":6.8096366775627946},{"$f":"[3]!S_(11,AB96,AB97)","v":7.1308608379485277}]
[null,"Tout(iso)",null,{"$f":"[1]!HeCalc(2,0,1,D98*10^5,8,D113*1000,1)","v":6.5627950941233291},null,{"$f":"[1]!HeCalc(2,0,1,F98*10^5,8,F113*1000,1)","v":6.6999950291002683},{"$f":"[1]!HeCalc(2,0,1,G98*10^5,8,G113*1000,1)","v":7.0241819850115181},{"$f":"[1]!HeCalc(2,0,1,H98*10^5,8,H113*1000,1)","v":6.5619829946977015},{"$f":"[1]!HeCalc(2,0,1,I98*10^5,8,I113*1000,1)","v":8.0488946725573083},{"$f":"[1]!HeCalc(2,0,1,J98*10^5,8,J113*1000,1)","v":5.9309053922662232},{"$f":"[1]!HeCalc(2,0,1,K98*10^5,8,K113*1000,1)","v":5.9384010068296593},{"$f":"[1]!HeCalc(2,0,1,L98*10^5,8,L113*1000,1)","v":5.944456168329987},{"$f":"[1]!HeCalc(2,0,1,M98*10^5,8,M113*1000,1)","v":5.9692285958188567},{"$f":"[1]!HeCalc(2,0,1,N98*10^5,8,N113*1000,1)","v":6.001560455371191},{"$f":"[1]!HeCalc(2,0,1,O98*10^5,8,O113*1000,1)","v":6.0149678507872988},{"$f":"[1]!HeCalc(2,0,1,P98*10^5,8,P113*1000,1)","v":6.035645284943814},{"$f":"[1]!HeCalc(2,0,1,Q98*10^5,8,Q113*1000,1)","v":6.0718071256425254},{"$f":"[1]!HeCalc(2,0,1,R98*10^5,8,R113*1000,1)","v":6.1104767799272244},{"$f":"[1]!HeCalc(2,0,1,S98*10^5,8,S113*1000,1)","v":6.1522386175176109},{"$f":"[1]!HeCalc(2,0,1,T98*10^5,8,T113*1000,1)","v":6.1979006550766433},{"$f":"[1]!HeCalc(2,0,1,U98*10^5,8,U113*1000,1)","v":6.2485979727804208},{"$f":"[1]!HeCalc(2,0,1,V98*10^5,8,V113*1000,1)","v":6.3059395805685625},{"$f":"[1]!HeCalc(2,0,1,W98*10^5,8,W113*1000,1)","v":6.3722004271630208},{"$f":"[1]!HeCalc(2,0,1,X98*10^5,8,X113*1000,1)","v":6.4505371594073715},{"$f":"[1]!HeCalc(2,0,1,Y98*10^5,8,Y113*1000,1)","v":6.5451882609877448},{"$f":"[1]!HeCalc(2,0,1,Z98*10^5,8,Z113*1000,1)","v":6.6616840821189891},{"$f":"[1]!HeCalc(2,0,1,AA98*10^5,8,AA113*1000,1)","v":6.8072433072756411},{"$f":"[1]!HeCalc(2,0,1,AB98*10^5,8,AB113*1000,1)","v":6.9913024076350263}]
[null,"Hout(iso)",null,{"$f":"[3]!h_(11,D98,D114)","v":28.899594933687727},null,{"$f":"[3]!h_(11,F98,F114)","v":30.727518437529557},{"$f":"[3]!h_(11,G98,G114)","v":33.517503797489027},{"$f":"[3]!h_(11,H98,H114)","v":28.888552710608689},{"$f":"[3]!h_(11,I98,I114)","v":43.671785543492518},{"$f":"[3]!h_(11,J98,J114)","v":20.89882495832201},{"$f":"[3]!h_(11,K98,K114)","v":20.972820445679236},{"$f":"[3]!h_(11,L98,L114)","v":21.033040686749398},{"$f":"[3]!h_(11,M98,M114)","v":21.283613749559883},{"$f":"[3]!h_(11,N98,N114)","v":21.621054644955287},{"$f":"[3]!h_(11,O98,O114)","v":21.76451602215565},{"$f":"[3]!h_(11,P98,P114)","v":21.989886225505693},{"$f":"[3]!h_(11,Q98,Q114)","v":22.396129683012887},{"$f":"[3]!h_(11,R98,R114)","v":22.847530739478753},{"$f":"[3]!h_(11,S98,S114)","v":23.354177689129866},{"$f":"[3]!h_(11,T98,T114)","v":23.929346697015806},{"$f":"[3]!h_(11,U98,U114)","v":24.590603210318516},{"$f":"[3]!h_(11,V98,V114)","v":25.361092138646899},{"$f":"[3]!h_(11,W98,W114)","v":26.270683686903297},{"$f":"[3]!h_(11,X98,X114)","v":27.35619174227045},{"$f":"[3]!h_(11,Y98,Y114)","v":28.659700884036013},{"$f":"[3]!h_(11,Z98,Z114)","v":30.225253888769931},{"$f":"[3]!h_(11,AA98,AA114)","v":32.096129609294515},{"$f":"[3]!h_(11,AB98,AB114)","v":34.311838516653928}]
[null,"ΔHs",null,{"$f":"D111-D115","v":9.510949367268136},null,10.162622016289379,3.2941401641763406,9.5071354477194028,10.388046765125445,{"$f":"J111-J115","v":7.2458202339883506},7.1602975294261491,{"$f":"L111-L115","v":7.0917618816777157},6.8165514968676852,6.4700403597067186,6.3306225093551909,6.1205845199477729,{"$f":"Q111-Q115","v":5.7679646703277889},5.4118967222635703,5.05198681843736,4.6876424323217059,{"$f":"U111-U115","v":4.3178982261006951},3.9410700049193856,3.5540847726814846,3.15126671973076,2.7223997637890847,2.2501717869781608,1.70730317228319,1.0532100449135697]
[null,"u1","m/s",{"$f":"(2*52.7%*D116*1000*D100)^0.5","v":84.956867031644023},null,{"$f":"PI()*$D$118*F102","v":83.020622966141644},{"$f":"PI()*$D$118*G102","v":47.868112451459488},81.846407607061394,73.729251591557357,{"$f":"PI()*$D$118*J102","v":77.619807954426989},{"$f":"PI()*$D$118*K102","v":77.065971649488276},{"$f":"PI()*$D$118*L102","v":76.620918943659987},74.822545946482634,72.531754810884209,71.601380233848673,70.189960843658199,{"$f":"PI()*$D$118*Q102","v":67.79289677530484},65.335424976051755,62.811168465133235,60.211831155960681,{"$f":"PI()*$D$118*U102","v":57.525949860255693},54.736434452731707,51.815607285445751,48.715131736538986,45.345663260179698,41.534158925477371,36.915715083258377,30.25601810434835]
[null,"D1",null,{"$f":"D117/PI()/D102","v":2.9394142038450054E-2}]
[null,"Co = (2*ΔHs)^0,5",null,{"$f":"(2000*D116)^0.5","v":137.91989970463391},null,142.56663015088333,81.16822240478524,137.89224378274076,144.13914641848999,{"$f":"(2000*J116)^0.5","v":120.38122971616755},119.66868871535401,{"$f":"(2000*L116)^0.5","v":119.0946000595973},116.76087955190887,113.75447560168099,112.52219789317299,110.63981670219607,{"$f":"(2000*Q116)^0.5","v":107.40544371983934},104.03746173627623,100.5185238494613,96.826054678704182,{"$f":"(2000*U116)^0.5","v":92.928986071092964},88.781417029909875,84.309961127751507,79.3884968963484,73.788884851162848,67.08460012518762,58.434633091740892,45.895752415960445]
[null,"u1/Co",null,{"$f":"D117/D119","v":0.61598701285010871},null,0.5823285777203121,0.58973956843284825,0.59355338169720662,0.51151441800198882,{"$f":"J117/J119","v":0.64478331162954072},0.64399445232326991,{"$f":"L117/L119","v":0.64336182249503637},0.64081862207297324,0.63761671290067801,0.63633115575849331,0.63440055249354921,{"$f":"Q117/Q119","v":0.63118678557986829},0.62799902925034856,0.62487157649868186,0.62185567051926582,{"$f":"U117/U119","v":0.61903128714055833},0.61653030875021253,0.61458464210334096,0.61362960178151094,0.61453243739412722,0.61913105016605641,0.63174376444362434,0.65923351316115886]
[null,"U1/C0 off de / U1/C0 nom",null,{"$f":"D120/$D$39","v":0.96076892283052273},null,{"$f":"F120/$D120","v":0.94535853122282165},0.95738961395335886,0.96358099978584943,0.83039805601625283,1.0467482238727639,1.0454675811159941,{"$f":"L120/$D120","v":1.0444405629889293},1.0403119038305226,1.0351138897401275,1.0330269023274603,1.0298927400404807,{"$f":"Q120/$D120","v":1.0246754759640659},1.0195004377521881,1.014423297022879,1.0095272425339026,{"$f":"U120/$D120","v":1.0049421079128991},1.0008819924588832,0.99772337611424777,0.99617295329378741,0.99763862642289924,1.0051040642909022,1.0255796814945997,1.0702068378210654]
[null,"Rdt",null,{"$f":"(0.321*D121^4-1.6098*D121^3+1.316*D121^2+0.9448*D121)*($D100/0.97215493)","v":0.7171786087866604},null,{"$f":"(0.321*F121^4-1.6098*F121^3+1.316*F121^2+0.9448*F121)*($D100/0.97215493)","v":0.71514585277537646},0.71677918954540221,0.71749105011421654,0.68349717583184066,0.71837960211293939,0.71849051229641492,0.71857659982535727,0.71889703874637101,0.71924218587747857,0.71936251750762514,0.71952362657433999,0.71973972245051587,0.71988992738413482,0.71997538811347495,0.71999989678551646,0.71997144285704284,0.7199048518210851,0.71982622054580458,0.71977904969856643,0.7198237878587902,0.71997329344823235,0.71970692721941065,0.71564537984708709]
["ligne_ToBeNull_T3","Converge brake Power",null,null,null,{"$f":"F102-F103","v":-33.677798588229962},-19.107035209109881,-32.525213005641717,-33.143835637114535,-27.539671980499406,-27.398948566811328,-27.285036582276689,-26.817517774891257,-26.205038332720051,-25.950830202179873,-25.559121900867467,-24.876942054622987,-24.15515592324607,-23.389573465634044,-22.574761052439612,-21.703211306279627,-20.763735246417923,-19.738214257231334,-18.595006802064972,-17.275636548140824,-15.666438342207982,-13.529133324152156,-10.973198694758594]
["ligne_ToChange_T3","By changing turbine speed"]
[]
[null,"CV220A"]
[null,"flow",null,{"$f":"$D$95-D95","v":0},null,{"$f":"$D$95-F95","v":6.4896624564536296},144.36321485621946,-4.0437220495562087E-2,95.116562328326893,-37.555887500010158,-33.798212380962411,-30.792072285724316,-18.767511904771538,-3.7368114285807223,2.2754687618955813,11.293889047610094,{"$f":"$D$95-Q95","v":26.324589523801023},41.355289999991896,56.385990476182712,71.416690952373585,{"$f":"$D$95-U95","v":86.447391428564458},101.47809190475533,116.50879238094618,131.53949285713702,146.57019333332792,161.60089380951879,176.63159428570964,191.66229476190051]
[null,"Pin","Bara",13.5,null,13.5,13.5,13.5,13.5,13.5,13.5,13.5,13.5,13.5,13.5,13.5,13.5,13.5,13.5,13.5,13.5,13.5,13.5,13.5,13.5,13.5,13.5,13.5]
[null,"Tin","K",100,null,100,100,100,100,100,100,100,100,100,100,100,100,100,100,100,100,100,100,100,100,100,100,100]
[null,"Rho",null,{"$f":"[3]!rho_(11,D128,D129)","v":6.3733311238230197},null,{"$f":"[3]!rho_(11,F128,F129)","v":6.3733311238230197},{"$f":"[3]!rho_(11,G128,G129)","v":6.3733311238230197},{"$f":"[3]!rho_(11,H128,H129)","v":6.3733311238230197},{"$f":"[3]!rho_(11,I128,I129)","v":6.3733311238230197},{"$f":"[3]!rho_(11,J128,J129)","v":6.3733311238230197},{"$f":"[3]!rho_(11,K128,K129)","v":6.3733311238230197},{"$f":"[3]!rho_(11,L128,L129)","v":6.3733311238230197},{"$f":"[3]!rho_(11,M128,M129)","v":6.3733311238230197},{"$f":"[3]!rho_(11,N128,N129)","v":6.3733311238230197},{"$f":"[3]!rho_(11,O128,O129)","v":6.3733311238230197},{"$f":"[3]!rho_(11,P128,P129)","v":6.3733311238230197},{"$f":"[3]!rho_(11,Q128,Q129)","v":6.3733311238230197},{"$f":"[3]!rho_(11,R128,R129)","v":6.3733311238230197},{"$f":"[3]!rho_(11,S128,S129)","v":6.3733311238230197},{"$f":"[3]!rho_(11,T128,T129)","v":6.3733311238230197},{"$f":"[3]!rho_(11,U128,U129)","v":6.3733311238230197},{"$f":"[3]!rho_(11,V128,V129)","v":6.3733311238230197},{"$f":"[3]!rho_(11,W128,W129)","v":6.3733311238230197},{"$f":"[3]!rho_(11,X128,X129)","v":6.3733311238230197},{"$f":"[3]!rho_(11,Y128,Y129)","v":6.3733311238230197},{"$f":"[3]!rho_(11,Z128,Z129)","v":6.3733311238230197},{"$f":"[3]!rho_(11,AA128,AA129)","v":6.3733311238230197},{"$f":"[3]!rho_(11,AB128,AB129)","v":6.3733311238230197}]
[null,"Pout",null,{"$f":"1.15","v":1.1499999999999999},null,{"$f":"1.15","v":1.1499999999999999},1.1499999999999999,1.1499999999999999,1.1499999999999999,1.1499999999999999,1.1499999999999999,1.1499999999999999,1.1499999999999999,1.1499999999999999,1.1499999999999999,1.1499999999999999,1.1499999999999999,1.1499999999999999,1.1499999999999999,1.1499999999999999,1.1499999999999999,1.1499999999999999,1.1499999999999999,1.1499999999999999,1.1499999999999999,1.1499999999999999,1.1499999999999999,1.1499999999999999]
[null,"Cvs",null,35,null,35,35,35,35,35,35,35,35,35,35,35,35,35,35,35,35,35,35,35,35,35,35,35]
[null,"Range",null,100,null,100,100,100,100,100,100,100,100,100,100,100,100,100,100,100,100,100,100,100,100,100,100,100]
[null,"Flow",null,{"$f":"IF(D128/2>D131,\"S\",\"SS\")","v":"S"},null,{"$f":"IF(F128/2>F131,\"S\",\"SS\")","v":"S"},"S","S","S","S","S","S","S","S","S","S",{"$f":"IF(Q128/2>Q131,\"S\",\"SS\")","v":"S"},"S","S","S",{"$f":"IF(U128/2>U131,\"S\",\"SS\")","v":"S"},"S","S","S","S","S","S","S"]
[null,"Cv",null,{"$f":"[3]!Cv_Simple(D129,D128,D131/1000,D130,D127,D134)","v":0},{"$f":"[3]!Cv_Simple(E129,E128,E131/1000,E130,E127,E134)","v":0},{"$f":"[3]!Cv_Simple(F129,F128,F131/1000,F130,F127,F134)","v":0.14845850495463597},{"$f":"[3]!Cv_Simple(G129,G128,G131/1000,G130,G127,G134)","v":3.3024748500881245},{"$f":"[3]!Cv_Simple(H129,H128,H131/1000,H130,H127,H134)","v":-9.250480035864105E-4},{"$f":"[3]!Cv_Simple(I129,I128,I131/1000,I130,I127,I134)","v":2.1759009400628226},{"$f":"[3]!Cv_Simple(J129,J128,J131/1000,J130,J127,J134)","v":-0.85913419194113483},{"$f":"[3]!Cv_Simple(K129,K128,K131/1000,K130,K127,K134)","v":-0.77317304465152481},{"$f":"[3]!Cv_Simple(L129,L128,L131/1000,L130,L127,L134)","v":-0.70440412681983922},{"$f":"[3]!Cv_Simple(M129,M128,M131/1000,M130,M127,M134)","v":-0.42932845549308785},{"$f":"[3]!Cv_Simple(N129,N128,N131/1000,N130,N127,N134)","v":-8.5483866334651992E-2},{"$f":"[3]!Cv_Simple(O129,O128,O131/1000,O130,O127,O134)","v":5.2053969328721791E-2},{"$f":"[3]!Cv_Simple(P129,P128,P131/1000,P130,P127,P134)","v":0.25836072282378381},{"$f":"[3]!Cv_Simple(Q129,Q128,Q131/1000,Q130,Q127,Q134)","v":0.60220531198222216},{"$f":"[3]!Cv_Simple(R129,R128,R131/1000,R130,R127,R134)","v":0.94604990114065934},{"$f":"[3]!Cv_Simple(S129,S128,S131/1000,S130,S127,S134)","v":1.289894490299095},{"$f":"[3]!Cv_Simple(T129,T128,T131/1000,T130,T127,T134)","v":1.6337390794575322},{"$f":"[3]!Cv_Simple(U129,U128,U131/1000,U130,U127,U134)","v":1.9775836686159691},{"$f":"[3]!Cv_Simple(V129,V128,V131/1000,V130,V127,V134)","v":2.3214282577744063},{"$f":"[3]!Cv_Simple(W129,W128,W131/1000,W130,W127,W134)","v":2.6652728469328428},{"$f":"[3]!Cv_Simple(X129,X128,X131/1000,X130,X127,X134)","v":3.0091174360912789},{"$f":"[3]!Cv_Simple(Y129,Y128,Y131/1000,Y130,Y127,Y134)","v":3.3529620252497168},{"$f":"[3]!Cv_Simple(Z129,Z128,Z131/1000,Z130,Z127,Z134)","v":3.6968066144081537},{"$f":"[3]!Cv_Simple(AA129,AA128,AA131/1000,AA130,AA127,AA134)","v":4.0406512035665898},{"$f":"[3]!Cv_Simple(AB129,AB128,AB131/1000,AB130,AB127,AB134)","v":4.3844957927250272}]
[null,"Trim",null,{"$f":"IF(D135=0,0,[3]!Trim_From_Cv(D135/D132,D133))","v":0},null,{"$f":"IF(F135=0,0,[3]!Trim_From_Cv(F135/F132,F133))","v":2.6763138300479064E-2},{"$f":"IF(G135=0,0,[3]!Trim_From_Cv(G135/G132,G133))","v":0.4873857372952396},{"$f":"IF(H135=0,0,[3]!Trim_From_Cv(H135/H132,H133))","v":-1.6676166624559594E-4},{"$f":"IF(I135=0,0,[3]!Trim_From_Cv(I135/I132,I133))","v":0.39678553773054159},{"$f":"IF(J135<0.00001,0,[3]!Trim_From_Cv(J135/J132,J133))","v":0},{"$f":"IF(K135=0,0,[3]!Trim_From_Cv(K135/K132,K133))","v":-0.13938263173628343},{"$f":"IF(L135=0,0,[3]!Trim_From_Cv(L135/L132,L133))","v":-0.12698541637118144},{"$f":"IF(M135=0,0,[3]!Trim_From_Cv(M135/M132,M133))","v":-7.7396554910771867E-2},{"$f":"IF(N135=0,0,[3]!Trim_From_Cv(N135/N132,N133))","v":-1.5410478085260517E-2},{"$f":"IF(O135=0,0,[3]!Trim_From_Cv(O135/O132,O133))","v":9.3839526449439221E-3},{"$f":"IF(P135=0,0,[3]!Trim_From_Cv(P135/P132,P133))","v":4.6575598740250815E-2},{"$f":"IF(Q135=0,0,[3]!Trim_From_Cv(Q135/Q132,Q133))","v":0.11783826885195073},{"$f":"IF(R135=0,0,[3]!Trim_From_Cv(R135/R132,R133))","v":0.2159230001581369},{"$f":"IF(S135=0,0,[3]!Trim_From_Cv(S135/S132,S133))","v":0.28324307167413576},{"$f":"IF(T135=0,0,[3]!Trim_From_Cv(T135/T132,T133))","v":0.33455732662805793},{"$f":"IF(U135=0,0,[3]!Trim_From_Cv(U135/U132,U133))","v":0.37603341128001883},{"$f":"IF(V135=0,0,[3]!Trim_From_Cv(V135/V132,V133))","v":0.41084361113585799},{"$f":"IF(W135=0,0,[3]!Trim_From_Cv(W135/W132,W133))","v":0.44083681524759333},{"$f":"IF(X135=0,0,[3]!Trim_From_Cv(X135/X132,X133))","v":0.46718554641261384},{"$f":"IF(Y135=0,0,[3]!Trim_From_Cv(Y135/Y132,Y133))","v":0.49068029520168011},{"$f":"IF(Z135=0,0,[3]!Trim_From_Cv(Z135/Z132,Z133))","v":0.51187934410517999},{"$f":"IF(AA135=0,0,[3]!Trim_From_Cv(AA135/AA132,AA133))","v":0.53119165930649537},{"$f":"IF(AB135=0,0,[3]!Trim_From_Cv(AB135/AB132,AB133))","v":0.54892580666134672}]
[null,"Tout",null,{"$f":"[3]!T_P_H_(11,D85,[3]!h_(11,D128,D129))","v":99.108406127680922},null,{"$f":"[3]!T_P_H_(11,F85,[3]!h_(11,F128,F129))","v":99.108406127680922},{"$f":"[3]!T_P_H_(11,G85,[3]!h_(11,G128,G129))","v":99.108406127680922},{"$f":"[3]!T_P_H_(11,H85,[3]!h_(11,H128,H129))","v":99.108406127680922},{"$f":"[3]!T_P_H_(11,I85,[3]!h_(11,I128,I129))","v":99.108406127680922},{"$f":"[3]!T_P_H_(11,J85,[3]!h_(11,J128,J129))","v":99.108406127680922},{"$f":"[3]!T_P_H_(11,K85,[3]!h_(11,K128,K129))","v":99.108406127680922},{"$f":"[3]!T_P_H_(11,L85,[3]!h_(11,L128,L129))","v":99.108406127680922},{"$f":"[3]!T_P_H_(11,M85,[3]!h_(11,M128,M129))","v":99.108406127680922},{"$f":"[3]!T_P_H_(11,N85,[3]!h_(11,N128,N129))","v":99.108406127680922},{"$f":"[3]!T_P_H_(11,O85,[3]!h_(11,O128,O129))","v":99.108406127680922},{"$f":"[3]!T_P_H_(11,P85,[3]!h_(11,P128,P129))","v":99.108406127680922},{"$f":"[3]!T_P_H_(11,Q85,[3]!h_(11,Q128,Q129))","v":99.108406127680922},{"$f":"[3]!T_P_H_(11,R85,[3]!h_(11,R128,R129))","v":99.108406127680922},{"$f":"[3]!T_P_H_(11,S85,[3]!h_(11,S128,S129))","v":99.108406127680922},{"$f":"[3]!T_P_H_(11,T85,[3]!h_(11,T128,T129))","v":99.108406127680922},{"$f":"[3]!T_P_H_(11,U85,[3]!h_(11,U128,U129))","v":99.108406127680922},{"$f":"[3]!T_P_H_(11,V85,[3]!h_(11,V128,V129))","v":99.108406127680922},{"$f":"[3]!T_P_H_(11,W85,[3]!h_(11,W128,W129))","v":99.108406127680922},{"$f":"[3]!T_P_H_(11,X85,[3]!h_(11,X128,X129))","v":99.108406127680922},{"$f":"[3]!T_P_H_(11,Y85,[3]!h_(11,Y128,Y129))","v":99.108406127680922},{"$f":"[3]!T_P_H_(11,Z85,[3]!h_(11,Z128,Z129))","v":99.108406127680922},{"$f":"[3]!T_P_H_(11,AA85,[3]!h_(11,AA128,AA129))","v":99.108406127680922},{"$f":"[3]!T_P_H_(11,AB85,[3]!h_(11,AB128,AB129))","v":99.108406127680922}]
[null,"delta T",null,{"$f":"D137-D85","v":69.108406127680922},null,{"$f":"F137-F85","v":69.108406127680922},69.108406127680922,69.108406127680922,69.108406127680922,69.108406127680922,69.108406127680922,69.108406127680922,69.108406127680922,69.108406127680922,69.108406127680922,69.108406127680922,69.108406127680922,69.108406127680922,69.108406127680922,69.108406127680922,69.108406127680922,69.108406127680922,69.108406127680922,69.108406127680922,69.108406127680922,69.108406127680922,69.108406127680922,69.108406127680922]
[null,"CV335"]
[null,"Pin","Bara",{"$f":"D81","v":13.15},null,{"$f":"F81","v":13.15},13.25,13.5,12.25,13.15,13.15,13.15,13.15,13.15,13.15,13.15,13.15,13.15,13.15,13.15,13.15,13.15,13.15,13.15,13.15,13.15,13.15,13.15]
[null,"Tin","K",{"$f":"D82","v":8.83514415424081},null,{"$f":"F82","v":9.1661496679837366},8.6223146254179426,8.8279999999999994,10.795640526772669,7.289570189226823,7.2875494761866335,7.286091223216423,7.2817678358976652,7.2801751232542466,7.2808852270882953,7.2835767670375562,7.2929775419785274,7.309641747149449,7.3351707676476412,7.3715975333960877,7.4214865443397402,7.4880009996514749,7.574845195653733,7.6859260832822134,7.8246161009732589,7.9928254087617381,8.190438152641093,8.414996515030289]
[null,"Rho",null,{"$f":"[3]!rho_(11,D140,D141)","v":97.618685329309102},null,{"$f":"[3]!rho_(11,F140,F141)","v":92.385436868539188},{"$f":"[3]!rho_(11,G140,G141)","v":101.58811590421918},{"$f":"[3]!rho_(11,H140,H141)","v":99.5385923004863},{"$f":"[3]!rho_(11,I140,I141)","v":66.476961067945879},{"$f":"[3]!rho_(11,J140,J141)","v":122.3554602961871},{"$f":"[3]!rho_(11,K140,K141)","v":122.38525605267236},{"$f":"[3]!rho_(11,L140,L141)","v":122.40675166263661},{"$f":"[3]!rho_(11,M140,M141)","v":122.47044880873382},{"$f":"[3]!rho_(11,N140,N141)","v":122.4939022601133},{"$f":"[3]!rho_(11,O140,O141)","v":122.48344645754396},{"$f":"[3]!rho_(11,P140,P141)","v":122.44380344539697},{"$f":"[3]!rho_(11,Q140,Q141)","v":122.30519433940992},{"$f":"[3]!rho_(11,R140,R141)","v":122.05892824408417},{"$f":"[3]!rho_(11,S140,S141)","v":121.68027091130101},{"$f":"[3]!rho_(11,T140,T141)","v":121.13709609048141},{"$f":"[3]!rho_(11,U140,U141)","v":120.3877662475066},{"$f":"[3]!rho_(11,V140,V141)","v":119.37920067123139},{"$f":"[3]!rho_(11,W140,W141)","v":118.04655161202567},{"$f":"[3]!rho_(11,X140,X141)","v":116.31729006265563},{"$f":"[3]!rho_(11,Y140,Y141)","v":114.12277996026393},{"$f":"[3]!rho_(11,Z140,Z141)","v":111.41624187103298},{"$f":"[3]!rho_(11,AA140,AA141)","v":108.18992422198602},{"$f":"[3]!rho_(11,AB140,AB141)","v":104.49208532283211}]
[null,"dP",null,{"$f":"(D140-D98)*1000","v":8270},null,{"$f":"(F140-F98)*1000","v":8270},8070,8620.0000000000018,7070,8270,8270,8270,8270,8270,8270,8270,8270,8270,8270,8270,8270,8270,8270,8270,8270,8270,8270,8270]
[null,"Cvs",null,5,null,{"$f":"$D$144","v":5},{"$f":"$D$144","v":5},5,5,5,5,5,5,5,5,5,5,5,5,5,5,5,5,5,5,5,5,5]
[null,"Range",null,250,null,{"$f":"$D$145","v":250},{"$f":"$D$145","v":250},250,250,250,250,250,250,250,250,250,250,250,250,250,250,250,250,250,250,250,250,250]
[null,"Flow",null,{"$f":"IF(D140/2>D98,\"S\",\"SS\")","v":"S"},null,{"$f":"IF(F140/2>F98,\"S\",\"SS\")","v":"S"},"S","S","S","S","S","S","S","S","S","S","S","S","S","S","S","S","S","S","S","S","S","S"]
[null,"Cv",null,{"$f":"[3]!Cv_Simple(D141,D140,D143/1000,D142,D95,D146)","v":2.114326056866267},null,{"$f":"[3]!Cv_Simple(F141,F140,F143/1000,F142,F95,F146)","v":2.1338765748233199},{"$f":"[3]!Cv_Simple(G141,G140,G143/1000,G142,G95,G146)","v":1.229821567782704},{"$f":"[3]!Cv_Simple(H141,H140,H143/1000,H142,H95,H146)","v":2.0667496547752653},{"$f":"[3]!Cv_Simple(I141,I140,I143/1000,I142,I95,I146)","v":1.9473208303492371},{"$f":"[3]!Cv_Simple(J141,J140,J143/1000,J142,J95,J146)","v":2.0872144552861447},{"$f":"[3]!Cv_Simple(K141,K140,K143/1000,K142,K95,K146)","v":2.0670845515555882},{"$f":"[3]!Cv_Simple(L141,L140,L143/1000,L142,L95,L146)","v":2.0510037910573233},{"$f":"[3]!Cv_Simple(M141,M140,M143/1000,M142,M95,M146)","v":1.9868898797748566},{"$f":"[3]!Cv_Simple(N141,N140,N143/1000,N142,N95,N146)","v":1.9072316730868983},{"$f":"[3]!Cv_Simple(O141,O140,O143/1000,O142,O95,O146)","v":1.8755245255103508},{"$f":"[3]!Cv_Simple(P141,P140,P143/1000,P142,P95,P146)","v":1.8281375701842379},{"$f":"[3]!Cv_Simple(Q141,Q140,Q143/1000,Q142,Q95,Q146)","v":1.7496439263258388},{"$f":"[3]!Cv_Simple(R141,R140,R143/1000,R142,R95,R146)","v":1.6717986196621557},{"$f":"[3]!Cv_Simple(S141,S140,S143/1000,S142,S95,S146)","v":1.5946646072239772},{"$f":"[3]!Cv_Simple(T141,T140,T143/1000,T142,T95,T146)","v":1.5183240296277225},{"$f":"[3]!Cv_Simple(U141,U140,U143/1000,U142,U95,U146)","v":1.4428818505882173},{"$f":"[3]!Cv_Simple(V141,V140,V143/1000,V142,V95,V146)","v":1.368466063245904},{"$f":"[3]!Cv_Simple(W141,W140,W143/1000,W142,W95,W146)","v":1.2952177095019868},{"$f":"[3]!Cv_Simple(X141,X140,X143/1000,X142,X95,X146)","v":1.2232594092063465},{"$f":"[3]!Cv_Simple(Y141,Y140,Y143/1000,Y142,Y95,Y146)","v":1.1526336872312506},{"$f":"[3]!Cv_Simple(Z141,Z140,Z143/1000,Z142,Z95,Z146)","v":1.0832246724633305},{"$f":"[3]!Cv_Simple(AA141,AA140,AA143/1000,AA142,AA95,AA146)","v":1.0146991146733895},{"$f":"[3]!Cv_Simple(AB141,AB140,AB143/1000,AB142,AB95,AB146)","v":0.94645600418806008}]
[null,"Trim",null,{"$f":"[3]!Trim_From_Cv(D147/D144,D145)","v":0.84411701671803907},null,{"$f":"[3]!Trim_From_Cv(F147/F144,F145)","v":0.84578400329704362},{"$f":"[3]!Trim_From_Cv(G147/G144,G145)","v":0.74597867461509604},{"$f":"[3]!Trim_From_Cv(H147/H144,H145)","v":0.83999510863820281},{"$f":"[3]!Trim_From_Cv(I147/I144,I145)","v":0.8292148705293475},{"$f":"[3]!Trim_From_Cv(J147/J144,J145)","v":0.84177964040128428},{"$f":"[3]!Trim_From_Cv(K147/K144,K145)","v":0.84002445362455125},{"$f":"[3]!Trim_From_Cv(L147/L144,L145)","v":0.83860999865666397},{"$f":"[3]!Trim_From_Cv(M147/M144,M145)","v":0.83285811772035412},{"$f":"[3]!Trim_From_Cv(N147/N144,N145)","v":0.82544744553897209},{"$f":"[3]!Trim_From_Cv(O147/O144,O145)","v":0.82241121330359934},{"$f":"[3]!Trim_From_Cv(P147/P144,P145)","v":0.81777645445854408},{"$f":"[3]!Trim_From_Cv(Q147/Q144,Q145)","v":0.80982829879757035},{"$f":"[3]!Trim_From_Cv(R147/R144,R145)","v":0.80158551077178342},{"$f":"[3]!Trim_From_Cv(S147/S144,S145)","v":0.79303041479215985},{"$f":"[3]!Trim_From_Cv(T147/T144,T145)","v":0.78414575132983189},{"$f":"[3]!Trim_From_Cv(U147/U144,U145)","v":0.77491545587178756},{"$f":"[3]!Trim_From_Cv(V147/V144,V145)","v":0.7653252497801486},{"$f":"[3]!Trim_From_Cv(W147/W144,W145)","v":0.75536200725480396},{"$f":"[3]!Trim_From_Cv(X147/X144,X145)","v":0.74500970119183818},{"$f":"[3]!Trim_From_Cv(Y147/Y144,Y145)","v":0.73423909948761323},{"$f":"[3]!Trim_From_Cv(Z147/Z144,Z145)","v":0.72299079267504829},{"$f":"[3]!Trim_From_Cv(AA147/AA144,AA145)","v":0.71115510797640347},{"$f":"[3]!Trim_From_Cv(AB147/AB144,AB145)","v":0.6985455970365827}]
[null,"Tout",null,{"$f":"[3]!T_P_H_(11,D98,[3]!h_(11,D140,D141))","v":7.3724700511030372},null,{"$f":"[3]!T_P_H_(11,F98,[3]!h_(11,F140,F141))","v":7.630998961978265},{"$f":"[3]!T_P_H_(11,G98,[3]!h_(11,G140,G141))","v":7.3219643390544888},{"$f":"[3]!T_P_H_(11,H98,[3]!h_(11,H140,H141))","v":7.3519064983716929},{"$f":"[3]!T_P_H_(11,I98,[3]!h_(11,I140,I141))","v":9.4038371934393972},{"$f":"[3]!T_P_H_(11,J98,[3]!h_(11,J140,J141))","v":6.5076151867744905},{"$f":"[3]!T_P_H_(11,K98,[3]!h_(11,K140,K141))","v":6.5067773978318657},{"$f":"[3]!T_P_H_(11,L98,[3]!h_(11,L140,L141))","v":6.5061731162157059},{"$f":"[3]!T_P_H_(11,M98,[3]!h_(11,M140,M141))","v":6.5043830866027719},{"$f":"[3]!T_P_H_(11,N98,[3]!h_(11,N140,N141))","v":6.5037242233751265},{"$f":"[3]!T_P_H_(11,O98,[3]!h_(11,O140,O141))","v":6.5040179365079505},{"$f":"[3]!T_P_H_(11,P98,[3]!h_(11,P140,P141))","v":6.5051317682126424},{"$f":"[3]!T_P_H_(11,Q98,[3]!h_(11,Q140,Q141))","v":6.5090290145093253},{"$f":"[3]!T_P_H_(11,R98,[3]!h_(11,R140,R141))","v":6.5159643141771708},{"$f":"[3]!T_P_H_(11,S98,[3]!h_(11,S140,S141))","v":6.5266570107899007},{"$f":"[3]!T_P_H_(11,T98,[3]!h_(11,T140,T141))","v":6.5420611187463784},{"$f":"[3]!T_P_H_(11,U98,[3]!h_(11,U140,U141))","v":6.5634502432004949},{"$f":"[3]!T_P_H_(11,V98,[3]!h_(11,V140,V141))","v":6.5925207653239495},{"$f":"[3]!T_P_H_(11,W98,[3]!h_(11,W140,W141))","v":6.6314917157616708},{"$f":"[3]!T_P_H_(11,X98,[3]!h_(11,X140,X141))","v":6.6831459609521859},{"$f":"[3]!T_P_H_(11,Y98,[3]!h_(11,Y140,Y141))","v":6.750739300631845},{"$f":"[3]!T_P_H_(11,Z98,[3]!h_(11,Z140,Z141))","v":6.8377830170846385},{"$f":"[3]!T_P_H_(11,AA98,[3]!h_(11,AA140,AA141))","v":6.9478177208080893},{"$f":"[3]!T_P_H_(11,AB98,[3]!h_(11,AB140,AB141))","v":7.0839372537996068}]
[null,"delta T",null,{"$f":"D149-D98","v":2.4924700511030373},null,{"$f":"F149-F98","v":2.7509989619782651},2.1419643390544891,2.471906498371693,4.2238371934393975,1.6276151867744906,1.6267773978318658,1.626173116215706,1.624383086602772,1.6237242233751266,1.6240179365079506,1.6251317682126425,1.6290290145093254,1.6359643141771709,1.6466570107899008,1.6620611187463785,1.683450243200495,1.7125207653239496,1.751491715761671,1.803145960952186,1.8707393006318451,1.9577830170846386,2.0678177208080895,2.2039372537996069]
[]
[null,null,null,null,null,null,null,null,null,null,null,null,null,null,null,null,null,null,null,null,null,null,"Ratio Cv",0.5]
[null,null,null,null,null,null,null,null,null,null,null,null,null,null,null,null,null,null,null,null,null,null,null,{"$f":"[3]!Trim_From_Cv(X152,X145)","v":0.87446308307325438}]
[]
[null,null,null,null,null,null,null,null,null,null,null,null,{"$f":"M37","v":"T1"},{"$f":"M160","v":"T3"},"T1+T2"]
[null,"Courbe de rendement TC3",null,null,null,null,null,null,null,null,null,{"$f":"L161","v":"MAX"},{"$f":"M38","v":"100g/s @ 7,20590918031859 b ; 35K"},{"$f":"M161","v":"351g/s @ 13,07 b ; 9,16K"},{"$f":"F95+F49","v":450.51033754354637}]
[null,null,null,null,null,null,null,null,null,null,null,{"$f":"L162","v":"MIN"},{"$f":"M39","v":"159g/s @ 12,39 b ; 40,73K"},{"$f":"M162","v":"213g/s @ 7,369 b ; 7,912K"},{"$f":"G95+G49","v":372.02614973810364}]
[null,null,null,null,null,null,null,null,null,null,null,{"$f":"L163","v":"STS"},{"$f":"M40","v":"104g/s @ 10,3 b ; 66K"},{"$f":"M163","v":"357g/s @ 13,07 b ; 8,828K"},{"$f":"H95+H49","v":437.55546913197924}]
[null,null,null,null,null,null,null,null,null,null,null,{"$f":"L164","v":"BAKING"},{"$f":"M41","v":"125g/s @ 9,25 b ; 37,12K"},{"$f":"M164","v":"262g/s @ 10,48 b ; 10,55K"},{"$f":"I95+I49","v":386.5307696198218}]
[null,null,null,null,"d : mm",null,null,null,null,null,null,null,"T3"]
[null,null,null,null,"N : Hz",null,null,null,null,null,null,"MAX",{"$f":"ROUND(F95,0)&\"g/s @ \"&F96&\" b ; \"&F97&\"K\"","v":"351g/s @ 13,07 b ; 9,16K"}]
[null,null,null,null,"H : J/kG",null,null,null,null,null,null,"MIN",{"$f":"ROUND(G95,0)&\"g/s @ \"&G96&\" b ; \"&G97&\"K\"","v":"213g/s @ 7,369 b ; 7,912K"}]
[null,null,null,null,null,null,null,null,null,null,null,"STS",{"$f":"ROUND(H95,0)&\"g/s @ \"&H96&\" b ; \"&H97&\"K\"","v":"357g/s @ 13,07 b ; 8,828K"}]
[null,null,null,null,null,null,null,null,null,null,null,"BAKING",{"$f":"ROUND(I95,0)&\"g/s @ \"&I96&\" b ; \"&I97&\"K\"","v":"262g/s @ 10,48 b ; 10,55K"}]
[]
[]
[]
[null,"rendement=(0,321*rap^4 - 1,6098*rap^3 + 1,316*rap^2 + 0,9448*rap)*(ETAgar/0,97)",null,null,null,null,null,null,"U1/CO _nom",0.64]
[null,null,null,null,null,null,null,null,"Eta_gar",0.8]
[null,"U1/C0",{"$f":"D19","v":0.78},{"$f":"D54","v":0.76},{"$f":"D100","v":0.72}]
[null,0,{"$f":"(0.321*B171^4-1.6098*B171^3+1.316*B171^2+0.9448*B171)*$D$19/0.97215493","v":0}]
[null,{"$f":"B171+0.05","v":0.05},{"$f":"(0.321*$B172^4-1.6098*$B172^3+1.316*$B172^2+0.9448*$B172)*$C$170/0.97215493","v":4.0382461852042459E-2},{"$f":"(0.321*$B172^4-1.6098*$B172^3+1.316*$B172^2+0.9448*$B172)*$D$170/0.97215493","v":3.9347014112246496E-2},{"$f":"(0.321*$B172^4-1.6098*$B172^3+1.316*$B172^2+0.9448*$B172)*$E$170/0.97215493","v":3.7276118632654578E-2}]
[null,0.1,{"$f":"(0.321*$B173^4-1.6098*$B173^3+1.316*$B173^2+0.9448*$B173)*$C$170/0.97215493","v":8.5098158171146673E-2},{"$f":"(0.321*$B173^4-1.6098*$B173^3+1.316*$B173^2+0.9448*$B173)*$D$170/0.97215493","v":8.2916154115476232E-2},{"$f":"(0.321*$B173^4-1.6098*$B173^3+1.316*$B173^2+0.9448*$B173)*$E$170/0.97215493","v":7.8552146004135376E-2}]
[null,0.15000000000000002,0.13323633134792623,0.12982001515951785,0.12298738278270113]
[null,0.2,0.18392485650409657,0.17920883454245307,0.16977679061916603]
[null,0.25,0.23633024149247489,0.23027049171061653,0.21815099214689987]
[null,0.3,0.28965762689698032,0.28223050825859619,0.26737627098182798]
[null,0.35,0.34315078603263366,0.33435204792923284,0.3167545717224311]
[null,0.39999999999999997,0.39609212494555779,0.38593591661362037,0.36562349994974563]
[null,0.44999999999999996,0.4478026824129771,0.43632056235110589,0.41335632222736346]
[null,0.49999999999999994,0.49764212994321799,0.48488207532928934,0.45936196610143198]
[null,0.54999999999999993,0.54500877177570861,0.53103418788402379,0.50308502010065403]
[null,0.6,0.58933954488097895,0.57422827449941549,0.54400573373628835]
[null,0.65,0.63011001896066099,0.61395335180782351,0.58164001750214867]
[null,0.70000000000000007,0.66683439644748832,0.64973607858986027,0.61553944287460449]
[null,0.75000000000000011,0.69906551250529614,0.68114075577439104,0.64529124231258095]
[null,0.80000000000000016,0.7263948350290218,0.70776932643853407,0.67051830925755851]
[null,0.8500000000000002,0.74845246464470438,0.72926137580766071,0.69087919813357312]
[null,0.90000000000000024,0.76490713470948513,0.74529413125539579,0.70606812434721711]
[null,0.95000000000000029,0.77546621131160665,0.7555824623036167,0.71581496428763691]
[null,1.0000000000000002,0.77987569327041351,0.75987888062245412,0.71988525532653547]
[null,1.0500000000000003,0.77792021213635165,0.75797354003029138,0.71808019581817073]
[null,1.1000000000000003,0.76942303219096997,0.74969423649376565,0.7102366450993568]
[null,1.1500000000000004,0.75424605044691839,0.73490640812776653,0.69622712348946292]
[null,1.2000000000000004,0.7322897966479478,0.71351313519543635,0.67595981229041324,null,"F Let u be the peripheral speed of the wheel : u = p . Æ . N / 60                      (in m/s)"]
[null,1.2500000000000004,0.70349343326891334,0.68545514010817188,0.64937855378668918,null,"F Let n, be the speed ratio of the turbine : n =  u / [ 2 . (H1 - H2S ) ] 0.5       (dimensionless number)"]
[null,1.3000000000000005,0.66783475551576954,0.65071078742562172,0.61646285124532574,null,null,"N = speed of rotation of the turbine (in rpm)"]
[null,1.3500000000000005,0.62533019132557388,0.60929608385568745,0.57722786891591438,null,null,"Æ = diameter of the wheel of the turbine (in m)"]
[null,1.4000000000000006,0.57603480136648577,0.56126467825452464,0.53172443203060227]
[null,1.4500000000000006,0.5200422790377659,0.50670786162654113,0.48003902680409161]
[null,1.5000000000000007,0.45748495046977738,0.44575456712439848,0.42229380043364062]

{"sheet":"JT60_after_test","index":2,"n_rows":201,"n_cols":32,"rows_kept":201,"cut":false,"hidden":false,"merged":[]}
[1,2,3,4,5,6,7,8,9,10,11,12,13,14,15,16,17,18,19,20,21,22,23,24,25,26,27,28]
[null,null,null,null,null,null,null,null,null,null,null,null,null,null,null,null,null,null,null,null,null,null,null,null,null,null,null,null,null,null,null,{"$f":"1-1/3","v":0.66666666666666674}]
[]
[]
[null,null,null,null,"Vitesse de la roue ajustée en fonction de la puissance du frein",null,null,null,null,null,null,{"$f":"D56*0.3","v":438.3}]
[]
[]
[null,"Relation entre la puissance et la vitesse de rotation",null,null,null,null,null,null,null,null,null,null,"²"]
[]
[null,"TURBINE 1"]
[null,null,null,null,null,{"$f":"IF(ISERROR(F14),\"\",\"X\")","v":"X"},"X",{"$f":"IF(ISERROR(H14),\"\",\"X\")","v":"X"},{"$f":"IF(ISERROR(I14),\"\",\"X\")","v":"X"}]
[null,null,null,"DESIGN",null,"D3","STS","start-up",{"$f":"L41","v":"BAKING"}]
[]
[null,"m","g/s",179.52,null,100,{"$f":"G26*G15/G16^0.5","v":163.16596646576537},{"$f":"H26*H15/H16^0.5","v":106.55669291797149},{"$f":"I26*I15/I16^0.5","v":127.60074950084292},null,{"$f":"F14/D14","v":0.55704099821746877}]
[null,"Pin","Bara",14.78,null,{"$f":"F14*F16^0.5/F26","v":7.0391228664487597},12.39,10.3,9.25]
[null,"Tin","K",47.88,null,35,40.729999999999997,66,37.119999999999997]
[null,"Pout","Bara",6.39,null,6.36,5.242,4.97,4.0599999999999996]
[null,"Tout","K",{"$f":"[3]!T2_turb(11,D15,D16,D17,D19)","v":37.451439289994191},null,{"$f":"[3]!T2_turb(11,F15,F16,F17,F19)","v":33.972820097354983},{"$f":"[3]!T2_turb(11,G15,G16,G17,G19)","v":31.669480747616308},{"$f":"[3]!T2_turb(11,H15,H16,H17,H19)","v":53.572632964986326},{"$f":"[3]!T2_turb(11,I15,I16,I17,I19)","v":29.271050258767488}]
[null,"Efficacity","%",0.76700000000000002,null,{"$f":"(0.321*F40^4-1.6098*F40^3+1.316*F40^2+0.9448*F40)*($D$19/0.97215493)","v":0.73677833223299072},{"$f":"(0.321*G40^4-1.6098*G40^3+1.316*G40^2+0.9448*G40)*($D$19/0.97215493)","v":0.76404128406457295},{"$f":"(0.321*H40^4-1.6098*H40^3+1.316*H40^2+0.9448*H40)*($D$19/0.97215493)","v":0.74833775235840649},{"$f":"(0.321*I40^4-1.6098*I40^3+1.316*I40^2+0.9448*I40)*($D$19/0.97215493)","v":0.75179110460888798}]
[null,"Power","W",{"$f":"+D14*(D30-D31)","v":10019.02109857787},null,{"$f":"+F14*(F30-F31)","v":541.88116291369113},{"$f":"+G14*(G30-G31)","v":7847.5862968710098},{"$f":"+H14*(H30-H31)","v":7027.6712173981532},{"$f":"+I14*(I30-I31)","v":5272.9856613769116}]
[null,"Speed","Hz",2214,null,818.49291361748158,2178.9277176486989,2159.952605202775,2152.7223735708171,null,{"$f":"F21/D21","v":0.36968966288052463}]
[null,"Speed calculated from P=K.rho.N^3",null,null,null,{"$f":"(F20/$D20*$D23/F23)^(1/3)*$D21","v":838.96094221462204},{"$f":"(G20/$D20*$D23/G23)^(1/3)*$D21","v":2226.2595467506967},{"$f":"(H20/$D20*$D23/H23)^(1/3)*$D21","v":2198.8823357180813},{"$f":"(I20/$D20*$D23/I23)^(1/3)*$D21","v":2203.3033626620931}]
[null,"Brake Pressure",null,5,null,{"$f":"($D23-$D17)+F17","v":4.9700000000000006},{"$f":"($D23-$D17)+G17","v":3.8520000000000003},{"$f":"($D23-$D17)+H17","v":3.58},{"$f":"($D23-$D17)+I17","v":2.67}]
[null,"Rho (brake)",null,{"$f":"[3]!rho_(11,D23,330)","v":0.72791980970899706},null,{"$f":"[3]!rho_(11,F23,330)","v":0.72356117334975023},{"$f":"[3]!rho_(11,G23,330)","v":0.56105295425238932},{"$f":"[3]!rho_(11,H23,330)","v":0.52149356391742452},{"$f":"[3]!rho_(11,I23,330)","v":0.38908005642591575}]
[null,"Wheel","mm",35.75,null,{"$f":"$D$25","v":35.75},{"$f":"$D$25","v":35.75},{"$f":"$D$25","v":35.75},{"$f":"$D$25","v":35.75}]
[null,"a = mÖT/P",null,{"$f":"D14*D16^0.5/D15","v":84.04569568316515},null,{"$f":"+$D$26","v":84.04569568316515},{"$f":"+$D$26","v":84.04569568316515},{"$f":"+$D$26","v":84.04569568316515},{"$f":"+$D$26","v":84.04569568316515}]
[null,"Rho (in)","kg/m3",{"$f":"[3]!rho_(11,D15,D16)","v":14.326932606465537},null,{"$f":"[3]!rho_(11,F15,F16)","v":9.5062974480992377},{"$f":"[3]!rho_(11,G15,G16)","v":14.178141597167654},{"$f":"[3]!rho_(11,H15,H16)","v":7.3557574001558121},{"$f":"[3]!rho_(11,I15,I16)","v":11.708162912666104}]
[null,"Sound Speed @inlet",null,{"$f":"[3]!Sound_speed(11,D15,D16)","v":424.97609909502609},null,{"$f":"[3]!Sound_speed(11,F15,F16)","v":357.33101892933001},{"$f":"[3]!Sound_speed(11,G15,G16)","v":391.28919888209964},{"$f":"[3]!Sound_speed(11,H15,H16)","v":488.85573725029269},{"$f":"[3]!Sound_speed(11,I15,I16)","v":370.51577371924787}]
[null,"S=Q/(rho*V) = cte",null,{"$f":"D14/(D27*D28)","v":2.9484591547043137E-2},null,{"$f":"F14/(F27*F28)","v":2.9438649523340903E-2},{"$f":"G14/(G27*G28)","v":2.9411177253717405E-2},{"$f":"H14/(H27*H28)","v":2.9632795199014652E-2},{"$f":"I14/(I27*I28)","v":2.9414249163506757E-2}]
[null,"Hin",null,{"$f":"[3]!h_(11,D15,D16)","v":265.47793777251547},null,{"$f":"[3]!h_(11,F15,F16)","v":196.66318438963236},{"$f":"[3]!h_(11,G15,G16)","v":227.21274224322462},{"$f":"[3]!h_(11,H15,H16)","v":360.14220393657763},{"$f":"[3]!h_(11,I15,I16)","v":207.89085729231627}]
[null,"Hout",null,{"$f":"[3]!h_(11,D17,D18)","v":209.6678826333785},null,{"$f":"[3]!h_(11,F17,F18)","v":191.24437276049545},{"$f":"[3]!h_(11,G17,G18)","v":179.11701206828309},{"$f":"[3]!h_(11,H17,H18)","v":294.1897890769298},{"$f":"[3]!h_(11,I17,I18)","v":166.56676098407257}]
[null,"Sin = Sout",null,{"$f":"[3]!S_(11,D15,D16)","v":16.442886679168037},null,{"$f":"[3]!S_(11,F15,F16)","v":16.352452446876423},{"$f":"[3]!S_(11,G15,G16)","v":15.956591869557485},{"$f":"[3]!S_(11,H15,H16)","v":18.892034584941154},{"$f":"[3]!S_(11,I15,I16)","v":16.084358655112414}]
[null,"Tout(iso)",null,{"$f":"[1]!HeCalc(2,0,1,D17*10^5,8,D32*1000,1)","v":34.250046791213649},null,{"$f":"[1]!HeCalc(2,0,1,F17*10^5,8,F32*1000,1)","v":33.608179052086747},{"$f":"[1]!HeCalc(2,0,1,G17*10^5,8,G32*1000,1)","v":28.875086473743544},{"$f":"[1]!HeCalc(2,0,1,H17*10^5,8,H32*1000,1)","v":49.330781375480868},{"$f":"[1]!HeCalc(2,0,1,I17*10^5,8,I32*1000,1)","v":26.699737772795068}]
[null,"Hout(iso)",null,{"$f":"[3]!h_(11,D17,D33)","v":192.71385023778672},null,{"$f":"[3]!h_(11,F17,F33)","v":189.30844634689711},{"$f":"[3]!h_(11,G17,G33)","v":164.26361740133086},{"$f":"[3]!h_(11,H17,H33)","v":272.01032143860527},{"$f":"[3]!h_(11,I17,I33)","v":152.92333233105427}]
[null,"ΔHs",null,{"$f":"D30-D34","v":72.764087534728759},null,7.3547380427352493,62.949124841893763,88.131882497972356,54.967524961262001]
[null,"u1","m/s",{"$f":"(2*52.7%*D35*1000*D19)^0.5","v":242.53617898501321},null,{"$f":"PI()*$D$37*F21","v":89.663118245300126},{"$f":"PI()*$D$37*G21","v":238.69412959487408},{"$f":"PI()*$D$37*H21","v":236.61547048536849},{"$f":"PI()*$D$37*I21","v":235.82342317137048}]
[null,"D1",null,{"$f":"D36/PI()/D21","v":3.4869766724557834E-2},null,null,null,null,null,null,null,null,"T1"]
[null,"Co = (2*ΔHs)^0,5",null,{"$f":"(2000*D35)^0.5","v":381.48155272497456},null,121.28262895184329,354.82143351802682,419.83778414519185,331.56454865157707,null,null,"MAX",{"$f":"ROUND(F14,0)&\"g/s @ \"&F15&\" b ; \"&F16&\"K\"","v":"100g/s @ 7,03912286644876 b ; 35K"}]
[null,"u1/Co",null,{"$f":"D36/D38","v":0.63577433103263925},null,0.73929068837139023,0.67271620890609796,0.56358784135431728,0.71124438402847567,null,null,"MIN",{"$f":"ROUND(G14,0)&\"g/s @ \"&G15&\" b ; \"&G16&\"K\"","v":"163g/s @ 12,39 b ; 40,73K"}]
[null,"U1/C0 off de / U1/C0 nom",null,{"$f":"D39/$D$39","v":1},null,{"$f":"F39/$D39","v":1.1628193405836587},{"$f":"G39/$D39","v":1.0581053308859716},{"$f":"H39/$D39","v":0.88645894281218462},{"$f":"I39/$D39","v":1.1187057251481924},null,null,"STS",{"$f":"ROUND(H14,0)&\"g/s @ \"&H15&\" b ; \"&H16&\"K\"","v":"107g/s @ 10,3 b ; 66K"}]
[null,"Rdt",null,{"$f":"(0.321*D40^4-1.6098*D40^3+1.316*D40^2+0.9448*D40)*($D19/0.97215493)","v":0.76687776504923977},null,{"$f":"(0.321*F40^4-1.6098*F40^3+1.316*F40^2+0.9448*F40)*($D19/0.97215493)","v":0.73677833223299072},{"$f":"(0.321*G40^4-1.6098*G40^3+1.316*G40^2+0.9448*G40)*($D19/0.97215493)","v":0.76404128406457295},{"$f":"(0.321*H40^4-1.6098*H40^3+1.316*H40^2+0.9448*H40)*($D19/0.97)","v":0.75000024253643705},{"$f":"(0.321*I40^4-1.6098*I40^3+1.316*I40^2+0.9448*I40)*($D19/0.97215493)","v":0.75179110460888798},null,null,"BAKING",{"$f":"ROUND(I14,0)&\"g/s @ \"&I15&\" b ; \"&I16&\"K\"","v":"128g/s @ 9,25 b ; 37,12K"}]
["ligne_ToBeNull_T1","Converge brake Power",null,null,null,{"$f":"F21-F22","v":-20.46802859714046},{"$f":"G21-G22","v":-47.331829101997755},{"$f":"H21-H22","v":-38.929730515306346},{"$f":"I21-I22","v":-50.580989091276024}]
["ligne_ToChange_T1","By changing turbine speed",null,null,null,{"$f":"CELL(\"address\",F21)","v":"$F$21"},{"$f":"CELL(\"address\",G21)","v":"$G$21"},{"$f":"CELL(\"address\",H21)","v":"$H$21"},{"$f":"CELL(\"address\",I21)","v":"$I$21"}]
[]
[null,"TURBINE 2"]
[null,null,null,null,null,{"$f":"IF(ISERROR(F49),\"\",\"X\")","v":"X"},"X",{"$f":"IF(ISERROR(H49),\"\",\"X\")","v":"X"},{"$f":"IF(ISERROR(I49),\"\",\"X\")","v":"X"}]
[null,null,null,"DESIGN",null,{"$f":"F12","v":"D3"},{"$f":"G12","v":"STS"},{"$f":"H12","v":"start-up"},{"$f":"I12","v":"BAKING"},null,null,null,null,null,null,null,null,null,"K.rho"]
[null,null,null,null,null,null,null,18,null,null,null,null,null,null,null,null,838,2075,{"$f":"R48/Q48^(3)","v":3.5260303420909438E-6}]
[null,"m","g/s",221.07,null,{"$f":"F14","v":100},{"$f":"G14","v":163.16596646576537},{"$f":"H61/(H52*H51)^0.5*H50","v":79.425216541554732},{"$f":"I14","v":127.60074950084292},null,null,null,null,null,null,null,650,{"$f":"S48*Q49^3","v":968.33608269672538}]
[null,"Pin","Bara",7.65,null,{"$f":"F49*F51^0.5/F61","v":3.7778898253910644},{"$f":"G49*G51^0.5/G61","v":5.424637703990224},4.87,{"$f":"I49*I51^0.5/I61","v":4.1723463722812903},null,null,null,null,null,null,null,{"$f":"Q49/Q48","v":0.77565632458233891},{"$f":"R49/R48","v":0.46666799166107248}]
[null,"Tin","K",19.23,null,22.92,17.75,52.5,17.170000000000002]
[null,"Pout","Bara",2.63,null,1.35,1.29,1.1499999999999999,1.35]
[null,"Tout","K",{"$f":"[3]!T2_turb(11,D50,D51,D52,D54)","v":13.90307027770006},null,{"$f":"[3]!T2_turb(11,F50,F51,F52,F54)","v":17.411322363879194},{"$f":"[3]!T2_turb(11,G50,G51,G52,G54)","v":11.631162591212094},{"$f":"[3]!T2_turb(11,H50,H51,H52,H54)","v":40.155681333870575},{"$f":"[3]!T2_turb(11,I50,I51,I52,I54)","v":12.335460688378724}]
[null,"Efficacity","%",0.77,null,{"$f":"(0.321*F75^4-1.6098*F75^3+1.316*F75^2+0.9448*F75)*($D$54/0.97215493)","v":0.70194332044816277},{"$f":"(0.321*G75^4-1.6098*G75^3+1.316*G75^2+0.9448*G75)*($D$54/0.97215493)","v":0.7638708920436944},{"$f":"(0.321*H75^4-1.6098*H75^3+1.316*H75^2+0.9448*H75)*($D$54/0.97215493)","v":0.53764803735927336},{"$f":"(0.321*I75^4-1.6098*I75^3+1.316*I75^2+0.9448*I75)*($D$54/0.97215493)","v":0.7522057871925989}]
[null,"Power","W",{"$f":"+D49*(D65-D66)","v":5783.0974416758472},null,{"$f":"+F49*(F65-F66)","v":2810.938118883611},{"$f":"+G49*(G65-G66)","v":4886.4308937414917},{"$f":"+H49*(H65-H66)","v":5142.4799063138371},{"$f":"+I49*(I65-I66)","v":3040.226891240688}]
[null,"Speed","Hz",1461,null,1222.6554920974363,1474.8708791055822,1511.7355909072894,1255.034361534159]
[null,"Speed calculated from P=K.rho.N^3",null,null,null,{"$f":"(F55/$D55*$D58/F58)^(1/3)*$D56","v":1222.6554850134282},{"$f":"(G55/$D55*$D58/G58)^(1/3)*$D56","v":1474.8713864101887},{"$f":"(H55/$D55*$D58/H58)^(1/3)*$D56","v":1511.735590805391},{"$f":"(I55/$D55*$D58/I58)^(1/3)*$D56","v":1255.0345186411048}]
[null,"Brake Pressure",null,7.5,null,{"$f":"($D58-$D52)+F52","v":6.2200000000000006},{"$f":"($D58-$D52)+G52","v":6.16},{"$f":"($D58-$D52)+H52","v":6.02},{"$f":"($D58-$D52)+I52","v":6.2200000000000006}]
[null,"Rho (brake)",null,{"$f":"[3]!rho_(11,D58,345)","v":1.0434974503076984},null,{"$f":"[3]!rho_(11,F58,345)","v":0.86583806638273708},{"$f":"[3]!rho_(11,G58,345)","v":0.85750593949810261},{"$f":"[3]!rho_(11,H58,345)","v":0.83806279687981755},{"$f":"[3]!rho_(11,I58,345)","v":0.86583806638273708}]
[null,"Wheel","mm",39.5,null,{"$f":"$D$25","v":35.75},{"$f":"$D$25","v":35.75},{"$f":"$D$25","v":35.75},{"$f":"$D$25","v":35.75}]
[null,"a = mÖT/P",null,{"$f":"D49*D51^0.5/D50","v":126.72375063078388},null,{"$f":"$D$61","v":126.72375063078388},{"$f":"$D$61","v":126.72375063078388},126.72375063078388,126.72375063078388]
[null,"Rho (in)","kg/m3",{"$f":"[3]!rho_(11,D50,D51)","v":19.217903378116645},null,{"$f":"[3]!rho_(11,F50,F51)","v":7.9028387956892638},{"$f":"[3]!rho_(11,G50,G51)","v":14.863042781346348},{"$f":"[3]!rho_(11,H50,H51)","v":4.414094182882728},{"$f":"[3]!rho_(11,I50,I51)","v":11.827207280391356}]
[null,"Sound Speed",null,{"$f":"[3]!Sound_speed(11,D50,D51)","v":267.51718957045131},null,{"$f":"[3]!Sound_speed(11,F50,F51)","v":286.47017138626438},{"$f":"[3]!Sound_speed(11,G50,G51)","v":253.87842052263198},{"$f":"[3]!Sound_speed(11,H50,H51)","v":431.99130225370175},{"$f":"[3]!Sound_speed(11,I50,I51)","v":248.05910327396779},null,null,null,null,null,null,null,null,null,null,"T2"]
[null,"S=Q/(rho*V) = cte",null,{"$f":"D49/(D62*D63)","v":4.3000362071050666E-2},null,{"$f":"F49/(F62*F63)","v":4.4171024151202581E-2},{"$f":"G49/(G62*G63)","v":4.3241033170515489E-2},{"$f":"H49/(H62*H63)","v":4.1652570617398875E-2},{"$f":"I49/(I62*I63)","v":4.3492647774600102E-2},null,null,null,null,null,null,null,null,null,"MAX",{"$f":"ROUND(F49,0)&\"g/s @ \"&F50&\" b ; \"&F51&\"K\"","v":"100g/s @ 3,77788982539106 b ; 22,92K"}]
[null,"Hin",null,{"$f":"[3]!h_(11,D50,D51)","v":110.91238964743106},null,{"$f":"[3]!h_(11,F50,F51)","v":132.84673230795127},{"$f":"[3]!h_(11,G50,G51)","v":103.8639879723769},{"$f":"[3]!h_(11,H50,H51)","v":288.57025422464784},{"$f":"[3]!h_(11,I50,I51)","v":101.47146282453596},null,null,null,null,null,null,null,null,null,"MIN",{"$f":"ROUND(G49,0)&\"g/s @ \"&G50&\" b ; \"&G51&\"K\"","v":"163g/s @ 5,42463770399022 b ; 17,75K"}]
[null,"Hout",null,{"$f":"[3]!h_(11,D52,D53)","v":84.752813758907749},null,{"$f":"[3]!h_(11,F52,F53)","v":104.73735111911516},{"$f":"[3]!h_(11,G52,G53)","v":73.916376962658546},{"$f":"[3]!h_(11,H52,H53)","v":223.82406743114598},{"$f":"[3]!h_(11,I52,I53)","v":77.645373219783252},null,null,null,null,null,null,null,null,null,"STS",{"$f":"ROUND(H49,0)&\"g/s @ \"&H50&\" b ; \"&H51&\"K\"","v":"79g/s @ 4,87 b ; 52,5K"}]
[null,"Sin = Sout",null,{"$f":"[3]!S_(11,D50,D51)","v":12.910711622114368},null,{"$f":"[3]!S_(11,F50,F51)","v":15.42404981394478},{"$f":"[3]!S_(11,G50,G51)","v":13.238320944253838},{"$f":"[3]!S_(11,H50,H51)","v":19.260113557237521},{"$f":"[3]!S_(11,I50,I51)","v":13.640710873785068},null,null,null,null,null,null,null,null,null,"BAKING",{"$f":"ROUND(I49,0)&\"g/s @ \"&I50&\" b ; \"&I51&\"K\"","v":"128g/s @ 4,17234637228129 b ; 17,17K"}]
[null,"Tout(iso)",null,{"$f":"[1]!HeCalc(2,0,1,D52*10^5,8,D67*1000,1)","v":12.49474527885358},null,{"$f":"[1]!HeCalc(2,0,1,F52*10^5,8,F67*1000,1)","v":15.163584955184263},{"$f":"[1]!HeCalc(2,0,1,G52*10^5,8,G67*1000,1)","v":9.9338696032139797},{"$f":"[1]!HeCalc(2,0,1,H52*10^5,8,H67*1000,1)","v":29.476863341337229},{"$f":"[1]!HeCalc(2,0,1,I52*10^5,8,I67*1000,1)","v":10.889099597443535}]
[null,"Hout(iso)",null,{"$f":"[3]!h_(11,D52,D68)","v":76.938914467696648},null,{"$f":"[3]!h_(11,F52,F68)","v":92.801645518195528},{"$f":"[3]!h_(11,G52,G68)","v":64.658918998467513},{"$f":"[3]!h_(11,H52,H68)","v":168.14539949717414},{"$f":"[3]!h_(11,I52,I68)","v":69.796500985070423}]
[null,"ΔHs",null,{"$f":"D65-D69","v":33.973475179734407},null,40.045086789755743,39.205068973909391,120.4248547274737,31.674961839465539]
[null,"u1","m/s",{"$f":"(2*52.7%*D70*1000*D54)^0.5","v":166.04876689204548},null,{"$f":"PI()*$D$72*F56","v":138.95991567184555},{"$f":"PI()*$D$72*G56","v":167.62525037677548},171.81507921764074,142.63990974667536]
[null,"D1",null,{"$f":"D71/PI()/D56","v":3.617725125966173E-2}]
[null,"Co = (2*ΔHs)^0,5",null,{"$f":"(2000*D70)^0.5","v":260.66635831934434},null,283.00207345443863,280.01810289304296,490.76441339500911,251.69410735837872]
[null,"u1/Co",null,{"$f":"D71/D73","v":0.63701648330321881},null,0.49102083944348601,0.59862290560836495,0.3500968581422983,0.56671930560366768]
[null,"U1/C0 off de / U1/C0 nom",null,{"$f":"D74/$D$39","v":1.001953762852555},null,{"$f":"F74/$D74","v":0.77081339700555429},{"$f":"G74/$D74","v":0.93972906714161342},{"$f":"H74/$D74","v":0.54958838164891377},{"$f":"I74/$D74","v":0.88964621867392124}]
[null,"Rdt",null,{"$f":"(0.321*D75^4-1.6098*D75^3+1.316*D75^2+0.9448*D75)*($D54/0.97215493)","v":0.76992107674452037},null,{"$f":"(0.321*F75^4-1.6098*F75^3+1.316*F75^2+0.9448*F75)*($D54/0.97215493)","v":0.70194332044816277},{"$f":"(0.321*G75^4-1.6098*G75^3+1.316*G75^2+0.9448*G75)*($D54/0.97215493)","v":0.7638708920436944},{"$f":"(0.321*H75^4-1.6098*H75^3+1.316*H75^2+0.9448*H75)*($D54/0.97215493)","v":0.53764803735927336},{"$f":"(0.321*I75^4-1.6098*I75^3+1.316*I75^2+0.9448*I75)*($D54/0.97215493)","v":0.7522057871925989}]
["ligne_ToBeNull_T2","Converge brake Power",null,null,null,{"$f":"F56-F57","v":7.0840080752532231E-6},{"$f":"G56-G57","v":-5.07304606571779E-4},{"$f":"H56-H57","v":1.0189842214458622E-7},{"$f":"I56-I57","v":-1.5710694583503937E-4}]
["ligne_ToChange_T2","By changing turbine speed",null,null,null,{"$f":"CELL(\"address\",F56)","v":"$F$56"},{"$f":"CELL(\"address\",G56)","v":"$G$56"},{"$f":"CELL(\"address\",H56)","v":"$H$56"},{"$f":"CELL(\"address\",I56)","v":"$I$56"}]
[]
[null,"CV330"]
[null,"Pin","Bara",13.15,null,13.15,13.25,13.5,12.25,13.15,13.15,13.15,13.15,13.15,13.15,13.15,13.15,13.15,13.15,13.15,13.15,13.15,13.15,13.15,13.15,13.15,13.15,13.15]
[null,"Tin","K",{"$f":"[3]!T_P_H_(11,D81,[3]!h_(11,D96,D97))","v":8.83514415424081},null,{"$f":"[3]!T_P_H_(11,F81,[3]!h_(11,F96,F97))","v":9.1661496679837366},{"$f":"[3]!T_P_H_(11,G81,[3]!h_(11,G96,G97))","v":8.6223146254179426},{"$f":"+H97","v":8.8279999999999994},{"$f":"[3]!T_P_H_(11,I81,[3]!h_(11,I96,I97))","v":10.795640526772669},{"$f":"[3]!T_P_H_(11,J81,[3]!h_(11,J96,J97))","v":7.289570189226823},{"$f":"[3]!T_P_H_(11,K81,[3]!h_(11,K96,K97))","v":7.2875494761866335},{"$f":"[3]!T_P_H_(11,L81,[3]!h_(11,L96,L97))","v":7.286091223216423},{"$f":"[3]!T_P_H_(11,M81,[3]!h_(11,M96,M97))","v":7.2817678358976652},{"$f":"[3]!T_P_H_(11,N81,[3]!h_(11,N96,N97))","v":7.2801751232542466},{"$f":"[3]!T_P_H_(11,O81,[3]!h_(11,O96,O97))","v":7.2808852270882953},{"$f":"[3]!T_P_H_(11,P81,[3]!h_(11,P96,P97))","v":7.2835767670375562},{"$f":"[3]!T_P_H_(11,Q81,[3]!h_(11,Q96,Q97))","v":7.2929775419785274},{"$f":"[3]!T_P_H_(11,R81,[3]!h_(11,R96,R97))","v":7.309641747149449},{"$f":"[3]!T_P_H_(11,S81,[3]!h_(11,S96,S97))","v":7.3351707676476412},{"$f":"[3]!T_P_H_(11,T81,[3]!h_(11,T96,T97))","v":7.3715975333960877},{"$f":"[3]!T_P_H_(11,U81,[3]!h_(11,U96,U97))","v":7.4214865443397402},{"$f":"[3]!T_P_H_(11,V81,[3]!h_(11,V96,V97))","v":7.4880009996514749},{"$f":"[3]!T_P_H_(11,W81,[3]!h_(11,W96,W97))","v":7.574845195653733},{"$f":"[3]!T_P_H_(11,X81,[3]!h_(11,X96,X97))","v":7.6859260832822134},{"$f":"[3]!T_P_H_(11,Y81,[3]!h_(11,Y96,Y97))","v":7.8246161009732589},{"$f":"[3]!T_P_H_(11,Z81,[3]!h_(11,Z96,Z97))","v":7.9928254087617381},{"$f":"[3]!T_P_H_(11,AA81,[3]!h_(11,AA96,AA97))","v":8.190438152641093},{"$f":"[3]!T_P_H_(11,AB81,[3]!h_(11,AB96,AB97))","v":8.414996515030289}]
[null,"Rho",null,{"$f":"[3]!rho_(11,D81,D82)","v":97.618685329309102},null,{"$f":"[3]!rho_(11,F81,F82)","v":92.385436868539188},{"$f":"[3]!rho_(11,G81,G82)","v":101.58811590421918},{"$f":"[3]!rho_(11,H81,H82)","v":99.5385923004863},{"$f":"[3]!rho_(11,I81,I82)","v":66.476961067945879},{"$f":"[3]!rho_(11,J81,J82)","v":122.3554602961871},{"$f":"[3]!rho_(11,K81,K82)","v":122.38525605267236},{"$f":"[3]!rho_(11,L81,L82)","v":122.40675166263661},{"$f":"[3]!rho_(11,M81,M82)","v":122.47044880873382},{"$f":"[3]!rho_(11,N81,N82)","v":122.4939022601133},{"$f":"[3]!rho_(11,O81,O82)","v":122.48344645754396},{"$f":"[3]!rho_(11,P81,P82)","v":122.44380344539697},{"$f":"[3]!rho_(11,Q81,Q82)","v":122.30519433940992},{"$f":"[3]!rho_(11,R81,R82)","v":122.05892824408417},{"$f":"[3]!rho_(11,S81,S82)","v":121.68027091130101},{"$f":"[3]!rho_(11,T81,T82)","v":121.13709609048141},{"$f":"[3]!rho_(11,U81,U82)","v":120.3877662475066},{"$f":"[3]!rho_(11,V81,V82)","v":119.37920067123139},{"$f":"[3]!rho_(11,W81,W82)","v":118.04655161202567},{"$f":"[3]!rho_(11,X81,X82)","v":116.31729006265563},{"$f":"[3]!rho_(11,Y81,Y82)","v":114.12277996026393},{"$f":"[3]!rho_(11,Z81,Z82)","v":111.41624187103298},{"$f":"[3]!rho_(11,AA81,AA82)","v":108.18992422198602},{"$f":"[3]!rho_(11,AB81,AB82)","v":104.49208532283211}]
[null,"dP",null,{"$f":"(D81-D96)*1000","v":80.000000000000071},null,{"$f":"(F81-F96)*1000","v":80.000000000000071},5881,429.99999999999972,1769.9999999999995,25.000000000000355,150.00000000000034,250,650.00000000000034,1150.0000000000005,1349.9999999999995,1650.0000000000005,2150.0000000000005,2650.0000000000005,3150.0000000000005,3650.0000000000005,4150,4650,5150,5650,6150,6650,7150,7650]
[null,"Cvs",null,30,null,30,30,30,30,30,30,30,30,30,30,30,30,30,30,30,30,30,30,30,30,30,30,30]
[null,"Range",null,250,null,250,250,250,250,250,250,250,250,250,250,250,250,250,250,250,250,250,250,250,250,250,250,250]
[null,"Flow",null,{"$f":"IF(D81/2>D96,\"S\",\"SS\")","v":"SS"},null,{"$f":"IF(F81/2>F96,\"S\",\"SS\")","v":"SS"},"SS","SS","SS","SS","SS","SS","SS","SS","SS","SS","SS","SS","SS","SS","SS","SS","SS","SS","SS","S","S","S"]
[null,"Cv",null,{"$f":"[3]!Cv_Simple(D82,D81,D81-D96,D83,D95,D87)","v":16.86490566711419},null,{"$f":"[3]!Cv_Simple(F82,F81,F81-F96,F83,F95,F87)","v":17.020850224491312},{"$f":"[3]!Cv_Simple(G82,G81,G81-G96,G83,G95,G87)","v":1.535313625509525},{"$f":"[3]!Cv_Simple(H82,H81,H81-H96,H83,H95,H87)","v":7.2999285506943572},{"$f":"[3]!Cv_Simple(I82,I81,I81-I96,I83,I95,I87)","v":3.4353841882096745},{"$f":"[3]!Cv_Simple(J82,J81,J81-J96,J83,J95,J87)","v":29.71954492298671},{"$f":"[3]!Cv_Simple(K82,K81,K81-K96,K83,K95,K87)","v":12.073569242544334},{"$f":"[3]!Cv_Simple(L82,L81,L81-L96,L83,L95,L87)","v":9.3152892592094663},{"$f":"[3]!Cv_Simple(M82,M81,M81-M96,M83,M95,M87)","v":5.6853454006552129},{"$f":"[3]!Cv_Simple(N82,N81,N81-N96,N83,N95,N87)","v":4.1875369167403242},{"$f":"[3]!Cv_Simple(O82,O81,O81-O96,O83,O95,O87)","v":3.8327421364979402},{"$f":"[3]!Cv_Simple(P82,P81,P81-P96,P83,P95,P87)","v":3.4230459044189856},{"$f":"[3]!Cv_Simple(Q82,Q81,Q81-Q96,Q83,Q95,Q87)","v":2.9344643822636391},{"$f":"[3]!Cv_Simple(R82,R81,R81-R96,R83,R95,R87)","v":2.5850033924246105},{"$f":"[3]!Cv_Simple(S82,S81,S81-S96,S83,S95,S87)","v":2.3174417142558483},{"$f":"[3]!Cv_Simple(T82,T81,T81-T96,T83,T95,T87)","v":2.1030566532563606},{"$f":"[3]!Cv_Simple(U82,U81,U81-U96,U83,U95,U87)","v":1.9256626596710031},{"$f":"[3]!Cv_Simple(V82,V81,V81-V96,V83,V95,V87)","v":1.7753861763520213},{"$f":"[3]!Cv_Simple(W82,W81,W81-W96,W83,W95,W87)","v":1.6458449052244624},{"$f":"[3]!Cv_Simple(X82,X81,X81-X96,X83,X95,X87)","v":1.5327045651923195},{"$f":"[3]!Cv_Simple(Y82,Y81,Y81-Y96,Y83,Y95,Y87)","v":1.4328458558145576},{"$f":"[3]!Cv_Simple(Z82,Z81,Z81-Z96,Z83,Z95,Z87)","v":1.0832246724633305},{"$f":"[3]!Cv_Simple(AA82,AA81,AA81-AA96,AA83,AA95,AA87)","v":1.0146991146733895},{"$f":"[3]!Cv_Simple(AB82,AB81,AB81-AB96,AB83,AB95,AB87)","v":0.94645600418806008}]
[null,"Cv",null,{"$f":"[3]!cv_gaz(11,D95,D81,D96,D82,0.87)","v":16.846503800667069},null,{"$f":"[3]!cv_gaz(11,F95,F81,F96,F82,0.87)","v":17.002105092951723},{"$f":"[3]!cv_gaz(11,G95,G81,G96,G82,0.87)","v":1.2627120317211815},{"$f":"[3]!cv_gaz(11,H95,H81,H96,H82,0.87)","v":7.2358281748606679},{"$f":"[3]!cv_gaz(11,I95,I81,I96,I82,0.87)","v":3.2823013310303684},{"$f":"[3]!cv_gaz(11,J95,J81,J96,J82,0.87)","v":29.726401811175741},{"$f":"[3]!cv_gaz(11,K95,K81,K96,K82,0.87)","v":12.047182454828723},{"$f":"[3]!cv_gaz(11,L95,L81,L96,L82,0.87)","v":9.2767027873387438},{"$f":"[3]!cv_gaz(11,M95,M81,M96,M82,0.87)","v":5.6160389856115964},{"$f":"[3]!cv_gaz(11,N95,N81,N96,N82,0.87)","v":4.0921253101196147},{"$f":"[3]!cv_gaz(11,O95,O81,O96,O82,0.87)","v":3.7284825006099074},{"$f":"[3]!cv_gaz(11,P95,P81,P96,P82,0.87)","v":3.3065369640272593},{"$f":"[3]!cv_gaz(11,Q95,Q81,Q96,Q82,0.87)","v":2.7994044920361576},{"$f":"[3]!cv_gaz(11,R95,R81,R96,R82,0.87)","v":2.4328936873258544},{"$f":"[3]!cv_gaz(11,S95,S81,S96,S82,0.87)","v":2.1492012149673534},{"$f":"[3]!cv_gaz(11,T95,T81,T96,T82,0.87)","v":1.9192194296596998},{"$f":"[3]!cv_gaz(11,U95,U81,U96,U82,0.87)","v":1.7264731351804079},{"$f":"[3]!cv_gaz(11,V95,V81,V96,V82,0.87)","v":1.5608501402798964},{"$f":"[3]!cv_gaz(11,W95,W81,W96,W82,0.87)","v":1.4157664503577014},{"$f":"[3]!cv_gaz(11,X95,X81,X96,X82,0.87)","v":1.2867353309083409},{"$f":"[3]!cv_gaz(11,Y95,Y81,Y96,Y82,0.87)","v":1.1705736499414225},{"$f":"[3]!cv_gaz(11,Z95,Z81,Z96,Z82,0.87)","v":1.0649246086326944},{"$f":"[3]!cv_gaz(11,AA95,AA81,AA96,AA82,0.87)","v":0.96795120053011252},{"$f":"[3]!cv_gaz(11,AB95,AB81,AB96,AB82,0.87)","v":0.87809277810225117}]
[null,"Trim",null,{"$f":"[3]!Trim_From_Cv(D88/D85,D86)","v":0.89568657369058546},null,{"$f":"[3]!Trim_From_Cv(F89/F85,F86)","v":0.89715399153910602},{"$f":"[3]!Trim_From_Cv(G89/G85,G86)","v":0.42625047703771818},{"$f":"[3]!Trim_From_Cv(H89/H85,H86)","v":0.74243183435680637},{"$f":"[3]!Trim_From_Cv(I89/I85,I86)","v":0.59926319992270949},{"$f":"[3]!Trim_From_Cv(J89/J85,J86)","v":0.99834069623954791},{"$f":"[3]!Trim_From_Cv(K89/K85,K86)","v":0.83475993331938558},{"$f":"[3]!Trim_From_Cv(L89/L85,L86)","v":0.78743104070687497},{"$f":"[3]!Trim_From_Cv(M89/M85,M86)","v":0.6965348848780647},{"$f":"[3]!Trim_From_Cv(N89/N85,N86)","v":0.63920184522168699},{"$f":"[3]!Trim_From_Cv(O89/O85,O86)","v":0.62234703856389673},{"$f":"[3]!Trim_From_Cv(P89/P85,P86)","v":0.60059556570308092},{"$f":"[3]!Trim_From_Cv(Q89/Q85,Q86)","v":0.57044146398941731},{"$f":"[3]!Trim_From_Cv(R89/R85,R86)","v":0.54502693176465988},{"$f":"[3]!Trim_From_Cv(S89/S85,S86)","v":0.52257180197537889},{"$f":"[3]!Trim_From_Cv(T89/T85,T86)","v":0.5020740223944562},{"$f":"[3]!Trim_From_Cv(U89/U85,U86)","v":0.48290556671756518},{"$f":"[3]!Trim_From_Cv(V89/V85,V86)","v":0.46464046543228915},{"$f":"[3]!Trim_From_Cv(W89/W85,W86)","v":0.44697130313757627},{"$f":"[3]!Trim_From_Cv(X89/X85,X86)","v":0.42966378479669848},{"$f":"[3]!Trim_From_Cv(Y89/Y85,Y86)","v":0.41252804245684033},{"$f":"[3]!Trim_From_Cv(Z89/Z85,Z86)","v":0.39539672114255575},{"$f":"[3]!Trim_From_Cv(AA89/AA85,AA86)","v":0.37810462875766587},{"$f":"[3]!Trim_From_Cv(AB89/AB85,AB86)","v":0.36045904239802407}]
[null,"TURBINE 3"]
[null,null,null,null,null,{"$f":"IF(ISERROR(F95),\"\",\"X\")","v":"X"},"X","X",{"$f":"IF(ISERROR(I95),\"\",\"X\")","v":"X"},"X","X","X","X","X","X","X","X","X","X","X","X","X","X","X","X","X","X","X"]
[null,null,null,"DESIGN",null,{"$f":"F47","v":"D3"},{"$f":"G47","v":"STS"},"D",{"$f":"I47","v":"BAKING"},"Lamin 1","Lamin 2","Lamin 3","Lamin 4","Lamin 5","Lamin 6","Lamin 7","Lamin 8","Lamin 9","Lamin 10","Lamin 11","Lamin 12","Lamin 13","Lamin 14","Lamin 15","Lamin 16","Lamin 17","Lamin 18","Lamin 19"]
[]
[null,"m","g/s",357,null,{"$f":"F107*F96/F97^0.5","v":350.51033754354637},212.63678514378054,357.04043722049556,261.88343767167311,394.55588750001016,390.79821238096241,387.79207228572432,375.76751190477154,360.73681142858072,354.72453123810442,345.70611095238991,330.67541047619898,315.6447100000081,300.61400952381729,285.58330904762641,270.55260857143554,255.52190809524467,240.49120761905382,225.46050714286298,210.42980666667208,195.39910619048121,180.36840571429036,165.33770523809949]
[null,"Pin","Bara",13.07,null,13.07,7.3689999999999998,13.07,10.48,13.125,13,12.9,12.5,12,11.8,11.5,11,10.5,10,{"$f":"S96-0.5","v":9.5},{"$f":"T96-0.5","v":9},8.5,8,7.5,7,6.5,6,5.5]
[null,"Tin","K",8.83,null,9.16,7.9119999999999999,8.8279999999999994,10.55,7.29,7.29,7.29,7.29,7.29,7.29,7.29,7.29,7.29,7.29,7.29,7.29,7.29,7.29,7.29,7.29,7.29,7.29,7.29]
[null,"Pout","Bara",4.88,null,4.88,5.18,4.88,5.18,4.88,4.88,4.88,4.88,4.88,4.88,4.88,4.88,4.88,4.88,4.88,4.88,4.88,4.88,4.88,4.88,4.88,4.88,4.88]
[null,"Tout","K",{"$f":"[3]!T2_turb(11,D96,D97,D98,D100)","v":6.7649101381879646},null,{"$f":"[3]!T2_turb(11,F96,F97,F98,F100)","v":6.9325192540873024},{"$f":"[3]!T2_turb(11,G96,G97,G98,G100)","v":7.105446541851685},{"$f":"[3]!T2_turb(11,H96,H97,H98,H100)","v":6.7658344437536924},{"$f":"[3]!T2_turb(11,I96,I97,I98,I100)","v":8.4481593663233578},{"$f":"[3]!T2_turb(11,J96,J97,J98,J100)","v":6.1181699260890161},{"$f":"[3]!T2_turb(11,K96,K97,K98,K100)","v":6.1222602067537357},{"$f":"[3]!T2_turb(11,L96,L97,L98,L100)","v":6.1256059489303052},{"$f":"[3]!T2_turb(11,M96,M97,M98,M100)","v":6.1396781122510493},{"$f":"[3]!T2_turb(11,N96,N97,N98,N100)","v":6.1589653860104612},{"$f":"[3]!T2_turb(11,O96,O97,O98,O100)","v":6.1672659065430064},{"$f":"[3]!T2_turb(11,P96,P97,P98,P100)","v":6.180410564785781},{"$f":"[3]!T2_turb(11,Q96,Q97,Q98,Q100)","v":6.2043835592276881},{"$f":"[3]!T2_turb(11,R96,R97,R98,R100)","v":6.2313672996790563},{"$f":"[3]!T2_turb(11,S96,S97,S98,S100)","v":6.2620037216966882},{"$f":"[3]!T2_turb(11,T96,T97,T98,T100)","v":6.297160696946059},{"$f":"[3]!T2_turb(11,U96,U97,U98,U100)","v":6.3380274635292411},{"$f":"[3]!T2_turb(11,V96,V97,V98,V100)","v":6.3862442617316511},{"$f":"[3]!T2_turb(11,W96,W97,W98,W100)","v":6.4440608821877765},{"$f":"[3]!T2_turb(11,X96,X97,X98,X100)","v":6.5144951752157985},{"$f":"[3]!T2_turb(11,Y96,Y97,Y98,Y100)","v":6.6014507119485506},{"$f":"[3]!T2_turb(11,Z96,Z97,Z98,Z100)","v":6.7098307590436441},{"$f":"[3]!T2_turb(11,AA96,AA97,AA98,AA100)","v":6.8458369162951769},{"$f":"[3]!T2_turb(11,AB96,AB97,AB98,AB100)","v":7.0187257691663865}]
[null,"Efficacity","%",0.72,null,{"$f":"(0.321*F121^4-1.6098*F121^3+1.316*F121^2+0.9448*F121)*($D$100/0.97215493)","v":0.71514585277537646},0.71677918954540221,0.71749105011421654,0.68349717583184066,0.71837960211293939,0.71849051229641492,0.71857659982535727,0.71889703874637101,0.71924218587747857,0.71936251750762514,0.71952362657433999,0.71973972245051587,0.71988992738413482,0.71997538811347495,0.71999989678551646,0.71997144285704284,0.7199048518210851,0.71982622054580458,0.71977904969856643,0.7198237878587902,0.71997329344823235,0.71970692721941065,0.7]
[null,"Power","W",{"$f":"+D95*(D111-D112)","v":2444.6944252945532},null,{"$f":"+F95*(F111-F112)","v":2547.4239551427522},502.07183551854661,2435.474434480745,1859.4249141543207,2053.761819044325,2010.5027657245344,1976.1783719538564,1841.4106214145447,1678.6981213598374,1615.419965533127,1522.4569296964903,1372.7769095207711,1229.7422858482178,1093.4251917337706,963.8728167864665,841.08405157872926,724.96558668393345,615.25428592023729,511.39307629792739,412.36837268115903,316.55897782470396,221.6291070237809,121.89472682652413]
[null,"Speed","Hz",920,null,899.03236545200411,518.36496558823876,886.31675848463021,798.41587659968297,840.54680702237465,834.54930007153769,829.72981338767113,810.25518802528688,785.4481545459854,775.37310539717589,760.08881015013503,734.1309444714999,707.51892199107192,680.18368622749267,652.03539865530593,622.94992412705847,592.74219325621345,561.11248411331167,527.53735823288378,491.04930133342305,449.77442726562066,399.76118544893671,327.64316327287037]
[null,"Speed calculated from P=K.rho.N^3",null,null,null,{"$f":"(F101/$D101*$D104/F104)^(1/3)*$D102","v":932.71016404023408},537.47200079734864,918.84197149027193,831.55971223679751,868.08647900287406,861.94824863834901,857.01484996994782,837.07270580017814,811.65319287870545,801.32393559935576,785.6479320510025,759.00788652612289,731.67407791431799,703.57325969312672,674.61015970774554,644.65313543333809,613.50592850263138,580.850698370543,546.13236503494875,508.32493788156387,465.44086560782864,413.29031877308887,338.61636196762896]
[null,"Brake Pressure",null,10,null,{"$f":"($D104-$D98)+F98","v":10},10.3,10,10.3,10,10,10,10,10,10,10,10,10,10,10,10,10,10,10,10,10,10,10]
[null,"Rho (brake)",null,{"$f":"[3]!rho_(11,D104,330)","v":1.4528655310615399},null,{"$f":"[3]!rho_(11,F104,330)","v":1.4528655310615399},{"$f":"[3]!rho_(11,G104,330)","v":1.496267999860327},{"$f":"[3]!rho_(11,H104,330)","v":1.4528655310615399},{"$f":"[3]!rho_(11,I104,330)","v":1.496267999860327},{"$f":"[3]!rho_(11,J104,330)","v":1.4528655310615399},{"$f":"[3]!rho_(11,K104,330)","v":1.4528655310615399},{"$f":"[3]!rho_(11,L104,330)","v":1.4528655310615399},{"$f":"[3]!rho_(11,M104,330)","v":1.4528655310615399},{"$f":"[3]!rho_(11,N104,330)","v":1.4528655310615399},{"$f":"[3]!rho_(11,O104,330)","v":1.4528655310615399},{"$f":"[3]!rho_(11,P104,330)","v":1.4528655310615399},{"$f":"[3]!rho_(11,Q104,330)","v":1.4528655310615399},{"$f":"[3]!rho_(11,R104,330)","v":1.4528655310615399},{"$f":"[3]!rho_(11,S104,330)","v":1.4528655310615399},{"$f":"[3]!rho_(11,T104,330)","v":1.4528655310615399},{"$f":"[3]!rho_(11,U104,330)","v":1.4528655310615399},{"$f":"[3]!rho_(11,V104,330)","v":1.4528655310615399},{"$f":"[3]!rho_(11,W104,330)","v":1.4528655310615399},{"$f":"[3]!rho_(11,X104,330)","v":1.4528655310615399},{"$f":"[3]!rho_(11,Y104,330)","v":1.4528655310615399},{"$f":"[3]!rho_(11,Z104,330)","v":1.4528655310615399},{"$f":"[3]!rho_(11,AA104,330)","v":1.4528655310615399},{"$f":"[3]!rho_(11,AB104,330)","v":1.4528655310615399}]
[null,"Wheel","mm",29.5,null,{"$f":"$D$106","v":29.5},29.5,29.5,29.5,29.5,29.5,29.5,29.5,29.5,29.5,29.5,29.5,29.5,29.5,29.5,29.5,29.5,29.5,29.5,29.5,29.5,29.5,29.5]
[null,"a = mÖT/P",null,{"$f":"D95*D97^0.5/D96","v":81.165782571430668},null,{"$f":"$D$107","v":81.165782571430668},{"$f":"$D$107","v":81.165782571430668},81.165782571430668,81.165782571430668,{"$f":"$D$107","v":81.165782571430668},{"$f":"$D$107","v":81.165782571430668},{"$f":"$D$107","v":81.165782571430668},81.165782571430668,81.165782571430668,81.165782571430668,81.165782571430668,81.165782571430668,81.165782571430668,81.165782571430668,81.165782571430668,81.165782571430668,81.165782571430668,81.165782571430668,81.165782571430668,81.165782571430668,81.165782571430668,81.165782571430668,81.165782571430668]
[null,"Rho (in)","kg/m3",{"$f":"[3]!rho_(11,D96,D97)","v":97.277770726502126},null,{"$f":"[3]!rho_(11,F96,F97)","v":92.042022544510019},{"$f":"[3]!rho_(11,G96,G97)","v":70.649649504414128},{"$f":"[3]!rho_(11,H96,H97)","v":97.31015974976988},{"$f":"[3]!rho_(11,I96,I97)","v":58.789985568547117},{"$f":"[3]!rho_(11,J96,J97)","v":122.26254459716908},{"$f":"[3]!rho_(11,K96,K97)","v":121.82541276463277},{"$f":"[3]!rho_(11,L96,L97)","v":121.47048985373},{"$f":"[3]!rho_(11,M96,M97)","v":120.00158449336017},{"$f":"[3]!rho_(11,N96,N97)","v":118.04323398198385},{"$f":"[3]!rho_(11,O96,O97)","v":117.21740392188151},{"$f":"[3]!rho_(11,P96,P97)","v":115.92807252113009},{"$f":"[3]!rho_(11,Q96,Q97)","v":113.62831271086438},{"$f":"[3]!rho_(11,R96,R97)","v":111.10900572556152},{"$f":"[3]!rho_(11,S96,S97)","v":108.32592568043771},{"$f":"[3]!rho_(11,T96,T97)","v":105.22304974584799},{"$f":"[3]!rho_(11,U96,U97)","v":101.73006429167778},{"$f":"[3]!rho_(11,V96,V97)","v":97.761229789013782},{"$f":"[3]!rho_(11,W96,W97)","v":93.218746356413405},{"$f":"[3]!rho_(11,X96,X97)","v":88.006090815095931},{"$f":"[3]!rho_(11,Y96,Y97)","v":82.056091491693806},{"$f":"[3]!rho_(11,Z96,Z97)","v":75.368306411917857},{"$f":"[3]!rho_(11,AA96,AA97)","v":68.036211882297849},{"$f":"[3]!rho_(11,AB96,AB97)","v":60.256067667110017}]
[null,"Sound Speed",null,{"$f":"[3]!Sound_speed(11,D96,D97)","v":221.84427302752758},null,{"$f":"[3]!Sound_speed(11,F96,F97)","v":219.03534618547846},{"$f":"[3]!Sound_speed(11,G96,G97)","v":170.78644408370695},{"$f":"[3]!Sound_speed(11,H96,H97)","v":221.8649954478073},{"$f":"[3]!Sound_speed(11,I96,I97)","v":204.26692373410398},{"$f":"[3]!Sound_speed(11,J96,J97)","v":249.66480346852958},{"$f":"[3]!Sound_speed(11,K96,K97)","v":248.37992500152339},{"$f":"[3]!Sound_speed(11,L96,L97)","v":247.34215523540456},{"$f":"[3]!Sound_speed(11,M96,M97)","v":243.10023780227394},{"$f":"[3]!Sound_speed(11,N96,N97)","v":237.58176599011068},{"$f":"[3]!Sound_speed(11,O96,O97)","v":235.30303786825937},{"$f":"[3]!Sound_speed(11,P96,P97)","v":231.80443938215453},{"$f":"[3]!Sound_speed(11,Q96,Q97)","v":225.74814791917015},{"$f":"[3]!Sound_speed(11,R96,R97)","v":219.39459429677927},{"$f":"[3]!Sound_speed(11,S96,S97)","v":212.73080772596771},{"$f":"[3]!Sound_speed(11,T96,T97)","v":205.75546145318614},{"$f":"[3]!Sound_speed(11,U96,U97)","v":198.4897054969922},{"$f":"[3]!Sound_speed(11,V96,V97)","v":190.99426898824163},{"$f":"[3]!Sound_speed(11,W96,W97)","v":183.39236114735928},{"$f":"[3]!Sound_speed(11,X96,X97)","v":175.88971297032288},{"$f":"[3]!Sound_speed(11,Y96,Y97)","v":168.76799821216045},{"$f":"[3]!Sound_speed(11,Z96,Z97)","v":162.32650860903618},{"$f":"[3]!Sound_speed(11,AA96,AA97)","v":156.80049650025103},{"$f":"[3]!Sound_speed(11,AB96,AB97)","v":152.34946477870031}]
[null,"S=Q/(rho*V) = cte",null,{"$f":"D95/(D108*D109)","v":1.6542699653925842E-2},null,{"$f":"F95/(F108*F109)","v":1.7386031983634656E-2},1.762280313205894E-2,1.6537521923231567E-2,2.1807537658396658E-2,1.2925810242537576E-2,1.2915112255952132E-2,1.2907139468494564E-2,1.2880919468010052E-2,1.2862821912968997E-2,1.2860906791506387E-2,1.2864612000597865E-2,1.289113473455885E-2,1.294861538856284E-2,1.3045070128918913E-2,1.3190782660066624E-2,1.3398754175596748E-2,1.3684884924805166E-2,1.4067428066266275E-2,1.4565228728963556E-2,1.5195196836957126E-2,1.5971450823943443E-2,1.6907247415722786E-2,1.8010683180593488E-2]
[null,"Hin",null,{"$f":"[3]!h_(11,D96,D97)","v":38.410544300955863},null,{"$f":"[3]!h_(11,F96,F97)","v":40.890140453818937},{"$f":"[3]!h_(11,G96,G97)","v":36.811643961665368},{"$f":"[3]!h_(11,H96,H97)","v":38.395688158328092},{"$f":"[3]!h_(11,I96,I97)","v":54.059832308617963},{"$f":"[3]!h_(11,J96,J97)","v":28.14464519231036},{"$f":"[3]!h_(11,K96,K97)","v":28.133117975105385},{"$f":"[3]!h_(11,L96,L97)","v":28.124802568427114},{"$f":"[3]!h_(11,M96,M97)","v":28.100165246427569},{"$f":"[3]!h_(11,N96,N97)","v":28.091095004662005},{"$f":"[3]!h_(11,O96,O97)","v":28.095138531510841},{"$f":"[3]!h_(11,P96,P97)","v":28.110470745453465},{"$f":"[3]!h_(11,Q96,Q97)","v":28.164094353340676},{"$f":"[3]!h_(11,R96,R97)","v":28.259427461742323},{"$f":"[3]!h_(11,S96,S97)","v":28.406164507567226},{"$f":"[3]!h_(11,T96,T97)","v":28.616989129337512},{"$f":"[3]!h_(11,U96,U97)","v":28.908501436419211},{"$f":"[3]!h_(11,V96,V97)","v":29.302162143566285},{"$f":"[3]!h_(11,W96,W97)","v":29.824768459584782},{"$f":"[3]!h_(11,X96,X97)","v":30.50745846200121},{"$f":"[3]!h_(11,Y96,Y97)","v":31.382100647825098},{"$f":"[3]!h_(11,Z96,Z97)","v":32.475425675748092},{"$f":"[3]!h_(11,AA96,AA97)","v":33.803432781577705},{"$f":"[3]!h_(11,AB96,AB97)","v":35.365048561567498}]
[null,"Hout",null,{"$f":"[3]!h_(11,D98,D99)","v":31.562660756713417},null,{"$f":"[3]!h_(11,F98,F99)","v":33.622383465549603},{"$f":"[3]!h_(11,G98,G99)","v":34.450472844546304},{"$f":"[3]!h_(11,H98,H99)","v":31.574403562553631},{"$f":"[3]!h_(11,I98,I99)","v":46.9596318122219},{"$f":"[3]!h_(11,J98,J99)","v":22.939395735617683},{"$f":"[3]!h_(11,K98,K99)","v":22.98851213498288},{"$f":"[3]!h_(11,L98,L99)","v":23.028828428713879},{"$f":"[3]!h_(11,M98,M99)","v":23.199766560866902},{"$f":"[3]!h_(11,N98,N99)","v":23.437569031773627},{"$f":"[3]!h_(11,O98,O99)","v":23.541125985790408},{"$f":"[3]!h_(11,P98,P99)","v":23.706565574375478},{"$f":"[3]!h_(11,Q98,Q99)","v":24.012661056429174},{"$f":"[3]!h_(11,R98,R99)","v":24.363457572533072},{"$f":"[3]!h_(11,S98,S99)","v":24.768858337220099},{"$f":"[3]!h_(11,T98,T99)","v":25.241887061920391},{"$f":"[3]!h_(11,U98,U99)","v":25.799738020609627},{"$f":"[3]!h_(11,V98,V99)","v":26.464966726202285},{"$f":"[3]!h_(11,W98,W99)","v":27.266445051375943},{"$f":"[3]!h_(11,X98,X99)","v":28.239242698723949},{"$f":"[3]!h_(11,Y98,Y99)","v":29.422452538969662},{"$f":"[3]!h_(11,Z98,Z99)","v":30.85536208387008},{"$f":"[3]!h_(11,AA98,AA99)","v":32.574674861663233},{"$f":"[3]!h_(11,AB98,AB99)","v":34.627801563667134}]
[null,"Sin = Sout",null,{"$f":"[3]!S_(11,D96,D97)","v":6.3312954703050055},null,{"$f":"[3]!S_(11,F96,F97)","v":6.606972813997622},{"$f":"[3]!S_(11,G96,G97)","v":6.9458302073485418},{"$f":"[3]!S_(11,H96,H97)","v":6.3296128173799451},{"$f":"[3]!S_(11,I96,I97)","v":8.3000204511344844},{"$f":"[3]!S_(11,J96,J97)","v":5.0529733672692334},{"$f":"[3]!S_(11,K96,K97)","v":5.0654417470037325},{"$f":"[3]!S_(11,L96,L97)","v":5.0755773865215996},{"$f":"[3]!S_(11,M96,M97)","v":5.1176417880347849},{"$f":"[3]!S_(11,N96,N97)","v":5.1740184148189101},{"$f":"[3]!S_(11,O96,O97)","v":5.1978956859755527},{"$f":"[3]!S_(11,P96,P97)","v":5.2352994367007346},{"$f":"[3]!S_(11,Q96,Q97)","v":5.3024047191748664},{"$f":"[3]!S_(11,R96,R97)","v":5.3765112439126437},{"$f":"[3]!S_(11,S96,S97)","v":5.4591418721637179},{"$f":"[3]!S_(11,T96,T97)","v":5.5522839217210835},{"$f":"[3]!S_(11,U96,U97)","v":5.6585379719602162},{"$f":"[3]!S_(11,V96,V97)","v":5.7812790786999493},{"$f":"[3]!S_(11,W96,W97)","v":5.9247681165450805},{"$f":"[3]!S_(11,X96,X97)","v":6.0940797015742083},{"$f":"[3]!S_(11,Y96,Y97)","v":6.294692674085951},{"$f":"[3]!S_(11,Z96,Z97)","v":6.531792268753704},{"$f":"[3]!S_(11,AA96,AA97)","v":6.8096366775627946},{"$f":"[3]!S_(11,AB96,AB97)","v":7.1308608379485277}]
[null,"Tout(iso)",null,{"$f":"[1]!HeCalc(2,0,1,D98*10^5,8,D113*1000,1)","v":6.5627950941233291},null,{"$f":"[1]!HeCalc(2,0,1,F98*10^5,8,F113*1000,1)","v":6.6999950291002683},{"$f":"[1]!HeCalc(2,0,1,G98*10^5,8,G113*1000,1)","v":7.0241819850115181},{"$f":"[1]!HeCalc(2,0,1,H98*10^5,8,H113*1000,1)","v":6.5619829946977015},{"$f":"[1]!HeCalc(2,0,1,I98*10^5,8,I113*1000,1)","v":8.0488946725573083},{"$f":"[1]!HeCalc(2,0,1,J98*10^5,8,J113*1000,1)","v":5.9309053922662232},{"$f":"[1]!HeCalc(2,0,1,K98*10^5,8,K113*1000,1)","v":5.9384010068296593},{"$f":"[1]!HeCalc(2,0,1,L98*10^5,8,L113*1000,1)","v":5.944456168329987},{"$f":"[1]!HeCalc(2,0,1,M98*10^5,8,M113*1000,1)","v":5.9692285958188567},{"$f":"[1]!HeCalc(2,0,1,N98*10^5,8,N113*1000,1)","v":6.001560455371191},{"$f":"[1]!HeCalc(2,0,1,O98*10^5,8,O113*1000,1)","v":6.0149678507872988},{"$f":"[1]!HeCalc(2,0,1,P98*10^5,8,P113*1000,1)","v":6.035645284943814},{"$f":"[1]!HeCalc(2,0,1,Q98*10^5,8,Q113*1000,1)","v":6.0718071256425254},{"$f":"[1]!HeCalc(2,0,1,R98*10^5,8,R113*1000,1)","v":6.1104767799272244},{"$f":"[1]!HeCalc(2,0,1,S98*10^5,8,S113*1000,1)","v":6.1522386175176109},{"$f":"[1]!HeCalc(2,0,1,T98*10^5,8,T113*1000,1)","v":6.1979006550766433},{"$f":"[1]!HeCalc(2,0,1,U98*10^5,8,U113*1000,1)","v":6.2485979727804208},{"$f":"[1]!HeCalc(2,0,1,V98*10^5,8,V113*1000,1)","v":6.3059395805685625},{"$f":"[1]!HeCalc(2,0,1,W98*10^5,8,W113*1000,1)","v":6.3722004271630208},{"$f":"[1]!HeCalc(2,0,1,X98*10^5,8,X113*1000,1)","v":6.4505371594073715},{"$f":"[1]!HeCalc(2,0,1,Y98*10^5,8,Y113*1000,1)","v":6.5451882609877448},{"$f":"[1]!HeCalc(2,0,1,Z98*10^5,8,Z113*1000,1)","v":6.6616840821189891},{"$f":"[1]!HeCalc(2,0,1,AA98*10^5,8,AA113*1000,1)","v":6.8072433072756411},{"$f":"[1]!HeCalc(2,0,1,AB98*10^5,8,AB113*1000,1)","v":6.9913024076350263}]
[null,"Hout(iso)",null,{"$f":"[3]!h_(11,D98,D114)","v":28.899594933687727},null,{"$f":"[3]!h_(11,F98,F114)","v":30.727518437529557},{"$f":"[3]!h_(11,G98,G114)","v":33.517503797489027},{"$f":"[3]!h_(11,H98,H114)","v":28.888552710608689},{"$f":"[3]!h_(11,I98,I114)","v":43.671785543492518},{"$f":"[3]!h_(11,J98,J114)","v":20.89882495832201},{"$f":"[3]!h_(11,K98,K114)","v":20.972820445679236},{"$f":"[3]!h_(11,L98,L114)","v":21.033040686749398},{"$f":"[3]!h_(11,M98,M114)","v":21.283613749559883},{"$f":"[3]!h_(11,N98,N114)","v":21.621054644955287},{"$f":"[3]!h_(11,O98,O114)","v":21.76451602215565},{"$f":"[3]!h_(11,P98,P114)","v":21.989886225505693},{"$f":"[3]!h_(11,Q98,Q114)","v":22.396129683012887},{"$f":"[3]!h_(11,R98,R114)","v":22.847530739478753},{"$f":"[3]!h_(11,S98,S114)","v":23.354177689129866},{"$f":"[3]!h_(11,T98,T114)","v":23.929346697015806},{"$f":"[3]!h_(11,U98,U114)","v":24.590603210318516},{"$f":"[3]!h_(11,V98,V114)","v":25.361092138646899},{"$f":"[3]!h_(11,W98,W114)","v":26.270683686903297},{"$f":"[3]!h_(11,X98,X114)","v":27.35619174227045},{"$f":"[3]!h_(11,Y98,Y114)","v":28.659700884036013},{"$f":"[3]!h_(11,Z98,Z114)","v":30.225253888769931},{"$f":"[3]!h_(11,AA98,AA114)","v":32.096129609294515},{"$f":"[3]!h_(11,AB98,AB114)","v":34.311838516653928}]
[null,"ΔHs",null,{"$f":"D111-D115","v":9.510949367268136},null,10.162622016289379,3.2941401641763406,9.5071354477194028,10.388046765125445,7.2458202339883506,7.1602975294261491,7.0917618816777157,6.8165514968676852,6.4700403597067186,6.3306225093551909,6.1205845199477729,5.7679646703277889,5.4118967222635703,5.05198681843736,4.6876424323217059,4.3178982261006951,3.9410700049193856,3.5540847726814846,3.15126671973076,2.7223997637890847,2.2501717869781608,1.70730317228319,1.0532100449135697]
[null,"u1","m/s",{"$f":"(2*52.7%*D116*1000*D100)^0.5","v":84.956867031644023},null,{"$f":"PI()*$D$118*F102","v":83.020622966141644},{"$f":"PI()*$D$118*G102","v":47.868112451459488},81.846407607061394,73.729251591557357,{"$f":"PI()*$D$118*J102","v":77.619807954426989},{"$f":"PI()*$D$118*K102","v":77.065971649488276},{"$f":"PI()*$D$118*L102","v":76.620918943659987},74.822545946482634,72.531754810884209,71.601380233848673,70.189960843658199,67.79289677530484,65.335424976051755,62.811168465133235,60.211831155960681,57.525949860255693,54.736434452731707,51.815607285445751,48.715131736538986,45.345663260179698,41.534158925477371,36.915715083258377,30.25601810434835]
[null,"D1",null,{"$f":"D117/PI()/D102","v":2.9394142038450054E-2}]
[null,"Co = (2*ΔHs)^0,5",null,{"$f":"(2000*D116)^0.5","v":137.91989970463391},null,142.56663015088333,81.16822240478524,137.89224378274076,144.13914641848999,120.38122971616755,119.66868871535401,119.0946000595973,116.76087955190887,113.75447560168099,112.52219789317299,110.63981670219607,107.40544371983934,104.03746173627623,100.5185238494613,96.826054678704182,92.928986071092964,88.781417029909875,84.309961127751507,79.3884968963484,73.788884851162848,67.08460012518762,58.434633091740892,45.895752415960445]
[null,"u1/Co",null,{"$f":"D117/D119","v":0.61598701285010871},null,0.5823285777203121,0.58973956843284825,0.59355338169720662,0.51151441800198882,0.64478331162954072,0.64399445232326991,0.64336182249503637,0.64081862207297324,0.63761671290067801,0.63633115575849331,0.63440055249354921,0.63118678557986829,0.62799902925034856,0.62487157649868186,0.62185567051926582,0.61903128714055833,0.61653030875021253,0.61458464210334096,0.61362960178151094,0.61453243739412722,0.61913105016605641,0.63174376444362434,0.65923351316115886]
[null,"U1/C0 off de / U1/C0 nom",null,{"$f":"D120/$D$39","v":0.96887682119787455},null,{"$f":"F120/$D120","v":0.94535853122282165},0.95738961395335886,0.96358099978584943,0.83039805601625283,1.0467482238727639,1.0454675811159941,1.0444405629889293,1.0403119038305226,1.0351138897401275,1.0330269023274603,1.0298927400404807,1.0246754759640659,1.0195004377521881,1.014423297022879,1.0095272425339026,1.0049421079128991,1.0008819924588832,0.99772337611424777,0.99617295329378741,0.99763862642289924,1.0051040642909022,1.0255796814945997,1.0702068378210654]
[null,"Rdt",null,{"$f":"(0.321*D121^4-1.6098*D121^3+1.316*D121^2+0.9448*D121)*($D100/0.97215493)","v":0.71803015608894294},null,{"$f":"(0.321*F121^4-1.6098*F121^3+1.316*F121^2+0.9448*F121)*($D100/0.97215493)","v":0.71514585277537646},0.71677918954540221,0.71749105011421654,0.68349717583184066,0.71837960211293939,0.71849051229641492,0.71857659982535727,0.71889703874637101,0.71924218587747857,0.71936251750762514,0.71952362657433999,0.71973972245051587,0.71988992738413482,0.71997538811347495,0.71999989678551646,0.71997144285704284,0.7199048518210851,0.71982622054580458,0.71977904969856643,0.7198237878587902,0.71997329344823235,0.71970692721941065,0.71564537984708709]
["ligne_ToBeNull_T3","Converge brake Power",null,null,null,{"$f":"F102-F103","v":-33.677798588229962},-19.107035209109881,-32.525213005641717,-33.143835637114535,-27.539671980499406,-27.398948566811328,-27.285036582276689,-26.817517774891257,-26.205038332720051,-25.950830202179873,-25.559121900867467,-24.876942054622987,-24.15515592324607,-23.389573465634044,-22.574761052439612,-21.703211306279627,-20.763735246417923,-19.738214257231334,-18.595006802064972,-17.275636548140824,-15.666438342207982,-13.529133324152156,-10.973198694758594]
["ligne_ToChange_T3","By changing turbine speed"]
[]
[null,"CV220A"]
[null,"flow",null,{"$f":"$D$95-D95","v":0},null,{"$f":"$D$95-F95","v":6.4896624564536296},144.36321485621946,-4.0437220495562087E-2,95.116562328326893,-37.555887500010158,-33.798212380962411,-30.792072285724316,-18.767511904771538,-3.7368114285807223,2.2754687618955813,11.293889047610094,26.324589523801023,41.355289999991896,56.385990476182712,71.416690952373585,86.447391428564458,101.47809190475533,116.50879238094618,131.53949285713702,146.57019333332792,161.60089380951879,176.63159428570964,191.66229476190051]
[null,"Pin","Bara",13.5,null,13.5,13.5,13.5,13.5,13.5,13.5,13.5,13.5,13.5,13.5,13.5,13.5,13.5,13.5,13.5,13.5,13.5,13.5,13.5,13.5,13.5,13.5,13.5]
[null,"Tin","K",100,null,100,100,100,100,100,100,100,100,100,100,100,100,100,100,100,100,100,100,100,100,100,100,100]
[null,"Rho",null,{"$f":"[3]!rho_(11,D128,D129)","v":6.3733311238230197},null,{"$f":"[3]!rho_(11,F128,F129)","v":6.3733311238230197},{"$f":"[3]!rho_(11,G128,G129)","v":6.3733311238230197},{"$f":"[3]!rho_(11,H128,H129)","v":6.3733311238230197},{"$f":"[3]!rho_(11,I128,I129)","v":6.3733311238230197},{"$f":"[3]!rho_(11,J128,J129)","v":6.3733311238230197},{"$f":"[3]!rho_(11,K128,K129)","v":6.3733311238230197},{"$f":"[3]!rho_(11,L128,L129)","v":6.3733311238230197},{"$f":"[3]!rho_(11,M128,M129)","v":6.3733311238230197},{"$f":"[3]!rho_(11,N128,N129)","v":6.3733311238230197},{"$f":"[3]!rho_(11,O128,O129)","v":6.3733311238230197},{"$f":"[3]!rho_(11,P128,P129)","v":6.3733311238230197},{"$f":"[3]!rho_(11,Q128,Q129)","v":6.3733311238230197},{"$f":"[3]!rho_(11,R128,R129)","v":6.3733311238230197},{"$f":"[3]!rho_(11,S128,S129)","v":6.3733311238230197},{"$f":"[3]!rho_(11,T128,T129)","v":6.3733311238230197},{"$f":"[3]!rho_(11,U128,U129)","v":6.3733311238230197},{"$f":"[3]!rho_(11,V128,V129)","v":6.3733311238230197},{"$f":"[3]!rho_(11,W128,W129)","v":6.3733311238230197},{"$f":"[3]!rho_(11,X128,X129)","v":6.3733311238230197},{"$f":"[3]!rho_(11,Y128,Y129)","v":6.3733311238230197},{"$f":"[3]!rho_(11,Z128,Z129)","v":6.3733311238230197},{"$f":"[3]!rho_(11,AA128,AA129)","v":6.3733311238230197},{"$f":"[3]!rho_(11,AB128,AB129)","v":6.3733311238230197}]
[null,"Pout",null,{"$f":"1.15","v":1.1499999999999999},null,{"$f":"1.15","v":1.1499999999999999},1.1499999999999999,1.1499999999999999,1.1499999999999999,1.1499999999999999,1.1499999999999999,1.1499999999999999,1.1499999999999999,1.1499999999999999,1.1499999999999999,1.1499999999999999,1.1499999999999999,1.1499999999999999,1.1499999999999999,1.1499999999999999,1.1499999999999999,1.1499999999999999,1.1499999999999999,1.1499999999999999,1.1499999999999999,1.1499999999999999,1.1499999999999999,1.1499999999999999]
[null,"Cvs",null,35,null,35,35,35,35,35,35,35,35,35,35,35,35,35,35,35,35,35,35,35,35,35,35,35]
[null,"Range",null,100,null,100,100,100,100,100,100,100,100,100,100,100,100,100,100,100,100,100,100,100,100,100,100,100]
[null,"Flow",null,{"$f":"IF(D128/2>D131,\"S\",\"SS\")","v":"S"},null,{"$f":"IF(F128/2>F131,\"S\",\"SS\")","v":"S"},"S","S","S","S","S","S","S","S","S","S","S","S","S","S","S","S","S","S","S","S","S","S"]
[null,"Cv",null,{"$f":"[3]!Cv_Simple(D129,D128,D131/1000,D130,D127,D134)","v":0},{"$f":"[3]!Cv_Simple(E129,E128,E131/1000,E130,E127,E134)","v":0},{"$f":"[3]!Cv_Simple(F129,F128,F131/1000,F130,F127,F134)","v":0.14845850495463597},{"$f":"[3]!Cv_Simple(G129,G128,G131/1000,G130,G127,G134)","v":3.3024748500881245},{"$f":"[3]!Cv_Simple(H129,H128,H131/1000,H130,H127,H134)","v":-9.250480035864105E-4},{"$f":"[3]!Cv_Simple(I129,I128,I131/1000,I130,I127,I134)","v":2.1759009400628226},{"$f":"[3]!Cv_Simple(J129,J128,J131/1000,J130,J127,J134)","v":-0.85913419194113483},{"$f":"[3]!Cv_Simple(K129,K128,K131/1000,K130,K127,K134)","v":-0.77317304465152481},{"$f":"[3]!Cv_Simple(L129,L128,L131/1000,L130,L127,L134)","v":-0.70440412681983922},{"$f":"[3]!Cv_Simple(M129,M128,M131/1000,M130,M127,M134)","v":-0.42932845549308785},{"$f":"[3]!Cv_Simple(N129,N128,N131/1000,N130,N127,N134)","v":-8.5483866334651992E-2},{"$f":"[3]!Cv_Simple(O129,O128,O131/1000,O130,O127,O134)","v":5.2053969328721791E-2},{"$f":"[3]!Cv_Simple(P129,P128,P131/1000,P130,P127,P134)","v":0.25836072282378381},{"$f":"[3]!Cv_Simple(Q129,Q128,Q131/1000,Q130,Q127,Q134)","v":0.60220531198222216},{"$f":"[3]!Cv_Simple(R129,R128,R131/1000,R130,R127,R134)","v":0.94604990114065934},{"$f":"[3]!Cv_Simple(S129,S128,S131/1000,S130,S127,S134)","v":1.289894490299095},{"$f":"[3]!Cv_Simple(T129,T128,T131/1000,T130,T127,T134)","v":1.6337390794575322},{"$f":"[3]!Cv_Simple(U129,U128,U131/1000,U130,U127,U134)","v":1.9775836686159691},{"$f":"[3]!Cv_Simple(V129,V128,V131/1000,V130,V127,V134)","v":2.3214282577744063},{"$f":"[3]!Cv_Simple(W129,W128,W131/1000,W130,W127,W134)","v":2.6652728469328428},{"$f":"[3]!Cv_Simple(X129,X128,X131/1000,X130,X127,X134)","v":3.0091174360912789},{"$f":"[3]!Cv_Simple(Y129,Y128,Y131/1000,Y130,Y127,Y134)","v":3.3529620252497168},{"$f":"[3]!Cv_Simple(Z129,Z128,Z131/1000,Z130,Z127,Z134)","v":3.6968066144081537},{"$f":"[3]!Cv_Simple(AA129,AA128,AA131/1000,AA130,AA127,AA134)","v":4.0406512035665898},{"$f":"[3]!Cv_Simple(AB129,AB128,AB131/1000,AB130,AB127,AB134)","v":4.3844957927250272}]
[null,"Trim",null,{"$f":"IF(D135=0,0,[3]!Trim_From_Cv(D135/D132,D133))","v":0},null,{"$f":"IF(F135=0,0,[3]!Trim_From_Cv(F135/F132,F133))","v":2.6763138300479064E-2},{"$f":"IF(G135=0,0,[3]!Trim_From_Cv(G135/G132,G133))","v":0.4873857372952396},{"$f":"IF(H135=0,0,[3]!Trim_From_Cv(H135/H132,H133))","v":-1.6676166624559594E-4},{"$f":"IF(I135=0,0,[3]!Trim_From_Cv(I135/I132,I133))","v":0.39678553773054159},{"$f":"IF(J135<0.00001,0,[3]!Trim_From_Cv(J135/J132,J133))","v":0},{"$f":"IF(K135=0,0,[3]!Trim_From_Cv(K135/K132,K133))","v":-0.13938263173628343},{"$f":"IF(L135=0,0,[3]!Trim_From_Cv(L135/L132,L133))","v":-0.12698541637118144},{"$f":"IF(M135=0,0,[3]!Trim_From_Cv(M135/M132,M133))","v":-7.7396554910771867E-2},{"$f":"IF(N135=0,0,[3]!Trim_From_Cv(N135/N132,N133))","v":-1.5410478085260517E-2},{"$f":"IF(O135=0,0,[3]!Trim_From_Cv(O135/O132,O133))","v":9.3839526449439221E-3},{"$f":"IF(P135=0,0,[3]!Trim_From_Cv(P135/P132,P133))","v":4.6575598740250815E-2},{"$f":"IF(Q135=0,0,[3]!Trim_From_Cv(Q135/Q132,Q133))","v":0.11783826885195073},{"$f":"IF(R135=0,0,[3]!Trim_From_Cv(R135/R132,R133))","v":0.2159230001581369},{"$f":"IF(S135=0,0,[3]!Trim_From_Cv(S135/S132,S133))","v":0.28324307167413576},{"$f":"IF(T135=0,0,[3]!Trim_From_Cv(T135/T132,T133))","v":0.33455732662805793},{"$f":"IF(U135=0,0,[3]!Trim_From_Cv(U135/U132,U133))","v":0.37603341128001883},{"$f":"IF(V135=0,0,[3]!Trim_From_Cv(V135/V132,V133))","v":0.41084361113585799},{"$f":"IF(W135=0,0,[3]!Trim_From_Cv(W135/W132,W133))","v":0.44083681524759333},{"$f":"IF(X135=0,0,[3]!Trim_From_Cv(X135/X132,X133))","v":0.46718554641261384},{"$f":"IF(Y135=0,0,[3]!Trim_From_Cv(Y135/Y132,Y133))","v":0.49068029520168011},{"$f":"IF(Z135=0,0,[3]!Trim_From_Cv(Z135/Z132,Z133))","v":0.51187934410517999},{"$f":"IF(AA135=0,0,[3]!Trim_From_Cv(AA135/AA132,AA133))","v":0.53119165930649537},{"$f":"IF(AB135=0,0,[3]!Trim_From_Cv(AB135/AB132,AB133))","v":0.54892580666134672}]
[null,"Tout",null,{"$f":"[3]!T_P_H_(11,D85,[3]!h_(11,D128,D129))","v":99.108406127680922},null,{"$f":"[3]!T_P_H_(11,F85,[3]!h_(11,F128,F129))","v":99.108406127680922},{"$f":"[3]!T_P_H_(11,G85,[3]!h_(11,G128,G129))","v":99.108406127680922},{"$f":"[3]!T_P_H_(11,H85,[3]!h_(11,H128,H129))","v":99.108406127680922},{"$f":"[3]!T_P_H_(11,I85,[3]!h_(11,I128,I129))","v":99.108406127680922},{"$f":"[3]!T_P_H_(11,J85,[3]!h_(11,J128,J129))","v":99.108406127680922},{"$f":"[3]!T_P_H_(11,K85,[3]!h_(11,K128,K129))","v":99.108406127680922},{"$f":"[3]!T_P_H_(11,L85,[3]!h_(11,L128,L129))","v":99.108406127680922},{"$f":"[3]!T_P_H_(11,M85,[3]!h_(11,M128,M129))","v":99.108406127680922},{"$f":"[3]!T_P_H_(11,N85,[3]!h_(11,N128,N129))","v":99.108406127680922},{"$f":"[3]!T_P_H_(11,O85,[3]!h_(11,O128,O129))","v":99.108406127680922},{"$f":"[3]!T_P_H_(11,P85,[3]!h_(11,P128,P129))","v":99.108406127680922},{"$f":"[3]!T_P_H_(11,Q85,[3]!h_(11,Q128,Q129))","v":99.108406127680922},{"$f":"[3]!T_P_H_(11,R85,[3]!h_(11,R128,R129))","v":99.108406127680922},{"$f":"[3]!T_P_H_(11,S85,[3]!h_(11,S128,S129))","v":99.108406127680922},{"$f":"[3]!T_P_H_(11,T85,[3]!h_(11,T128,T129))","v":99.108406127680922},{"$f":"[3]!T_P_H_(11,U85,[3]!h_(11,U128,U129))","v":99.108406127680922},{"$f":"[3]!T_P_H_(11,V85,[3]!h_(11,V128,V129))","v":99.108406127680922},{"$f":"[3]!T_P_H_(11,W85,[3]!h_(11,W128,W129))","v":99.108406127680922},{"$f":"[3]!T_P_H_(11,X85,[3]!h_(11,X128,X129))","v":99.108406127680922},{"$f":"[3]!T_P_H_(11,Y85,[3]!h_(11,Y128,Y129))","v":99.108406127680922},{"$f":"[3]!T_P_H_(11,Z85,[3]!h_(11,Z128,Z129))","v":99.108406127680922},{"$f":"[3]!T_P_H_(11,AA85,[3]!h_(11,AA128,AA129))","v":99.108406127680922},{"$f":"[3]!T_P_H_(11,AB85,[3]!h_(11,AB128,AB129))","v":99.108406127680922}]
[null,"delta T",null,{"$f":"D137-D85","v":69.108406127680922},null,{"$f":"F137-F85","v":69.108406127680922},69.108406127680922,69.108406127680922,69.108406127680922,69.108406127680922,69.108406127680922,69.108406127680922,69.108406127680922,69.108406127680922,69.108406127680922,69.108406127680922,69.108406127680922,69.108406127680922,69.108406127680922,69.108406127680922,69.108406127680922,69.108406127680922,69.108406127680922,69.108406127680922,69.108406127680922,69.108406127680922,69.108406127680922,69.108406127680922]
[null,"CV335"]
[null,"Pin","Bara",{"$f":"D81","v":13.15},null,{"$f":"F81","v":13.15},13.25,13.5,12.25,13.15,13.15,13.15,13.15,13.15,13.15,13.15,13.15,13.15,13.15,13.15,13.15,13.15,13.15,13.15,13.15,13.15,13.15,13.15]
[null,"Tin","K",{"$f":"D82","v":8.83514415424081},null,9.1661496679837366,8.6223146254179426,8.8279999999999994,10.795640526772669,7.289570189226823,7.2875494761866335,7.286091223216423,7.2817678358976652,7.2801751232542466,7.2808852270882953,7.2835767670375562,7.2929775419785274,7.309641747149449,7.3351707676476412,7.3715975333960877,7.4214865443397402,7.4880009996514749,7.574845195653733,7.6859260832822134,7.8246161009732589,7.9928254087617381,8.190438152641093,8.414996515030289]
[null,"Rho",null,{"$f":"[3]!rho_(11,D140,D141)","v":97.618685329309102},null,{"$f":"[3]!rho_(11,F140,F141)","v":92.385436868539188},{"$f":"[3]!rho_(11,G140,G141)","v":101.58811590421918},{"$f":"[3]!rho_(11,H140,H141)","v":99.5385923004863},{"$f":"[3]!rho_(11,I140,I141)","v":66.476961067945879},{"$f":"[3]!rho_(11,J140,J141)","v":122.3554602961871},{"$f":"[3]!rho_(11,K140,K141)","v":122.38525605267236},{"$f":"[3]!rho_(11,L140,L141)","v":122.40675166263661},{"$f":"[3]!rho_(11,M140,M141)","v":122.47044880873382},{"$f":"[3]!rho_(11,N140,N141)","v":122.4939022601133},{"$f":"[3]!rho_(11,O140,O141)","v":122.48344645754396},{"$f":"[3]!rho_(11,P140,P141)","v":122.44380344539697},{"$f":"[3]!rho_(11,Q140,Q141)","v":122.30519433940992},{"$f":"[3]!rho_(11,R140,R141)","v":122.05892824408417},{"$f":"[3]!rho_(11,S140,S141)","v":121.68027091130101},{"$f":"[3]!rho_(11,T140,T141)","v":121.13709609048141},{"$f":"[3]!rho_(11,U140,U141)","v":120.3877662475066},{"$f":"[3]!rho_(11,V140,V141)","v":119.37920067123139},{"$f":"[3]!rho_(11,W140,W141)","v":118.04655161202567},{"$f":"[3]!rho_(11,X140,X141)","v":116.31729006265563},{"$f":"[3]!rho_(11,Y140,Y141)","v":114.12277996026393},{"$f":"[3]!rho_(11,Z140,Z141)","v":111.41624187103298},{"$f":"[3]!rho_(11,AA140,AA141)","v":108.18992422198602},{"$f":"[3]!rho_(11,AB140,AB141)","v":104.49208532283211}]
[null,"dP",null,{"$f":"(D140-D98)*1000","v":8270},null,{"$f":"(F140-F98)*1000","v":8270},8070,8620.0000000000018,7070,8270,8270,8270,8270,8270,8270,8270,8270,8270,8270,8270,8270,8270,8270,8270,8270,8270,8270,8270]
[null,"Cvs",null,5,null,{"$f":"$D$144","v":5},{"$f":"$D$144","v":5},5,5,5,5,5,5,5,5,5,5,5,5,5,5,5,5,5,5,5,5,5]
[null,"Range",null,250,null,{"$f":"$D$145","v":250},{"$f":"$D$145","v":250},250,250,250,250,250,250,250,250,250,250,250,250,250,250,250,250,250,250,250,250,250]
[null,"Flow",null,{"$f":"IF(D140/2>D98,\"S\",\"SS\")","v":"S"},null,{"$f":"IF(F140/2>F98,\"S\",\"SS\")","v":"S"},"S","S","S","S","S","S","S","S","S","S","S","S","S","S","S","S","S","S","S","S","S","S"]
[null,"Cv",null,{"$f":"[3]!Cv_Simple(D141,D140,D143/1000,D142,D95,D146)","v":2.114326056866267},null,{"$f":"[3]!Cv_Simple(F141,F140,F143/1000,F142,F95,F146)","v":2.1338765748233199},{"$f":"[3]!Cv_Simple(G141,G140,G143/1000,G142,G95,G146)","v":1.229821567782704},{"$f":"[3]!Cv_Simple(H141,H140,H143/1000,H142,H95,H146)","v":2.0667496547752653},{"$f":"[3]!Cv_Simple(I141,I140,I143/1000,I142,I95,I146)","v":1.9473208303492371},{"$f":"[3]!Cv_Simple(J141,J140,J143/1000,J142,J95,J146)","v":2.0872144552861447},{"$f":"[3]!Cv_Simple(K141,K140,K143/1000,K142,K95,K146)","v":2.0670845515555882},{"$f":"[3]!Cv_Simple(L141,L140,L143/1000,L142,L95,L146)","v":2.0510037910573233},{"$f":"[3]!Cv_Simple(M141,M140,M143/1000,M142,M95,M146)","v":1.9868898797748566},{"$f":"[3]!Cv_Simple(N141,N140,N143/1000,N142,N95,N146)","v":1.9072316730868983},{"$f":"[3]!Cv_Simple(O141,O140,O143/1000,O142,O95,O146)","v":1.8755245255103508},{"$f":"[3]!Cv_Simple(P141,P140,P143/1000,P142,P95,P146)","v":1.8281375701842379},{"$f":"[3]!Cv_Simple(Q141,Q140,Q143/1000,Q142,Q95,Q146)","v":1.7496439263258388},{"$f":"[3]!Cv_Simple(R141,R140,R143/1000,R142,R95,R146)","v":1.6717986196621557},{"$f":"[3]!Cv_Simple(S141,S140,S143/1000,S142,S95,S146)","v":1.5946646072239772},{"$f":"[3]!Cv_Simple(T141,T140,T143/1000,T142,T95,T146)","v":1.5183240296277225},{"$f":"[3]!Cv_Simple(U141,U140,U143/1000,U142,U95,U146)","v":1.4428818505882173},{"$f":"[3]!Cv_Simple(V141,V140,V143/1000,V142,V95,V146)","v":1.368466063245904},{"$f":"[3]!Cv_Simple(W141,W140,W143/1000,W142,W95,W146)","v":1.2952177095019868},{"$f":"[3]!Cv_Simple(X141,X140,X143/1000,X142,X95,X146)","v":1.2232594092063465},{"$f":"[3]!Cv_Simple(Y141,Y140,Y143/1000,Y142,Y95,Y146)","v":1.1526336872312506},{"$f":"[3]!Cv_Simple(Z141,Z140,Z143/1000,Z142,Z95,Z146)","v":1.0832246724633305},{"$f":"[3]!Cv_Simple(AA141,AA140,AA143/1000,AA142,AA95,AA146)","v":1.0146991146733895},{"$f":"[3]!Cv_Simple(AB141,AB140,AB143/1000,AB142,AB95,AB146)","v":0.94645600418806008}]
[null,"Trim",null,{"$f":"[3]!Trim_From_Cv(D147/D144,D145)","v":0.84411701671803907},null,{"$f":"[3]!Trim_From_Cv(F147/F144,F145)","v":0.84578400329704362},{"$f":"[3]!Trim_From_Cv(G147/G144,G145)","v":0.74597867461509604},{"$f":"[3]!Trim_From_Cv(H147/H144,H145)","v":0.83999510863820281},{"$f":"[3]!Trim_From_Cv(I147/I144,I145)","v":0.8292148705293475},{"$f":"[3]!Trim_From_Cv(J147/J144,J145)","v":0.84177964040128428},{"$f":"[3]!Trim_From_Cv(K147/K144,K145)","v":0.84002445362455125},{"$f":"[3]!Trim_From_Cv(L147/L144,L145)","v":0.83860999865666397},{"$f":"[3]!Trim_From_Cv(M147/M144,M145)","v":0.83285811772035412},{"$f":"[3]!Trim_From_Cv(N147/N144,N145)","v":0.82544744553897209},{"$f":"[3]!Trim_From_Cv(O147/O144,O145)","v":0.82241121330359934},{"$f":"[3]!Trim_From_Cv(P147/P144,P145)","v":0.81777645445854408},{"$f":"[3]!Trim_From_Cv(Q147/Q144,Q145)","v":0.80982829879757035},{"$f":"[3]!Trim_From_Cv(R147/R144,R145)","v":0.80158551077178342},{"$f":"[3]!Trim_From_Cv(S147/S144,S145)","v":0.79303041479215985},{"$f":"[3]!Trim_From_Cv(T147/T144,T145)","v":0.78414575132983189},{"$f":"[3]!Trim_From_Cv(U147/U144,U145)","v":0.77491545587178756},{"$f":"[3]!Trim_From_Cv(V147/V144,V145)","v":0.7653252497801486},{"$f":"[3]!Trim_From_Cv(W147/W144,W145)","v":0.75536200725480396},{"$f":"[3]!Trim_From_Cv(X147/X144,X145)","v":0.74500970119183818},{"$f":"[3]!Trim_From_Cv(Y147/Y144,Y145)","v":0.73423909948761323},{"$f":"[3]!Trim_From_Cv(Z147/Z144,Z145)","v":0.72299079267504829},{"$f":"[3]!Trim_From_Cv(AA147/AA144,AA145)","v":0.71115510797640347},{"$f":"[3]!Trim_From_Cv(AB147/AB144,AB145)","v":0.6985455970365827}]
[null,"Tout",null,{"$f":"[3]!T_P_H_(11,D98,[3]!h_(11,D140,D141))","v":7.3724700511030372},null,{"$f":"[3]!T_P_H_(11,F98,[3]!h_(11,F140,F141))","v":7.630998961978265},{"$f":"[3]!T_P_H_(11,G98,[3]!h_(11,G140,G141))","v":7.3219643390544888},{"$f":"[3]!T_P_H_(11,H98,[3]!h_(11,H140,H141))","v":7.3519064983716929},{"$f":"[3]!T_P_H_(11,I98,[3]!h_(11,I140,I141))","v":9.4038371934393972},{"$f":"[3]!T_P_H_(11,J98,[3]!h_(11,J140,J141))","v":6.5076151867744905},{"$f":"[3]!T_P_H_(11,K98,[3]!h_(11,K140,K141))","v":6.5067773978318657},{"$f":"[3]!T_P_H_(11,L98,[3]!h_(11,L140,L141))","v":6.5061731162157059},{"$f":"[3]!T_P_H_(11,M98,[3]!h_(11,M140,M141))","v":6.5043830866027719},{"$f":"[3]!T_P_H_(11,N98,[3]!h_(11,N140,N141))","v":6.5037242233751265},{"$f":"[3]!T_P_H_(11,O98,[3]!h_(11,O140,O141))","v":6.5040179365079505},{"$f":"[3]!T_P_H_(11,P98,[3]!h_(11,P140,P141))","v":6.5051317682126424},{"$f":"[3]!T_P_H_(11,Q98,[3]!h_(11,Q140,Q141))","v":6.5090290145093253},{"$f":"[3]!T_P_H_(11,R98,[3]!h_(11,R140,R141))","v":6.5159643141771708},{"$f":"[3]!T_P_H_(11,S98,[3]!h_(11,S140,S141))","v":6.5266570107899007},{"$f":"[3]!T_P_H_(11,T98,[3]!h_(11,T140,T141))","v":6.5420611187463784},{"$f":"[3]!T_P_H_(11,U98,[3]!h_(11,U140,U141))","v":6.5634502432004949},{"$f":"[3]!T_P_H_(11,V98,[3]!h_(11,V140,V141))","v":6.5925207653239495},{"$f":"[3]!T_P_H_(11,W98,[3]!h_(11,W140,W141))","v":6.6314917157616708},{"$f":"[3]!T_P_H_(11,X98,[3]!h_(11,X140,X141))","v":6.6831459609521859},{"$f":"[3]!T_P_H_(11,Y98,[3]!h_(11,Y140,Y141))","v":6.750739300631845},{"$f":"[3]!T_P_H_(11,Z98,[3]!h_(11,Z140,Z141))","v":6.8377830170846385},{"$f":"[3]!T_P_H_(11,AA98,[3]!h_(11,AA140,AA141))","v":6.9478177208080893},{"$f":"[3]!T_P_H_(11,AB98,[3]!h_(11,AB140,AB141))","v":7.0839372537996068}]
[null,"delta T",null,{"$f":"D149-D98","v":2.4924700511030373},null,{"$f":"F149-F98","v":2.7509989619782651},2.1419643390544891,2.471906498371693,4.2238371934393975,1.6276151867744906,1.6267773978318658,1.626173116215706,1.624383086602772,1.6237242233751266,1.6240179365079506,1.6251317682126425,1.6290290145093254,1.6359643141771709,1.6466570107899008,1.6620611187463785,1.683450243200495,1.7125207653239496,1.751491715761671,1.803145960952186,1.8707393006318451,1.9577830170846386,2.0678177208080895,2.2039372537996069]
[]
[null,null,null,null,null,null,null,null,null,null,null,null,null,null,null,null,null,null,null,null,null,null,"Ratio Cv",0.5]
[null,null,null,null,null,null,null,null,null,null,null,null,null,null,null,null,null,null,null,null,null,null,null,{"$f":"[3]!Trim_From_Cv(X152,X145)","v":0.87446308307325438}]
[]
[null,null,null,null,null,null,null,null,null,null,null,null,{"$f":"M37","v":"T1"},{"$f":"M160","v":"T3"},"T1+T2"]
[null,"Courbe de rendement TC3",null,null,null,null,null,null,null,null,null,{"$f":"L161","v":"MAX"},{"$f":"M38","v":"100g/s @ 7,03912286644876 b ; 35K"},{"$f":"M161","v":"351g/s @ 13,07 b ; 9,16K"},{"$f":"F95+F49","v":450.51033754354637}]
[null,null,null,null,null,null,null,null,null,null,null,{"$f":"L162","v":"MIN"},{"$f":"M39","v":"163g/s @ 12,39 b ; 40,73K"},{"$f":"M162","v":"213g/s @ 7,369 b ; 7,912K"},{"$f":"G95+G49","v":375.80275160954591}]
[null,null,null,null,null,null,null,null,null,null,null,{"$f":"L163","v":"STS"},{"$f":"M40","v":"107g/s @ 10,3 b ; 66K"},{"$f":"M163","v":"357g/s @ 13,07 b ; 8,828K"},{"$f":"H95+H49","v":436.46565376205029}]
[null,null,null,null,null,null,null,null,null,null,null,{"$f":"L164","v":"BAKING"},{"$f":"M41","v":"128g/s @ 9,25 b ; 37,12K"},{"$f":"M164","v":"262g/s @ 10,48 b ; 10,55K"},{"$f":"I95+I49","v":389.48418717251604}]
[null,null,null,null,"d : mm",null,null,null,null,null,null,null,"T3"]
[null,null,null,null,"N : Hz",null,null,null,null,null,null,"MAX",{"$f":"ROUND(F95,0)&\"g/s @ \"&F96&\" b ; \"&F97&\"K\"","v":"351g/s @ 13,07 b ; 9,16K"}]
[null,null,null,null,"H : J/kG",null,null,null,null,null,null,"MIN",{"$f":"ROUND(G95,0)&\"g/s @ \"&G96&\" b ; \"&G97&\"K\"","v":"213g/s @ 7,369 b ; 7,912K"}]
[null,null,null,null,null,null,null,null,null,null,null,"STS",{"$f":"ROUND(H95,0)&\"g/s @ \"&H96&\" b ; \"&H97&\"K\"","v":"357g/s @ 13,07 b ; 8,828K"}]
[null,null,null,null,null,null,null,null,null,null,null,"BAKING",{"$f":"ROUND(I95,0)&\"g/s @ \"&I96&\" b ; \"&I97&\"K\"","v":"262g/s @ 10,48 b ; 10,55K"}]
[]
[]
[]
[null,"rendement=(0,321*rap^4 - 1,6098*rap^3 + 1,316*rap^2 + 0,9448*rap)*(ETAgar/0,97)",null,null,null,null,null,null,"U1/CO _nom",0.64]
[null,null,null,null,null,null,null,null,"Eta_gar",0.8]
[null,"U1/C0",{"$f":"D19","v":0.76700000000000002},{"$f":"D54","v":0.77},{"$f":"D100","v":0.72}]
[null,0,{"$f":"(0.321*B171^4-1.6098*B171^3+1.316*B171^2+0.9448*B171)*$D$19/0.97215493","v":0}]
[null,{"$f":"B171+0.05","v":0.05},{"$f":"(0.321*$B172^4-1.6098*$B172^3+1.316*$B172^2+0.9448*$B172)*$C$170/0.97215493","v":3.9709420821175082E-2},{"$f":"(0.321*$B172^4-1.6098*$B172^3+1.316*$B172^2+0.9448*$B172)*$D$170/0.97215493","v":3.9864737982144481E-2},{"$f":"(0.321*$B172^4-1.6098*$B172^3+1.316*$B172^2+0.9448*$B172)*$E$170/0.97215493","v":3.7276118632654578E-2}]
[null,0.1,{"$f":"(0.321*$B173^4-1.6098*$B173^3+1.316*$B173^2+0.9448*$B173)*$C$170/0.97215493","v":8.3679855534960892E-2},{"$f":"(0.321*$B173^4-1.6098*$B173^3+1.316*$B173^2+0.9448*$B173)*$D$170/0.97215493","v":8.4007156143311446E-2},{"$f":"(0.321*$B173^4-1.6098*$B173^3+1.316*$B173^2+0.9448*$B173)*$E$170/0.97215493","v":7.8552146004135376E-2}]
[null,0.15000000000000002,0.13101572582546078,0.13152817325372204,0.12298738278270113]
[null,0.2,0.18085944222902828,0.18156684552327482,0.16977679061916603]
[null,0.25,0.23239140413426698,0.23330036660154571,0.21815099214689987]
[null,0.3,0.28482999978203061,0.28594406757778829,0.26737627098182798]
[null,0.35,0.33743160626542312,0.33875141698093331,0.3167545717224311]
[null,0.39999999999999997,0.38949058952979848,0.39101402077958908,0.36562349994974563]
[null,0.44999999999999996,0.44033930437276081,0.4420616223820415,0.41335632222736346]
[null,0.49999999999999994,0.48934809444416438,0.49126210263625369,0.45936196610143198]
[null,0.54999999999999993,0.53592529224611352,0.53802147982986626,0.50308502010065403]
[null,0.6,0.57951721913296261,0.58178390969019722,0.54400573373628835]
[null,0.65,0.61960818531131656,0.62203168538424225,0.58164001750214867]
[null,0.70000000000000007,0.65572048984003006,0.65828523751867429,0.61553944287460449]
[null,0.75000000000000011,0.68741442063020786,0.69010313413984359,0.64529124231258095]
[null,0.80000000000000016,0.71428825444520472,0.71708208073377788,0.67051830925755851]
[null,0.8500000000000002,0.7359782569006259,0.73885692022618255,0.69087919813357312]
[null,0.90000000000000024,0.75215868246432716,0.75510063298244057,0.70606812434721711]
[null,0.95000000000000029,0.76254177445641325,0.76552433680761167,0.71581496428763691]
[null,1.0000000000000002,0.76687776504923999,0.76987728694643376,0.71988525532653547]
[null,1.0500000000000003,0.76495487526741246,0.76794687608332146,0.71808019581817073]
[null,1.1000000000000003,0.7565993149877871,0.7595586343423677,0.7102366450993568]
[null,1.1500000000000004,0.7416752829394696,0.74457622928734246,0.69622712348946292]
[null,1.2000000000000004,0.72008496670381528,0.72290146592169202,0.67595981229041324,null,"F Let u be the peripheral speed of the wheel : u = p . Æ . N / 60                      (in m/s)"]
[null,1.2500000000000004,0.69176854271443144,0.69447428668854261,0.64937855378668918,null,"F Let n, be the speed ratio of the turbine : n =  u / [ 2 . (H1 - H2S ) ] 0.5       (dimensionless number)"]
[null,1.3000000000000005,0.65670417625717337,0.65927277147069563,0.61646285124532574,null,null,"N = speed of rotation of the turbine (in rpm)"]
[null,1.3500000000000005,0.61490802147014756,0.61731313759063056,0.57722786891591438,null,null,"Æ = diameter of the wheel of the turbine (in m)"]
[null,1.4000000000000006,0.56643422134371102,0.56864973981050526,0.53172443203060227]
[null,1.4500000000000006,0.51137490772046978,0.51337507033215357,0.48003902680409161]
[null,1.5000000000000007,0.44986020129528115,0.45161975879708793,0.42229380043364062]

{"sheet":"rhea","index":3,"n_rows":239,"n_cols":32,"rows_kept":239,"cut":false,"hidden":false,"merged":[]}
[1,2,3,4,5,6,7,8,9,10,11,12,13,14,15,16,17,18,19,20,21,22,23,24,25,26,27,28]
[null,null,null,null,null,null,null,null,null,null,null,null,null,null,null,null,null,null,null,null,null,null,null,null,null,null,null,null,null,null,null,{"$f":"1-1/3","v":0.66666666666666674}]
[]
[]
[null,null,null,null,"Vitesse de la roue ajustée en fonction de la puissance du frein",null,null,null,null,null,null,{"$f":"D54*0.3","v":321.84999999999997}]
[]
[]
[null,"Relation entre la puissance et la vitesse de rotation",null,null,null,null,null,null,null,null,null,null,"²"]
[]
[null,null,null,"DESIGN",null,null,null,null,null,null,null,"dp=k.m²/rho",null,"dp1*rho1/m1² = dp2*rho2/m2²"]
[null,"TURBINE 1",null,null,null,1,2,3,4,null,null,"m2 = (dp2/dp1 x rho2/ rho1)^0,5 x m1"]
[null,"m","g/s",1166,null,{"$f":"F26*F13/F14^0.5","v":1166},{"$f":"G26*G13/G14^0.5","v":1768.2162770005705},{"$f":"H26*H13/H14^0.5","v":1154.7461944549627},{"$f":"I26*I13/I14^0.5","v":1382.7989200934408}]
[null,"Pin","Bara",19.600000000000001,null,19.600000000000001,12.39,10.3,9.25]
[null,"Tin","K",234.4,null,234.4,40.729999999999997,66,37.119999999999997]
[null,"Pout","Bara",12.41,null,12.41,5.242,4.97,4.0599999999999996]
[null,"Tout","K",{"$f":"[3]!T2_turb(11,D13,D14,D15,D17)","v":205.09061443408166},null,{"$f":"[3]!T2_turb(11,F13,F14,F15,F17)","v":205.09540878203359},{"$f":"[3]!T2_turb(11,G13,G14,G15,G17)","v":0.80000000311428199},{"$f":"[3]!T2_turb(11,H13,H14,H15,H17)","v":55.257439071470138},{"$f":"[3]!T2_turb(11,I13,I14,I15,I17)","v":0.79999999044966963}]
[null,"Efficacity","%",0.752,null,{"$f":"(0.321*F40^4-1.6098*F40^3+1.316*F40^2+0.9448*F40)*($D$17/0.97215493)","v":0.7518788475752235},{"$f":"(0.321*G40^4-1.6098*G40^3+1.316*G40^2+0.9448*G40)*($D$17/0.97215493)","v":3.5536785554716168},{"$f":"(0.321*H40^4-1.6098*H40^3+1.316*H40^2+0.9448*H40)*($D$17/0.97215493)","v":0.64846631562555701},{"$f":"(0.321*I40^4-1.6098*I40^3+1.316*I40^2+0.9448*I40)*($D$17/0.97215493)","v":3.7322965178085727}]
[null,"Power","W",{"$f":"+D12*(D30-D31)","v":180208.96275092859},null,{"$f":"+F12*(F30-F31)","v":180179.92983496207},{"$f":"+G12*(G30-G31)","v":395551.66987581708},{"$f":"+H12*(H30-H31)","v":65994.388359856093},{"$f":"+I12*(I30-I31)","v":{"$error":"#VALUE!"}}]
[null,"Speed","Hz",{"$f":"64420/60","v":1073.6666666666667},null,1073.60900545854,2398.3258755886663,909.66371452703436,2248.4553488171614]
[null,"Speed calculated from P=K.rho.N^3",null,null,null,{"$f":"(F18/$D18*$D21/F21)^(1/3)*$D19","v":1073.6090051834374},{"$f":"(G18/$D18*$D21/G21)^(1/3)*$D19","v":1639.2961018347648},{"$f":"(H18/$D18*$D21/H21)^(1/3)*$D19","v":909.66345823089205},{"$f":"(I18/$D18*$D21/I21)^(1/3)*$D19","v":{"$error":"#VALUE!"}}]
[null,"Brake Pressure inlet",null,18.7,null,{"$f":"($D21-$D15)+F15","v":18.7},{"$f":"($D21-$D15)+G15","v":11.532},{"$f":"($D21-$D15)+H15","v":11.259999999999998},{"$f":"($D21-$D15)+I15","v":10.349999999999998}]
[null,"Brake Pressure outlet",null,1,null,{"$f":"$D22","v":1},{"$f":"$D22","v":1},1,1]
[null,"Brake Flow",null,42.5,null,{"$f":"((F21-F22)/($D21-$D22)*F24/$D24)^0.5*$D23","v":42.5},{"$f":"((G21-G22)/($D21-$D22)*G24/$D24)^0.5*$D23","v":25.782486414505726},25.146877601547185,23.019608574038973]
[null,"Rho (brake)",null,{"$f":"[3]!rho_(11,D21,330)","v":2.7072226355058242},null,{"$f":"[3]!rho_(11,F21,330)","v":2.7072226355058242},{"$f":"[3]!rho_(11,G21,330)","v":1.6743957907582521},{"$f":"[3]!rho_(11,H21,330)","v":1.6350843205286729},{"$f":"[3]!rho_(11,I21,330)","v":1.5035007087814225}]
[null,"Wheel","mm",94,null,{"$f":"$D$25","v":94},{"$f":"$D$25","v":94},{"$f":"$D$25","v":94},{"$f":"$D$25","v":94}]
[null,"a = mÖT/P",null,{"$f":"D12*D14^0.5/D13","v":910.79635255915946},null,{"$f":"+$D$26","v":910.79635255915946},{"$f":"+$D$26","v":910.79635255915946},{"$f":"+$D$26","v":910.79635255915946},{"$f":"+$D$26","v":910.79635255915946}]
[null,"Rho (in)","kg/m3",{"$f":"[3]!rho_(11,D13,D14)","v":3.9784068381490765},null,{"$f":"[3]!rho_(11,F13,F14)","v":3.9784068381490765},{"$f":"[3]!rho_(11,G13,G14)","v":14.178141597167654},{"$f":"[3]!rho_(11,H13,H14)","v":7.3557574001558121},{"$f":"[3]!rho_(11,I13,I14)","v":11.708162912666104}]
[null,"Sound Speed @inlet",null,{"$f":"[3]!Sound_speed(11,D13,D14)","v":910.7282153128873},null,{"$f":"[3]!Sound_speed(11,F13,F14)","v":910.7282153128873},{"$f":"[3]!Sound_speed(11,G13,G14)","v":391.28919888209964},{"$f":"[3]!Sound_speed(11,H13,H14)","v":488.85573725029269},{"$f":"[3]!Sound_speed(11,I13,I14)","v":370.51577371924787}]
[null,"S=Q/(rho*V) = cte",null,{"$f":"D12/(D27*D28)","v":0.3218107637459679},null,{"$f":"F12/(F27*F28)","v":0.3218107637459679},{"$f":"G12/(G27*G28)","v":0.31872653024540837},{"$f":"H12/(H27*H28)","v":0.32112818585189318},{"$f":"I12/(I27*I28)","v":0.3187598202813679}]
[null,"Hin",null,{"$f":"[3]!h_(11,D13,D14)","v":1238.9242075099044},null,{"$f":"[3]!h_(11,F13,F14)","v":1238.9242075099044},{"$f":"[3]!h_(11,G13,G14)","v":227.21274224322462},{"$f":"[3]!h_(11,H13,H14)","v":360.14220393657763},{"$f":"[3]!h_(11,I13,I14)","v":207.89085729231627}]
[null,"Hout",null,{"$f":"[3]!h_(11,D15,D16)","v":1084.3710662140822},null,{"$f":"[3]!h_(11,F15,F16)","v":1084.3959657989592},{"$f":"[3]!h_(11,G15,G16)","v":3.5117872068914129},{"$f":"[3]!h_(11,H15,H16)","v":302.99164680397303},{"$f":"[3]!h_(11,I15,I16)","v":{"$error":"#VALUE!"}}]
[null,"Sin = Sout",null,{"$f":"[3]!S_(11,D13,D14)","v":24.152054511664758},null,{"$f":"[3]!S_(11,F13,F14)","v":24.152054511664758},{"$f":"[3]!S_(11,G13,G14)","v":15.956591869557485},{"$f":"[3]!S_(11,H13,H14)","v":18.892034584941154},{"$f":"[3]!S_(11,I13,I14)","v":16.084358655112414}]
[null,"Tout(iso)",null,{"$f":"[1]!HeCalc(2,0,1,D15*10^5,8,D32*1000,1)","v":195.27686841274914},null,{"$f":"[1]!HeCalc(2,0,1,F15*10^5,8,F32*1000,1)","v":195.27686841274914},{"$f":"[1]!HeCalc(2,0,1,G15*10^5,8,G32*1000,1)","v":28.875086473743544},{"$f":"[1]!HeCalc(2,0,1,H15*10^5,8,H32*1000,1)","v":49.330781375480868},{"$f":"[1]!HeCalc(2,0,1,I15*10^5,8,I32*1000,1)","v":26.699737772795068}]
[null,"Hout(iso)",null,{"$f":"[3]!h_(11,D15,D33)","v":1033.4014132127568},null,{"$f":"[3]!h_(11,F15,F33)","v":1033.4014132127568},{"$f":"[3]!h_(11,G15,G33)","v":164.26361740133086},{"$f":"[3]!h_(11,H15,H33)","v":272.01032143860527},{"$f":"[3]!h_(11,I15,I33)","v":152.92333233105427}]
[null,"ΔHs",null,{"$f":"D30-D34","v":205.52279429714758},null,205.52279429714758,62.949124841893763,88.131882497972356,54.967524961262001]
[null,"u1","m/s",{"$f":"(2*52.7%*D35*1000*D17)^0.5","v":403.60749614232088},null,{"$f":"PI()*$D$37*F19","v":403.58582042437314},{"$f":"PI()*$D$37*G19","v":901.56687511302175},{"$f":"PI()*$D$37*H19","v":341.9563124667302},{"$f":"PI()*$D$37*I19","v":845.22828331937581}]
[null,"D1",null,{"$f":"D36/PI()/D19","v":0.11965748788573756},null,null,null,null,null,null,null,null,"T1"]
[null,"Co = (2*ΔHs)^0,5",null,{"$f":"(2000*D35)^0.5","v":641.12837138461998},null,641.12837138461998,354.82143351802682,419.83778414519185,331.56454865157707]
[null,"u1/Co",null,{"$f":"D36/D38","v":0.62952680641891656},null,0.62949299771707901,2.540903085177399,0.81449627780159961,2.5492118706803595]
[null,"U1/C0 off de / U1/C0 nom",null,{"$f":"D39/$D$39","v":1},null,{"$f":"F39/$D39","v":0.99994629505607568},{"$f":"G39/$D39","v":4.0362111021632385},{"$f":"H39/$D39","v":1.2938230262741119},{"$f":"I39/$D39","v":4.0494095639574637}]
[null,"Rdt",null,{"$f":"(0.321*D40^4-1.6098*D40^3+1.316*D40^2+0.9448*D40)*($D17/0.97215493)","v":0.75188015556327026},null,{"$f":"(0.321*F40^4-1.6098*F40^3+1.316*F40^2+0.9448*F40)*($D17/0.97215493)","v":0.7518788475752235},{"$f":"(0.321*G40^4-1.6098*G40^3+1.316*G40^2+0.9448*G40)*($D17/0.97215493)","v":3.5536785554716168},{"$f":"(0.321*H40^4-1.6098*H40^3+1.316*H40^2+0.9448*H40)*($D17/0.97)","v":0.64990693368486729},{"$f":"(0.321*I40^4-1.6098*I40^3+1.316*I40^2+0.9448*I40)*($D17/0.97215493)","v":3.7322965178085727}]
["ligne_ToBeNull_T1","Converge brake Power",null,null,null,{"$f":"F19-F20","v":2.7510259315022267E-7},{"$f":"G19-G20","v":759.02977375390151},{"$f":"H19-H20","v":2.5629614231093001E-4},{"$f":"I19-I20","v":{"$error":"#VALUE!"}}]
["ligne_ToChange_T1","By changing turbine speed",null,null,null,{"$f":"CELL(\"address\",F19)","v":"$F$19"},{"$f":"CELL(\"address\",G19)","v":"$G$19"},{"$f":"CELL(\"address\",H19)","v":"$H$19"},{"$f":"CELL(\"address\",I19)","v":"$I$19"}]
[]
[]
[null,"TURBINE 2",null,null,null,1,2,3,4]
[null,"m","g/s",1166,null,{"$f":"F12","v":1166},{"$f":"G12","v":1768.2162770005705},{"$f":"H59/(H50*H49)^0.5*H48","v":680.47061775513077},{"$f":"I12","v":1382.7989200934408},null,null,null,null,null,null,null,650,{"$f":"#REF!*Q47^3","v":{"$error":"#REF!"}}]
[null,"Pin","Bara",12.16,null,{"$f":"F47*F49^0.5/F59","v":5.1415832134389925},{"$f":"G47*G49^0.5/G59","v":6.8616028063072942},4.87,{"$f":"I47*I49^0.5/I59","v":5.2775844469525817},null,null,null,null,null,null,null,{"$f":"Q47/#REF!","v":{"$error":"#REF!"}},{"$f":"R47/#REF!","v":{"$error":"#REF!"}}]
[null,"Tin","K",128.19999999999999,null,22.92,17.75,52.5,17.170000000000002]
[null,"Pout","Bara",4.87,null,1.35,1.29,1.1499999999999999,1.35]
[null,"Tout","K",{"$f":"[3]!T2_turb(11,D48,D49,D50,D52)","v":99.256081848455594},null,{"$f":"[3]!T2_turb(11,F48,F49,F50,F52)","v":"NUM"},{"$f":"[3]!T2_turb(11,G48,G49,G50,G52)","v":"NUM"},{"$f":"[3]!T2_turb(11,H48,H49,H50,H52)","v":51.825503894281347},{"$f":"[3]!T2_turb(11,I48,I49,I50,I52)","v":"NUM"}]
[null,"Efficacity","%",0.74,null,{"$f":"(0.321*F73^4-1.6098*F73^3+1.316*F73^2+0.9448*F73)*($D$52/0.97215493)","v":79.742101457927561},{"$f":"(0.321*G73^4-1.6098*G73^3+1.316*G73^2+0.9448*G73)*($D$52/0.97215493)","v":157.23409931351617},{"$f":"(0.321*H73^4-1.6098*H73^3+1.316*H73^2+0.9448*H73)*($D$52/0.97215493)","v":3.3338150492587558E-2},{"$f":"(0.321*I73^4-1.6098*I73^3+1.316*I73^2+0.9448*I73)*($D$52/0.97215493)","v":90.831648060719758}]
[null,"Power","W",{"$f":"+D47*(D63-D64)","v":178025.62253349068},null,{"$f":"+F47*(F63-F64)","v":{"$error":"#VALUE!"}},{"$f":"+G47*(G63-G64)","v":{"$error":"#VALUE!"}},{"$f":"+H47*(H63-H64)","v":2731.9139212022374},{"$f":"+I47*(I63-I64)","v":{"$error":"#VALUE!"}}]
[null,"Speed","Hz",{"$f":"64370/60","v":1072.8333333333333},null,3061.9772412269326,3236.8303722857822,1442.2816810178781,2695.5122481779008]
[null,"Speed calculated from P=K.rho.N^3",null,null,null,{"$f":"(F53/$D53*$D56/F56)^(1/3)*$D54","v":{"$error":"#VALUE!"}},{"$f":"(G53/$D53*$D56/G56)^(1/3)*$D54","v":{"$error":"#VALUE!"}},{"$f":"(H53/$D53*$D56/H56)^(1/3)*$D54","v":288.85605461627682},{"$f":"(I53/$D53*$D56/I56)^(1/3)*$D54","v":{"$error":"#VALUE!"}}]
[null,"Brake Pressure",null,17.399999999999999,null,{"$f":"($D56-$D50)+F50","v":13.879999999999997},{"$f":"($D56-$D50)+G50","v":13.819999999999997},{"$f":"($D56-$D50)+H50","v":13.679999999999998},{"$f":"($D56-$D50)+I50","v":13.879999999999997}]
[null,"Rho (brake)",null,{"$f":"[3]!rho_(11,D56,330)","v":2.5203566299538549},null,{"$f":"[3]!rho_(11,F56,330)","v":2.0133828242274689},{"$f":"[3]!rho_(11,G56,330)","v":2.0047285680011075},{"$f":"[3]!rho_(11,H56,330)","v":1.9845336516656342},{"$f":"[3]!rho_(11,I56,330)","v":2.0133828242274689}]
[null,"Wheel","mm",36.4,null,{"$f":"$D$25","v":94},{"$f":"$D$25","v":94},{"$f":"$D$25","v":94},{"$f":"$D$25","v":94}]
[null,"a = mÖT/P",null,{"$f":"D47*D49^0.5/D48","v":1085.6978756974588},null,{"$f":"$D$59","v":1085.6978756974588},{"$f":"$D$59","v":1085.6978756974588},1085.6978756974588,1085.6978756974588]
[null,"Rho (in)","kg/m3",{"$f":"[3]!rho_(11,D48,D49)","v":4.5034183316522833},null,{"$f":"[3]!rho_(11,F48,F49)","v":10.736408952104037},{"$f":"[3]!rho_(11,G48,G49)","v":18.830152202851021},{"$f":"[3]!rho_(11,H48,H49)","v":4.414094182882728},{"$f":"[3]!rho_(11,I48,I49)","v":14.993602639831165}]
[null,"Sound Speed",null,{"$f":"[3]!Sound_speed(11,D48,D49)","v":675.14806412775852},null,{"$f":"[3]!Sound_speed(11,F48,F49)","v":288.29263108900471},{"$f":"[3]!Sound_speed(11,G48,G49)","v":255.81090423549074},{"$f":"[3]!Sound_speed(11,H48,H49)","v":431.99130225370175},{"$f":"[3]!Sound_speed(11,I48,I49)","v":249.40083271568176},null,null,null,null,null,null,null,null,null,null,"T2"]
[null,"S=Q/(rho*V) = cte",null,{"$f":"D47/(D60*D61)","v":0.383492815710201},null,{"$f":"F47/(F60*F61)","v":0.37670897143609139},{"$f":"G47/(G60*G61)","v":0.36708150265390244},{"$f":"H47/(H60*H61)","v":0.35685581598989502},{"$f":"I47/(I60*I61)","v":0.36978997691103133},null,null,null,null,null,null,null,null,null,"MAX",{"$f":"ROUND(F47,0)&\"g/s @ \"&F48&\" b ; \"&F49&\"K\"","v":"1166g/s @ 5,14158321343899 b ; 22,92K"}]
[null,"Hin",null,{"$f":"[3]!h_(11,D48,D49)","v":684.77699286274151},null,{"$f":"[3]!h_(11,F48,F49)","v":132.34833387944533},{"$f":"[3]!h_(11,G48,G49)","v":102.97068373634546},{"$f":"[3]!h_(11,H48,H49)","v":288.57025422464784},{"$f":"[3]!h_(11,I48,I49)","v":100.71764036117506},null,null,null,null,null,null,null,null,null,"MIN",{"$f":"ROUND(G47,0)&\"g/s @ \"&G48&\" b ; \"&G49&\"K\"","v":"1768g/s @ 6,86160280630729 b ; 17,75K"}]
[null,"Hout",null,{"$f":"[3]!h_(11,D50,D51)","v":532.09635604156597},null,{"$f":"[3]!h_(11,F50,F51)","v":{"$error":"#VALUE!"}},{"$f":"[3]!h_(11,G50,G51)","v":{"$error":"#VALUE!"}},{"$f":"[3]!h_(11,H50,H51)","v":284.55551229469529},{"$f":"[3]!h_(11,I50,I51)","v":{"$error":"#VALUE!"}},null,null,null,null,null,null,null,null,null,"STS",{"$f":"ROUND(H47,0)&\"g/s @ \"&H48&\" b ; \"&H49&\"K\"","v":"680g/s @ 4,87 b ; 52,5K"}]
[null,"Sin = Sout",null,{"$f":"[3]!S_(11,D48,D49)","v":22.00751536992982},null,{"$f":"[3]!S_(11,F48,F49)","v":14.758968977342699},{"$f":"[3]!S_(11,G48,G49)","v":12.705198986293045},{"$f":"[3]!S_(11,H48,H49)","v":19.260113557237521},{"$f":"[3]!S_(11,I48,I49)","v":13.114526257721957},null,null,null,null,null,null,null,null,null,"BAKING",{"$f":"ROUND(I47,0)&\"g/s @ \"&I48&\" b ; \"&I49&\"K\"","v":"1383g/s @ 5,27758444695258 b ; 17,17K"}]
[null,"Tout(iso)",null,{"$f":"[1]!HeCalc(2,0,1,D50*10^5,8,D65*1000,1)","v":88.940861190991512},null,{"$f":"[1]!HeCalc(2,0,1,F50*10^5,8,F65*1000,1)","v":13.389808764455617},{"$f":"[1]!HeCalc(2,0,1,G50*10^5,8,G65*1000,1)","v":9.0221381031826322},{"$f":"[1]!HeCalc(2,0,1,H50*10^5,8,H65*1000,1)","v":29.476863341337229},{"$f":"[1]!HeCalc(2,0,1,I50*10^5,8,I65*1000,1)","v":9.8936872978088211}]
[null,"Hout(iso)",null,{"$f":"[3]!h_(11,D50,D66)","v":478.4518079692611},null,{"$f":"[3]!h_(11,F50,F66)","v":83.319425086237828},{"$f":"[3]!h_(11,G50,G66)","v":59.610427928101132},{"$f":"[3]!h_(11,H50,H66)","v":168.14539949717414},{"$f":"[3]!h_(11,I50,I66)","v":64.333380380204375}]
[null,"ΔHs",null,{"$f":"D63-D67","v":206.32518489348041},null,49.028908793207506,43.360255808244332,120.4248547274737,36.384259980970683]
[null,"u1","m/s",{"$f":"(2*52.7%*D68*1000*D52)^0.5","v":401.1550712748363},null,{"$f":"PI()*$D$70*F54","v":1144.9380442252448},{"$f":"PI()*$D$70*G54","v":1210.3193276671038},539.29962145140678,1007.909033437937]
[null,"D1",null,{"$f":"D69/PI()/D54","v":0.11902279796135802}]
[null,"Co = (2*ΔHs)^0,5",null,{"$f":"(2000*D68)^0.5","v":642.37868098728245},null,313.14184898607056,294.48346577777278,490.76441339500911,269.7564085651004]
[null,"u1/Co",null,{"$f":"D69/D71","v":0.62448378681916161},null,3.6562920220739161,4.1099737958818094,1.0988971627356614,3.7363673352534938]
[null,"U1/C0 off de / U1/C0 nom",null,{"$f":"D72/$D$39","v":0.99198919005777952},null,{"$f":"F72/$D72","v":5.8549030403133706},{"$f":"G72/$D72","v":6.5813939170721465},{"$f":"H72/$D72","v":1.7596888597107496},{"$f":"I72/$D72","v":5.9831294488602529}]
[null,"Rdt",null,{"$f":"(0.321*D73^4-1.6098*D73^3+1.316*D73^2+0.9448*D73)*($D52/0.97215493)","v":0.73961318404921683},null,{"$f":"(0.321*F73^4-1.6098*F73^3+1.316*F73^2+0.9448*F73)*($D52/0.97215493)","v":79.742101457927561},{"$f":"(0.321*G73^4-1.6098*G73^3+1.316*G73^2+0.9448*G73)*($D52/0.97215493)","v":157.23409931351617},{"$f":"(0.321*H73^4-1.6098*H73^3+1.316*H73^2+0.9448*H73)*($D52/0.97215493)","v":3.3338150492587558E-2},{"$f":"(0.321*I73^4-1.6098*I73^3+1.316*I73^2+0.9448*I73)*($D52/0.97215493)","v":90.831648060719758}]
["ligne_ToBeNull_T2","Converge brake Power",null,null,null,{"$f":"F54-F55","v":{"$error":"#VALUE!"}},{"$f":"G54-G55","v":{"$error":"#VALUE!"}},{"$f":"H54-H55","v":1153.4256264016012},{"$f":"I54-I55","v":{"$error":"#VALUE!"}}]
["ligne_ToChange_T2","By changing turbine speed",null,null,null,{"$f":"CELL(\"address\",F54)","v":"$F$54"},{"$f":"CELL(\"address\",G54)","v":"$G$54"},{"$f":"CELL(\"address\",H54)","v":"$H$54"},{"$f":"CELL(\"address\",I54)","v":"$I$54"}]
[]
[null,"INLET VALVE"]
[null,"Pin","Bara",13.15,null,13.15,13.25,13.5,12.25]
[null,"Tin","K",{"$f":"[3]!T_P_H_(11,D79,[3]!h_(11,D92,D93))","v":7.2906635679049048},null,{"$f":"[3]!T_P_H_(11,F79,[3]!h_(11,F92,F93))","v":9.1661496679837366},{"$f":"[3]!T_P_H_(11,G79,[3]!h_(11,G92,G93))","v":8.6223146254179426},{"$f":"+H93","v":8.8279999999999994},{"$f":"[3]!T_P_H_(11,I79,[3]!h_(11,I92,I93))","v":10.795640526772669}]
[null,"Rho",null,{"$f":"[3]!rho_(11,D79,D80)","v":122.33933382974966},null,{"$f":"[3]!rho_(11,F79,F80)","v":92.385436868539188},{"$f":"[3]!rho_(11,G79,G80)","v":101.58811590421918},{"$f":"[3]!rho_(11,H79,H80)","v":99.5385923004863},{"$f":"[3]!rho_(11,I79,I80)","v":66.476961067945879}]
[null,"dP",null,{"$f":"(D79-D92)*1000","v":80.000000000000071},null,{"$f":"(F79-F92)*1000","v":80.000000000000071},{"$f":"(G79-G92)*1000","v":5881},{"$f":"(H79-H92)*1000","v":429.99999999999972},{"$f":"(I79-I92)*1000","v":1769.9999999999995}]
[null,"Cvs",null,30,null,30,30,30,30]
[null,"Range",null,250,null,250,250,250,250]
[null,"Flow",null,{"$f":"IF(D79/2>D92,\"S\",\"SS\")","v":"SS"},null,{"$f":"IF(F79/2>F92,\"S\",\"SS\")","v":"SS"},{"$f":"IF(G79/2>G92,\"S\",\"SS\")","v":"SS"},{"$f":"IF(H79/2>H92,\"S\",\"SS\")","v":"SS"},{"$f":"IF(I79/2>I92,\"S\",\"SS\")","v":"SS"}]
[null,"Cv",null,{"$f":"[3]!Cv_Simple(D80,D79,D79-D92,D81,D91,D85)","v":16.871042195072768},null,{"$f":"[3]!Cv_Simple(F80,F79,F79-F92,F81,F91,F85)","v":17.322030622050519},{"$f":"[3]!Cv_Simple(G80,G79,G79-G92,G81,G91,G85)","v":1.5624806801519351},{"$f":"[3]!Cv_Simple(H80,H79,H79-H92,H81,H91,H85)","v":7.429099265086073},{"$f":"[3]!Cv_Simple(I80,I79,I79-I92,I81,I91,I85)","v":3.4961725954823515}]
[null,"Cv",null,{"$f":"[3]!cv_gaz(11,D91,D79,D92,D80,0.87)","v":16.857057297506717},null,{"$f":"[3]!cv_gaz(11,F91,F79,F92,F80,0.7)","v":17.308166700589858},{"$f":"[3]!cv_gaz(11,G91,G79,G92,G80,0.7)","v":1.3177141878829883},{"$f":"[3]!cv_gaz(11,H91,H79,H92,H80,0.7)","v":7.375826267492581},{"$f":"[3]!cv_gaz(11,I91,I79,I92,I80,0.7)","v":3.3667447055415276}]
[null,"Trim",null,{"$f":"[3]!Trim_From_Cv(D86/D83,D84)","v":0.89575246161070277},null,{"$f":"[3]!Trim_From_Cv(F87/F83,F84)","v":0.9003852538106093},{"$f":"[3]!Trim_From_Cv(G87/G83,G84)","v":0.43397248147073375},{"$f":"[3]!Trim_From_Cv(H87/H83,H84)","v":0.74590249386662622},{"$f":"[3]!Trim_From_Cv(I87/I83,I84)","v":0.60386370574280523}]
[]
[null,"TURBINE 3",null,null,null,{"$f":"F46","v":1},{"$f":"G46","v":2},{"$f":"H46","v":3},{"$f":"I46","v":4}]
[null,"m","g/s",399.8,null,{"$f":"F103*F92/F93^0.5","v":356.71254491965487},{"$f":"G103*G92/G93^0.5","v":216.39934874316916},{"$f":"H103*H92/H93^0.5","v":363.35819334950799},{"$f":"I103*I92/I93^0.5","v":266.51741052448835}]
[null,"Pin","Bara",13.07,null,13.07,7.3689999999999998,13.07,10.48]
[null,"Tin","K",7.2919999999999998,null,9.16,7.9119999999999999,8.8279999999999994,10.55]
[null,"Pout","Bara",4.88,null,4.88,5.18,4.88,5.18]
[null,"Tout","K",{"$f":"[3]!T2_turb(11,D92,D93,D94,D96)","v":6.1198408797506243},null,{"$f":"[3]!T2_turb(11,F92,F93,F94,F96)","v":6.9395281603085568},{"$f":"[3]!T2_turb(11,G92,G93,G94,G96)","v":7.1075335045223715},{"$f":"[3]!T2_turb(11,H92,H93,H94,H96)","v":6.7708056613683949},{"$f":"[3]!T2_turb(11,I92,I93,I94,I96)","v":8.46896187247307}]
[null,"Efficacity","%",0.72,null,{"$f":"(0.321*F117^4-1.6098*F117^3+1.316*F117^2+0.9448*F117)*($D$96/0.97215493)","v":0.70696991088814909},0.70961038411638022,0.7108555917631959,0.66763502805420782]
[null,"Power","W",{"$f":"+D91*(D107-D108)","v":2075.5404202052005},null,{"$f":"+F91*(F107-F108)","v":2562.8611999919885},{"$f":"+G91*(G107-G108)","v":505.8456105984647},{"$f":"+H91*(H107-H108)","v":2455.6474856351151},{"$f":"+I91*(I107-I108)","v":1848.4112084409489}]
[null,"Speed","Hz",838,null,899.03236545200411,518.36496558823876,886.31675848463021,798.41587659968297]
[null,"Speed calculated from P=K.rho.N^3",null,null,null,{"$f":"(F97/$D97*$D100/F100)^(1/3)*$D98","v":899.03234223004904},{"$f":"(G97/$D97*$D100/G100)^(1/3)*$D98","v":518.36494821079805},{"$f":"(H97/$D97*$D100/H100)^(1/3)*$D98","v":886.31675862707539},{"$f":"(I97/$D97*$D100/I100)^(1/3)*$D98","v":798.41587361807512}]
[null,"Brake Pressure",null,10.1,null,{"$f":"($D100-$D94)+F94","v":10.1},{"$f":"($D100-$D94)+G94","v":10.399999999999999},{"$f":"($D100-$D94)+H94","v":10.1},{"$f":"($D100-$D94)+I94","v":10.399999999999999}]
[null,"Rho (brake)",null,{"$f":"[3]!rho_(11,D100,330)","v":1.4673342046153373},null,{"$f":"[3]!rho_(11,F100,330)","v":1.4673342046153373},{"$f":"[3]!rho_(11,G100,330)","v":1.5107331217743123},{"$f":"[3]!rho_(11,H100,330)","v":1.4673342046153373},{"$f":"[3]!rho_(11,I100,330)","v":1.5107331217743123}]
[null,"Wheel","mm",29.5,null,{"$f":"$D$102","v":29.5},29.5,29.5,29.5]
[null,"a = mÖT/P",null,{"$f":"D91*D93^0.5/D92","v":82.601994178997316},null,{"$f":"$D$103","v":82.601994178997316},{"$f":"$D$103","v":82.601994178997316},82.601994178997316,82.601994178997316]
[null,"Rho (in)","kg/m3",{"$f":"[3]!rho_(11,D92,D93)","v":122.0413850208848},null,{"$f":"[3]!rho_(11,F92,F93)","v":92.042022544510019},{"$f":"[3]!rho_(11,G92,G93)","v":70.649649504414128},{"$f":"[3]!rho_(11,H92,H93)","v":97.31015974976988},{"$f":"[3]!rho_(11,I92,I93)","v":58.789985568547117}]
[null,"Sound Speed",null,{"$f":"[3]!Sound_speed(11,D92,D93)","v":249.05671288435045},null,{"$f":"[3]!Sound_speed(11,F92,F93)","v":219.03534618547846},{"$f":"[3]!Sound_speed(11,G92,G93)","v":170.78644408370695},{"$f":"[3]!Sound_speed(11,H92,H93)","v":221.8649954478073},{"$f":"[3]!Sound_speed(11,I92,I93)","v":204.26692373410398}]
[null,"S=Q/(rho*V) = cte",null,{"$f":"D91/(D104*D105)","v":1.3153381307708404E-2},null,{"$f":"F91/(F104*F105)","v":1.7693674196317646E-2},{"$f":"G91/(G104*G105)","v":1.7934634960869941E-2},{"$f":"H91/(H104*H105)","v":1.6830149927226111E-2},{"$f":"I91/(I104*I105)","v":2.2193417492548106E-2}]
[null,"Hin",null,{"$f":"[3]!h_(11,D92,D93)","v":28.150884578454882},null,{"$f":"[3]!h_(11,F92,F93)","v":40.890140453818937},{"$f":"[3]!h_(11,G92,G93)","v":36.811643961665368},{"$f":"[3]!h_(11,H92,H93)","v":38.395688158328092},{"$f":"[3]!h_(11,I92,I93)","v":54.059832308617963}]
[null,"Hout",null,{"$f":"[3]!h_(11,D94,D95)","v":22.959437804554931},null,{"$f":"[3]!h_(11,F94,F95)","v":33.705472472575828},{"$f":"[3]!h_(11,G94,G95)","v":34.474087894438838},{"$f":"[3]!h_(11,H94,H95)","v":31.637487763840028},{"$f":"[3]!h_(11,I94,I95)","v":47.124408447177167}]
[null,"Sin = Sout",null,{"$f":"[3]!S_(11,D92,D93)","v":5.0600046690749361},null,{"$f":"[3]!S_(11,F92,F93)","v":6.606972813997622},{"$f":"[3]!S_(11,G92,G93)","v":6.9458302073485418},{"$f":"[3]!S_(11,H92,H93)","v":6.3296128173799451},{"$f":"[3]!S_(11,I92,I93)","v":8.3000204511344844}]
[null,"Tout(iso)",null,{"$f":"[1]!HeCalc(2,0,1,D94*10^5,8,D109*1000,1)","v":5.9351387842537191},null,{"$f":"[1]!HeCalc(2,0,1,F94*10^5,8,F109*1000,1)","v":6.6999950291002683},{"$f":"[1]!HeCalc(2,0,1,G94*10^5,8,G109*1000,1)","v":7.0241819850115181},{"$f":"[1]!HeCalc(2,0,1,H94*10^5,8,H109*1000,1)","v":6.5619829946977015},{"$f":"[1]!HeCalc(2,0,1,I94*10^5,8,I109*1000,1)","v":8.0488946725573083}]
[null,"Hout(iso)",null,{"$f":"[3]!h_(11,D94,D110)","v":20.940541836947467},null,{"$f":"[3]!h_(11,F94,F110)","v":30.727518437529557},{"$f":"[3]!h_(11,G94,G110)","v":33.517503797489027},{"$f":"[3]!h_(11,H94,H110)","v":28.888552710608689},{"$f":"[3]!h_(11,I94,I110)","v":43.671785543492518}]
[null,"ΔHs",null,{"$f":"D107-D111","v":7.2103427415074144},null,10.162622016289379,3.2941401641763406,9.5071354477194028,10.388046765125445]
[null,"u1","m/s",{"$f":"(2*52.7%*D112*1000*D96)^0.5","v":73.971514109656738},null,{"$f":"PI()*$D$114*F98","v":79.358932346146773},{"$f":"PI()*$D$114*G98","v":45.756851272031192},78.236506689583592,70.477364297455139]
[null,"D1",null,{"$f":"D113/PI()/D98","v":2.8097690020390816E-2}]
[null,"Co = (2*ΔHs)^0,5",null,{"$f":"(2000*D112)^0.5","v":120.0861585821398},null,142.56663015088333,81.16822240478524,137.89224378274076,144.13914641848999]
[null,"u1/Co",null,{"$f":"D113/D115","v":0.61598701285010871},null,0.55664451254938407,0.56372863562099662,0.56737423761738826,0.48895366767909759]
[null,"U1/C0 off de / U1/C0 nom",null,{"$f":"D116/$D$39","v":0.97849210958016319},null,{"$f":"F116/$D116","v":0.90366274115723155},0.91516318341304315,0.9210814932480571,0.79377268916232369]
[null,"Rdt",null,{"$f":"(0.321*D117^4-1.6098*D117^3+1.316*D117^2+0.9448*D117)*($D96/0.97215493)","v":0.71884367918750081},null,{"$f":"(0.321*F117^4-1.6098*F117^3+1.316*F117^2+0.9448*F117)*($D96/0.97215493)","v":0.70696991088814909},{"$f":"(0.321*G117^4-1.6098*G117^3+1.316*G117^2+0.9448*G117)*($D96/0.97215493)","v":0.70961038411638022},{"$f":"(0.321*H117^4-1.6098*H117^3+1.316*H117^2+0.9448*H117)*($D96/0.97215493)","v":0.7108555917631959},{"$f":"(0.321*I117^4-1.6098*I117^3+1.316*I117^2+0.9448*I117)*($D96/0.97215493)","v":0.66763502805420782}]
["ligne_ToBeNull_T3","Converge brake Power",null,null,null,{"$f":"F98-F99","v":2.3221955075314327E-5},{"$f":"G98-G99","v":1.7377440713062242E-5},{"$f":"H98-H99","v":-1.4244517387851374E-7},{"$f":"I98-I99","v":2.9816078495059628E-6}]
["ligne_ToChange_T3","By changing turbine speed"]
[]
[null,"TURBINE 4",null,null,null,{"$f":"F78","v":0},{"$f":"G78","v":0},{"$f":"H78","v":0},{"$f":"I78","v":0}]
[null,"m","g/s",399.8,null,{"$f":"F135*F124/F125^0.5","v":356.71254491965487},{"$f":"G135*G124/G125^0.5","v":216.39934874316916},{"$f":"H135*H124/H125^0.5","v":363.35819334950799},{"$f":"I135*I124/I125^0.5","v":266.51741052448835}]
[null,"Pin","Bara",13.07,null,13.07,7.3689999999999998,13.07,10.48]
[null,"Tin","K",7.2919999999999998,null,9.16,7.9119999999999999,8.8279999999999994,10.55]
[null,"Pout","Bara",4.88,null,4.88,5.18,4.88,5.18]
[null,"Tout","K",{"$f":"[3]!T2_turb(11,D124,D125,D126,D128)","v":6.1198408797506243},null,{"$f":"[3]!T2_turb(11,F124,F125,F126,F128)","v":6.9395281603085568},{"$f":"[3]!T2_turb(11,G124,G125,G126,G128)","v":7.1075335045223715},{"$f":"[3]!T2_turb(11,H124,H125,H126,H128)","v":6.7708056613683949},{"$f":"[3]!T2_turb(11,I124,I125,I126,I128)","v":8.46896187247307}]
[null,"Efficacity","%",0.72,null,{"$f":"(0.321*F149^4-1.6098*F149^3+1.316*F149^2+0.9448*F149)*($D$96/0.97215493)","v":0.70696991088814909},0.70961038411638022,0.7108555917631959,0.66763502805420782]
[null,"Power","W",{"$f":"+D123*(D139-D140)","v":2075.5404202052005},null,{"$f":"+F123*(F139-F140)","v":2562.8611999919885},{"$f":"+G123*(G139-G140)","v":505.8456105984647},{"$f":"+H123*(H139-H140)","v":2455.6474856351151},{"$f":"+I123*(I139-I140)","v":1848.4112084409489}]
[null,"Speed","Hz",838,null,899.03236545200411,518.36496558823876,886.31675848463021,798.41587659968297]
[null,"Speed calculated from P=K.rho.N^3",null,null,null,{"$f":"(F129/$D129*$D132/F132)^(1/3)*$D130","v":899.03234223004904},{"$f":"(G129/$D129*$D132/G132)^(1/3)*$D130","v":518.36494821079805},{"$f":"(H129/$D129*$D132/H132)^(1/3)*$D130","v":886.31675862707539},{"$f":"(I129/$D129*$D132/I132)^(1/3)*$D130","v":798.41587361807512}]
[null,"Brake Pressure",null,10.1,null,{"$f":"($D132-$D126)+F126","v":10.1},{"$f":"($D132-$D126)+G126","v":10.399999999999999},{"$f":"($D132-$D126)+H126","v":10.1},{"$f":"($D132-$D126)+I126","v":10.399999999999999}]
[null,"Rho (brake)",null,{"$f":"[3]!rho_(11,D132,330)","v":1.4673342046153373},null,{"$f":"[3]!rho_(11,F132,330)","v":1.4673342046153373},{"$f":"[3]!rho_(11,G132,330)","v":1.5107331217743123},{"$f":"[3]!rho_(11,H132,330)","v":1.4673342046153373},{"$f":"[3]!rho_(11,I132,330)","v":1.5107331217743123}]
[null,"Wheel","mm",29.5,null,{"$f":"$D$102","v":29.5},29.5,29.5,29.5]
[null,"a = mÖT/P",null,{"$f":"D123*D125^0.5/D124","v":82.601994178997316},null,{"$f":"$D$103","v":82.601994178997316},{"$f":"$D$103","v":82.601994178997316},82.601994178997316,82.601994178997316]
[null,"Rho (in)","kg/m3",{"$f":"[3]!rho_(11,D124,D125)","v":122.0413850208848},null,{"$f":"[3]!rho_(11,F124,F125)","v":92.042022544510019},{"$f":"[3]!rho_(11,G124,G125)","v":70.649649504414128},{"$f":"[3]!rho_(11,H124,H125)","v":97.31015974976988},{"$f":"[3]!rho_(11,I124,I125)","v":58.789985568547117}]
[null,"Sound Speed",null,{"$f":"[3]!Sound_speed(11,D124,D125)","v":249.05671288435045},null,{"$f":"[3]!Sound_speed(11,F124,F125)","v":219.03534618547846},{"$f":"[3]!Sound_speed(11,G124,G125)","v":170.78644408370695},{"$f":"[3]!Sound_speed(11,H124,H125)","v":221.8649954478073},{"$f":"[3]!Sound_speed(11,I124,I125)","v":204.26692373410398}]
[null,"S=Q/(rho*V) = cte",null,{"$f":"D123/(D136*D137)","v":1.3153381307708404E-2},null,{"$f":"F123/(F136*F137)","v":1.7693674196317646E-2},{"$f":"G123/(G136*G137)","v":1.7934634960869941E-2},{"$f":"H123/(H136*H137)","v":1.6830149927226111E-2},{"$f":"I123/(I136*I137)","v":2.2193417492548106E-2}]
[null,"Hin",null,{"$f":"[3]!h_(11,D124,D125)","v":28.150884578454882},null,{"$f":"[3]!h_(11,F124,F125)","v":40.890140453818937},{"$f":"[3]!h_(11,G124,G125)","v":36.811643961665368},{"$f":"[3]!h_(11,H124,H125)","v":38.395688158328092},{"$f":"[3]!h_(11,I124,I125)","v":54.059832308617963}]
[null,"Hout",null,{"$f":"[3]!h_(11,D126,D127)","v":22.959437804554931},null,{"$f":"[3]!h_(11,F126,F127)","v":33.705472472575828},{"$f":"[3]!h_(11,G126,G127)","v":34.474087894438838},{"$f":"[3]!h_(11,H126,H127)","v":31.637487763840028},{"$f":"[3]!h_(11,I126,I127)","v":47.124408447177167}]
[null,"Sin = Sout",null,{"$f":"[3]!S_(11,D124,D125)","v":5.0600046690749361},null,{"$f":"[3]!S_(11,F124,F125)","v":6.606972813997622},{"$f":"[3]!S_(11,G124,G125)","v":6.9458302073485418},{"$f":"[3]!S_(11,H124,H125)","v":6.3296128173799451},{"$f":"[3]!S_(11,I124,I125)","v":8.3000204511344844}]
[null,"Tout(iso)",null,{"$f":"[1]!HeCalc(2,0,1,D126*10^5,8,D141*1000,1)","v":5.9351387842537191},null,{"$f":"[1]!HeCalc(2,0,1,F126*10^5,8,F141*1000,1)","v":6.6999950291002683},{"$f":"[1]!HeCalc(2,0,1,G126*10^5,8,G141*1000,1)","v":7.0241819850115181},{"$f":"[1]!HeCalc(2,0,1,H126*10^5,8,H141*1000,1)","v":6.5619829946977015},{"$f":"[1]!HeCalc(2,0,1,I126*10^5,8,I141*1000,1)","v":8.0488946725573083}]
[null,"Hout(iso)",null,{"$f":"[3]!h_(11,D126,D142)","v":20.940541836947467},null,{"$f":"[3]!h_(11,F126,F142)","v":30.727518437529557},{"$f":"[3]!h_(11,G126,G142)","v":33.517503797489027},{"$f":"[3]!h_(11,H126,H142)","v":28.888552710608689},{"$f":"[3]!h_(11,I126,I142)","v":43.671785543492518}]
[null,"ΔHs",null,{"$f":"D139-D143","v":7.2103427415074144},null,{"$f":"F139-F143","v":10.162622016289379},3.2941401641763406,9.5071354477194028,10.388046765125445]
[null,"u1","m/s",{"$f":"(2*52.7%*D144*1000*D128)^0.5","v":73.971514109656738},null,{"$f":"PI()*$D$114*F130","v":79.358932346146773},{"$f":"PI()*$D$114*G130","v":45.756851272031192},78.236506689583592,70.477364297455139]
[null,"D1",null,{"$f":"D145/PI()/D130","v":2.8097690020390816E-2}]
[null,"Co = (2*ΔHs)^0,5",null,{"$f":"(2000*D144)^0.5","v":120.0861585821398},null,{"$f":"(2000*F144)^0.5","v":142.56663015088333},81.16822240478524,137.89224378274076,144.13914641848999]
[null,"u1/Co",null,{"$f":"D145/D147","v":0.61598701285010871},null,{"$f":"F145/F147","v":0.55664451254938407},0.56372863562099662,0.56737423761738826,0.48895366767909759]
[null,"U1/C0 off de / U1/C0 nom",null,{"$f":"D148/$D$39","v":0.97849210958016319},null,{"$f":"F148/$D148","v":0.90366274115723155},0.91516318341304315,0.9210814932480571,0.79377268916232369]
[null,"Rdt",null,{"$f":"(0.321*D149^4-1.6098*D149^3+1.316*D149^2+0.9448*D149)*($D128/0.97215493)","v":0.71884367918750081},null,{"$f":"(0.321*F149^4-1.6098*F149^3+1.316*F149^2+0.9448*F149)*($D128/0.97215493)","v":0.70696991088814909},{"$f":"(0.321*G149^4-1.6098*G149^3+1.316*G149^2+0.9448*G149)*($D128/0.97215493)","v":0.70961038411638022},{"$f":"(0.321*H149^4-1.6098*H149^3+1.316*H149^2+0.9448*H149)*($D128/0.97215493)","v":0.7108555917631959},{"$f":"(0.321*I149^4-1.6098*I149^3+1.316*I149^2+0.9448*I149)*($D128/0.97215493)","v":0.66763502805420782}]
["ligne_ToBeNull_T3","Converge brake Power",null,null,null,{"$f":"F130-F131","v":2.3221955075314327E-5},{"$f":"G130-G131","v":1.7377440713062242E-5},{"$f":"H130-H131","v":-1.4244517387851374E-7},{"$f":"I130-I131","v":2.9816078495059628E-6}]
["ligne_ToChange_T3","By changing turbine speed"]
[]
[null,"CV220A"]
[null,"flow",null,{"$f":"$D$91-D91","v":0},null,{"$f":"$D$91-F91","v":43.087455080345137},183.40065125683086,36.441806650492026,133.28258947551166]
[null,"Pin","Bara",13.5,null,13.5,13.5,13.5,13.5]
[null,"Tin","K",100,null,100,100,100,100]
[null,"Rho",null,{"$f":"[3]!rho_(11,D156,D157)","v":6.3733311238230197},null,{"$f":"[3]!rho_(11,F156,F157)","v":6.3733311238230197},{"$f":"[3]!rho_(11,G156,G157)","v":6.3733311238230197},{"$f":"[3]!rho_(11,H156,H157)","v":6.3733311238230197},{"$f":"[3]!rho_(11,I156,I157)","v":6.3733311238230197}]
[null,"Pout",null,{"$f":"1.15","v":1.1499999999999999},null,{"$f":"1.15","v":1.1499999999999999},1.1499999999999999,1.1499999999999999,1.1499999999999999]
[null,"Cvs",null,35,null,35,35,35,35]
[null,"Range",null,100,null,100,100,100,100]
[null,"Flow",null,{"$f":"IF(D156/2>D159,\"S\",\"SS\")","v":"S"},null,{"$f":"IF(F156/2>F159,\"S\",\"SS\")","v":"S"},"S","S","S"]
[null,"Cv",null,{"$f":"[3]!Cv_Simple(D157,D156,D159/1000,D158,D155,D162)","v":0},{"$f":"[3]!Cv_Simple(E157,E156,E159/1000,E158,E155,E162)","v":0},{"$f":"[3]!Cv_Simple(F157,F156,F159/1000,F158,F155,F162)","v":0.9856751728538502},{"$f":"[3]!Cv_Simple(G157,G156,G159/1000,G158,G155,G162)","v":4.195501179914138},{"$f":"[3]!Cv_Simple(H157,H156,H159/1000,H158,H155,H162)","v":0.83364830905772291},{"$f":"[3]!Cv_Simple(I157,I156,I159/1000,I158,I155,I162)","v":3.0489927793301312}]
[null,"Trim",null,{"$f":"IF(D163=0,0,[3]!Trim_From_Cv(D163/D160,D161))","v":0},null,{"$f":"IF(F163=0,0,[3]!Trim_From_Cv(F163/F160,F161))","v":0.22483288667510484},{"$f":"IF(G163=0,0,[3]!Trim_From_Cv(G163/G160,G161))","v":0.53935790160748409},{"$f":"IF(H163=0,0,[3]!Trim_From_Cv(H163/H160,H161))","v":0.18845741462533647},{"$f":"IF(I163=0,0,[3]!Trim_From_Cv(I163/I160,I161))","v":0.47004417575684854}]
[null,"Tout",null,{"$f":"[3]!T_P_H_(11,D83,[3]!h_(11,D156,D157))","v":99.108406127680922},null,{"$f":"[3]!T_P_H_(11,F83,[3]!h_(11,F156,F157))","v":99.108406127680922},{"$f":"[3]!T_P_H_(11,G83,[3]!h_(11,G156,G157))","v":99.108406127680922},{"$f":"[3]!T_P_H_(11,H83,[3]!h_(11,H156,H157))","v":99.108406127680922},{"$f":"[3]!T_P_H_(11,I83,[3]!h_(11,I156,I157))","v":99.108406127680922}]
[null,"delta T",null,{"$f":"D165-D83","v":69.108406127680922},null,{"$f":"F165-F83","v":69.108406127680922},{"$f":"G165-G83","v":69.108406127680922},{"$f":"H165-H83","v":69.108406127680922},{"$f":"I165-I83","v":69.108406127680922}]
[null,"CV335"]
[null,"Pin","Bara",{"$f":"D79","v":13.15},null,{"$f":"F79","v":13.15},13.25,13.5,12.25]
[null,"Tin","K",{"$f":"D80","v":7.2906635679049048},null,9.1661496679837366,8.6223146254179426,8.8279999999999994,10.795640526772669]
[null,"Rho",null,{"$f":"[3]!rho_(11,D168,D169)","v":122.33933382974966},null,{"$f":"[3]!rho_(11,F168,F169)","v":92.385436868539188},{"$f":"[3]!rho_(11,G168,G169)","v":101.58811590421918},{"$f":"[3]!rho_(11,H168,H169)","v":99.5385923004863},{"$f":"[3]!rho_(11,I168,I169)","v":66.476961067945879}]
[null,"dP",null,{"$f":"(D168-D94)*1000","v":8270},null,{"$f":"(F168-F94)*1000","v":8270},{"$f":"(G168-G94)*1000","v":8070},{"$f":"(H168-H94)*1000","v":8620.0000000000018},{"$f":"(I168-I94)*1000","v":7070}]
[null,"Cvs",null,5,null,{"$f":"$D$172","v":5},{"$f":"$D$172","v":5},5,5]
[null,"Range",null,250,null,{"$f":"$D$173","v":250},{"$f":"$D$173","v":250},250,250]
[null,"Flow",null,{"$f":"IF(D168/2>D94,\"S\",\"SS\")","v":"S"},null,{"$f":"IF(F168/2>F94,\"S\",\"SS\")","v":"S"},{"$f":"IF(G168/2>G94,\"S\",\"SS\")","v":"S"},{"$f":"IF(H168/2>H94,\"S\",\"SS\")","v":"S"},{"$f":"IF(I168/2>I94,\"S\",\"SS\")","v":"S"}]
[null,"Cv",null,{"$f":"[3]!Cv_Simple(D169,D168,D171/1000,D170,D91,D174)","v":2.1150953834914854},null,{"$f":"[3]!Cv_Simple(F169,F168,F171/1000,F170,F91,F174)","v":2.1716350761126866},{"$f":"[3]!Cv_Simple(G169,G168,G171/1000,G170,G91,G174)","v":1.2515830041285052},{"$f":"[3]!Cv_Simple(H169,H168,H171/1000,H170,H91,H174)","v":2.1033203592037024},{"$f":"[3]!Cv_Simple(I169,I168,I171/1000,I170,I91,I174)","v":1.9817782666185491}]
[null,"Trim",null,{"$f":"[3]!Trim_From_Cv(D175/D172,D173)","v":0.84418290463815637},null,{"$f":"[3]!Trim_From_Cv(F175/F172,F173)","v":0.84896070990564998},{"$f":"[3]!Trim_From_Cv(G175/G172,G173)","v":0.7491553812237024},{"$f":"[3]!Trim_From_Cv(H175/H172,H173)","v":0.84317181524680918},{"$f":"[3]!Trim_From_Cv(I175/I172,I173)","v":0.83239157713795398}]
[null,"Tout",null,{"$f":"[3]!T_P_H_(11,D94,[3]!h_(11,D168,D169))","v":6.5080687114154943},null,{"$f":"[3]!T_P_H_(11,F94,[3]!h_(11,F168,F169))","v":7.630998961978265},{"$f":"[3]!T_P_H_(11,G94,[3]!h_(11,G168,G169))","v":7.3219643390544888},{"$f":"[3]!T_P_H_(11,H94,[3]!h_(11,H168,H169))","v":7.3519064983716929},{"$f":"[3]!T_P_H_(11,I94,[3]!h_(11,I168,I169))","v":9.4038371934393972}]
[null,"delta T",null,{"$f":"D177-D94","v":1.6280687114154944},null,{"$f":"F177-F94","v":2.7509989619782651},{"$f":"G177-G94","v":2.1419643390544891},{"$f":"H177-H94","v":2.471906498371693},{"$f":"I177-I94","v":4.2238371934393975}]
[]
[]
[]
[]
[]
[null,"Courbe de rendement TC3"]
[]
[]
[]
[null,null,null,null,"d : mm"]
[null,null,null,null,"N : Hz"]
[null,null,null,null,"H : J/kG"]
[]
[]
[]
[]
[]
[null,"rendement=(0,321*rap^4 - 1,6098*rap^3 + 1,316*rap^2 + 0,9448*rap)*(ETAgar/0,97)",null,null,null,null,null,null,"U1/CO _nom",0.64]
[null,null,null,null,null,null,null,null,"Eta_gar",0.8]
[null,null,"T1","T2","T3"]
[null,"U1/C0",{"$f":"D17","v":0.752},{"$f":"D52","v":0.74},{"$f":"D96","v":0.72}]
[null,0,{"$f":"(0.321*B200^4-1.6098*B200^3+1.316*B200^2+0.9448*B200)*$D$17/0.97215493","v":0}]
[null,{"$f":"B200+0.05","v":0.05},{"$f":"(0.321*$B201^4-1.6098*$B201^3+1.316*$B201^2+0.9448*$B201)*$C$199/0.97215493","v":3.8932835016328111E-2},{"$f":"(0.321*$B201^4-1.6098*$B201^3+1.316*$B201^2+0.9448*$B201)*$D$199/0.97215493","v":3.8311566372450534E-2},{"$f":"(0.321*$B201^4-1.6098*$B201^3+1.316*$B201^2+0.9448*$B201)*$E$199/0.97215493","v":3.7276118632654578E-2}]
[null,0.1,{"$f":"(0.321*$B202^4-1.6098*$B202^3+1.316*$B202^2+0.9448*$B202)*$C$199/0.97215493","v":8.2043352493208072E-2},{"$f":"(0.321*$B202^4-1.6098*$B202^3+1.316*$B202^2+0.9448*$B202)*$D$199/0.97215493","v":8.0734150059805804E-2},{"$f":"(0.321*$B202^4-1.6098*$B202^3+1.316*$B202^2+0.9448*$B202)*$E$199/0.97215493","v":7.8552146004135376E-2}]
[null,0.15000000000000002,0.12845348868415452,0.12640369897110948,0.12298738278270113]
[null,0.2,0.17732242575779567,0.17449281258080954,0.16977679061916603]
[null,0.25,0.22784659179787323,0.22421074192875823,0.21815099214689987]
[null,0.3,0.27925966080324255,0.27480338962021211,0.26737627098182798]
[null,0.35,0.33083255268787248,0.32555330982583192,0.3167545717224311]
[null,0.39999999999999997,0.38187343328084544,0.37577970828168306,0.36562349994974563]
[null,0.44999999999999996,0.43172771432635737,0.42483844228923467,0.41335632222736346]
[null,0.49999999999999994,0.47977805348371788,0.47212202071536069,0.45936196610143198]
[null,0.54999999999999993,0.52544435432734982,0.51705960399233897,0.50308502010065403]
[null,0.6,0.56818376634679002,0.55911700411785181,0.54400573373628835]
[null,0.65,0.60749068494668856,0.59779668465498603,0.58164001750214867]
[null,0.70000000000000007,0.64289675144680913,0.63263776073223243,0.61553944287460449]
[null,0.75000000000000011,0.67397085308202898,0.66321599904348605,0.64529124231258095]
[null,0.80000000000000016,0.70031912300233901,0.68914381784804635,0.67051830925755851]
[null,0.8500000000000002,0.72158494027284314,0.71007028697061692,0.69087919813357312]
[null,0.90000000000000024,0.7374489298737601,0.72568112780130645,0.70606812434721711]
[null,0.95000000000000029,0.74762896270042078,0.73569871329562686,0.71581496428763691]
[null,1.0000000000000002,0.75188015556327048,0.73988206797449485,0.71988525532653547]
[null,1.0500000000000003,0.74999487118786723,0.738026867924231,0.71808019581817073]
[null,1.1000000000000003,0.74180271821488386,0.72996544079656112,0.7102366450993568]
[null,1.1500000000000004,0.72717055120010587,0.71556676580861478,0.69622712348946292]
[null,1.2000000000000004,0.70600247061443167,0.69473647374292469,0.67595981229041324]
[null,1.2500000000000004,0.67823982284387541,0.66741684694743053,0.64937855378668918]
[null,1.3000000000000005,0.64386120018956239,0.63358681933547367,0.61646285124532574]
[null,1.3500000000000005,0.60288244086773268,0.5932619763858008,0.57722786891591438]
[null,1.4000000000000006,0.55535662900974014,0.54649455514256351,0.53172443203060227]
[null,1.4500000000000006,0.5013740946620513,0.49337344421531643,0.48003902680409161]
[null,1.5000000000000007,0.44106241378624694,0.43402418377901952,0.42229380043364062]
[]
[]
[]
[]
[]
[null,null,"F Let u be the peripheral speed of the wheel : u = p . Æ . N / 60                      (in m/s)"]
[null,null,"F Let n, be the speed ratio of the turbine : n =  u / [ 2 . (H1 - H2S ) ] 0.5       (dimensionless number)"]
[null,null,null,"N = speed of rotation of the turbine (in rpm)"]
[null,null,null,"Æ = diameter of the wheel of the turbine (in m)"]

{"sheet":"Turbines_JT60SA_serial_indep","index":4,"n_rows":168,"n_cols":40,"rows_kept":168,"cut":false,"hidden":false,"merged":[]}
[]
[]
[]
[]
[null,null,null,null,"Vitesse de la roue ajustée en fonction de la puissance du frein",null,null,null,null,null,null,{"$f":"D65*0.3","v":448.8}]
[]
[1,2,3,4,5,6,7,8,9,10,11,12,13,14,15,16,17,18,19,20,21,22,23,24,25,26,27,28,29,30,31,32,33]
[null,"Relation entre la puissance et la vitesse de rotation",null,null,null,null,null,null,null,null,null,null,"²"]
[]
[null,"Cvs",null,30,null,null,null,30]
[null,"Range",null,100,null,null,null,100]
[null,"Trim",null,0.85,null,null,null,0.85]
[null,"Cv",null,{"$f":"[3]!Cv_From_Trim(D12,D11)*D10","v":15.035617008818171},null,null,null,{"$f":"[3]!Cv_From_Trim(H12,H11)*H10","v":15.035617008818171}]
[null,"Pin","Bara",15,null,null,null,15]
[null,"Tin","K",40.03,null,null,null,{"$f":"H25","v":80}]
[null,"Rho",null,{"$f":"[3]!rho_(11,D14,D15)","v":17.343206998481495},null,null,null,{"$f":"[3]!rho_(11,H14,H15)","v":8.7915125131395992}]
[null,"Flow",null,{"$f":"IF(D14/2>D24,\"S\",\"SS\")","v":"SS"},null,null,null,{"$f":"IF(H14/2>H24,\"S\",\"SS\")","v":"SS"}]
[null,"m","g/s",{"$f":"[3]!q_gs(D15,D14,(D14-D24),D16,D13,D17)","v":226.408332585029},null,null,null,{"$f":"[3]!q_gs(H15,H14,(H14-H24),H16,H13,H17)","v":425.36172656610597}]
[null,"TURBINE 1"]
[null,null,null,null,null,null,null,null,null,"14D",null,"16D"]
[null,null,null,"DESIGN",null,null,null,"start-up","start-up","start-up","start-up","start-up","start-up","start-up","start-up","start-up","start-up"]
[]
[null,"m","g/s",191.5,null,null,null,{"$f":"H36*H24/H25^0.5","v":121.14774580935705},{"$f":"I36*I24/I25^0.5","v":124.93288956269798},129.10843114579296,133.74447705736691,138.92974008026607,144.77832678322761,151.43980098058483,159.11456287372152,168.07821538675529,178.72186710127596,180.19645469476148,181.70730898474733,183.25589672021511,184.84376779206568,186.47256219946212,188.14401608452761,189.85996989060956,191.62237539377983]
[null,"Pin","Bara",14.77,null,null,null,13.209283254142326,13.277077886829094,13.354873357543404,13.444641778640207,13.548902955995459,13.670931281784394,13.815066051507143,13.987191593863363,14.195508982033729,14.45183362137676,14.488045211140022,14.525314566755531,14.563687283349964,14.603211648231571,14.643938912205156,14.685923461388454,14.729223128888107,14.773899387833017]
[null,"Tin","K",40.03,null,null,null,80,{"$f":"H25-4","v":76},{"$f":"I25-4","v":72},68,64,60,56,52,48,44,{"$f":"Q25-0.5","v":43.5},{"$f":"R25-0.5","v":43},42.5,42,41.5,41,40.5,40]
[null,"Pout","Bara",6.36,null,null,null,6.36,6.36,6.36,6.36,6.36,6.36,6.36,6.36,6.36,6.36,6.36,6.36,6.36,6.36,6.36,6.36,6.36,6.36]
[null,"Tout","K",{"$f":"[3]!T2_turb(11,D24,D25,D26,D28)","v":31.094586910112792},null,null,null,{"$f":"[3]!T2_turb(11,H24,H25,H26,H28)","v":65.881348421070356},{"$f":"[3]!T2_turb(11,I24,I25,I26,I28)","v":62.316554520395343},{"$f":"[3]!T2_turb(11,J24,J25,J26,J28)","v":58.766296121466468},{"$f":"[3]!T2_turb(11,K24,K25,K26,K28)","v":55.231789116787439},{"$f":"[3]!T2_turb(11,L24,L25,L26,L28)","v":51.714400802266283},{"$f":"[3]!T2_turb(11,M24,M25,M26,M28)","v":48.215671155847232},{"$f":"[3]!T2_turb(11,N24,N25,N26,N28)","v":44.737334697621932},{"$f":"[3]!T2_turb(11,O24,O25,O26,O28)","v":41.281340099548856},{"$f":"[3]!T2_turb(11,P24,P25,P26,P28)","v":37.849860435024453},{"$f":"[3]!T2_turb(11,Q24,Q25,Q26,Q28)","v":34.445278366890321},{"$f":"[3]!T2_turb(11,R24,R25,R26,R28)","v":34.021721766077569},{"$f":"[3]!T2_turb(11,S24,S25,S26,S28)","v":33.598629817061841},{"$f":"[3]!T2_turb(11,T24,T25,T26,T28)","v":33.176007484815038},{"$f":"[3]!T2_turb(11,U24,U25,U26,U28)","v":32.753859722802979},{"$f":"[3]!T2_turb(11,V24,V25,V26,V28)","v":32.332191423178664},{"$f":"[3]!T2_turb(11,W24,W25,W26,W28)","v":31.911007439469916},{"$f":"[3]!T2_turb(11,X24,X25,X26,X28)","v":31.490312535614741},{"$f":"[3]!T2_turb(11,Y24,Y25,Y26,Y28)","v":31.070111420287635}]
[null,"Efficacity","%",0.78,null,null,null,{"$f":"(0.321*H50^4-1.6098*H50^3+1.316*H50^2+0.9448*H50)*($D$28/0.97215493)","v":0.70166034037455327},{"$f":"(0.321*I50^4-1.6098*I50^3+1.316*I50^2+0.9448*I50)*($D$28/0.97215493)","v":0.71135591790105379},0.72106222637635264,0.73069985263187465,0.74016148023392914,0.74930178239287615,0.75792295269373933,0.76575354886662028,0.77241674695012208,0.77738118049100791,0.77784748055795716,0.7782739232778525,0.77865860325771141,0.77899951849782523,0.7792945641904756,0.77954152639542806,0.77973807491453584,0.77988175586902886]
[null,"Power","W",{"$f":"+D23*(D40-D41)","v":9122.4436160855366},null,null,null,{"$f":"+H23*(H40-H41)","v":9122.4436130375598},9122.4436270382776,9122.4436214964626,9122.4436064338188,9122.4436137465527,9122.4436123664927,9122.4436137505872,9122.4436235155317,9122.4436090208146,9122.4436137705834,9122.4436146988628,9122.4436153828865,9122.4436250904873,9122.4436195990129,9122.4436170467779,9122.4436053969876,9122.4436154449395,9122.4436161143294]
[null,"Speed","Hz",1995,null,null,null,1995,1995,1995,1995,1995,1995,1995,1995,1995,1995,1995,1995,1995,1995,1995,1995,1995,1995]
[null,"Speed calculated from P=K.rho.N^3",null,null,null,null,null,{"$f":"(H29/$D29*$D33/H33)^(1/3)*$D30","v":1994.9999997778114},{"$f":"(I29/$D29*$D33/I33)^(1/3)*$D30","v":1995.0000007984236},1995.0000003944408,1994.9999992964174,1994.9999998294948,1994.9999997288921,1994.999999829789,1995.0000005416255,1994.9999994850023,1994.9999998312464,1994.9999998989156,1994.9999999487789,1995.0000006564351,1995.0000002561226,1995.0000000700718,1994.9999992208354,1994.9999999533022,1995.0000000020989]
[null,"Delta Speed Frein & Turbine",null,{"$f":"D26-D33","v":1.1600000000000001},null,null,null,{"$f":"H30-H31","v":2.221886461484246E-7},{"$f":"I30-I31","v":-7.9842357081361115E-7},-3.9444080357498024E-7,7.0358260018110741E-7,1.7050524547812529E-7,2.7110786504636053E-7,1.7021102394210175E-7,-5.4162546803127043E-7,5.1499773690011352E-7,1.6875355868251063E-7,1.0108442438649945E-7,5.1221149988123216E-8,-6.5643507696222514E-7,-2.5612257559259888E-7,-7.0071791924419813E-8,7.7916456575621851E-7,4.6697778088855557E-8,-2.0988863980164751E-9]
[null,"Brake Pressure",null,5.2,null,null,null,{"$f":"($D33-$D26)+H26","v":5.2},{"$f":"($D33-$D26)+I26","v":5.2},5.2,5.2,5.2,5.2,5.2,5.2,5.2,5.2,5.2,5.2,5.2,5.2,5.2,5.2,5.2,5.2]
[null,"Rho (brake)",null,{"$f":"[3]!rho_(11,D33,330)","v":0.75697464940773784},null,null,null,{"$f":"[3]!rho_(11,H33,330)","v":0.75697464940773784},{"$f":"[3]!rho_(11,I33,330)","v":0.75697464940773784},{"$f":"[3]!rho_(11,J33,330)","v":0.75697464940773784},{"$f":"[3]!rho_(11,K33,330)","v":0.75697464940773784},{"$f":"[3]!rho_(11,L33,330)","v":0.75697464940773784},{"$f":"[3]!rho_(11,M33,330)","v":0.75697464940773784},{"$f":"[3]!rho_(11,N33,330)","v":0.75697464940773784},{"$f":"[3]!rho_(11,O33,330)","v":0.75697464940773784},{"$f":"[3]!rho_(11,P33,330)","v":0.75697464940773784},{"$f":"[3]!rho_(11,Q33,330)","v":0.75697464940773784},{"$f":"[3]!rho_(11,R33,330)","v":0.75697464940773784},{"$f":"[3]!rho_(11,S33,330)","v":0.75697464940773784},{"$f":"[3]!rho_(11,T33,330)","v":0.75697464940773784},{"$f":"[3]!rho_(11,U33,330)","v":0.75697464940773784},{"$f":"[3]!rho_(11,V33,330)","v":0.75697464940773784},{"$f":"[3]!rho_(11,W33,330)","v":0.75697464940773784},{"$f":"[3]!rho_(11,X33,330)","v":0.75697464940773784},{"$f":"[3]!rho_(11,Y33,330)","v":0.75697464940773784}]
[null,"Wheel","mm",35.799999999999997,null,null,null,{"$f":"$D$35","v":35.799999999999997},{"$f":"$D$35","v":35.799999999999997},35.799999999999997,35.799999999999997,35.799999999999997,35.799999999999997,35.799999999999997,35.799999999999997,35.799999999999997,35.799999999999997,35.799999999999997,35.799999999999997,35.799999999999997,35.799999999999997,35.799999999999997,35.799999999999997,35.799999999999997,35.799999999999997]
[null,"a = mÖT/P",null,{"$f":"D23*D25^0.5/D24","v":82.031580287488268},null,null,null,{"$f":"+$D$36","v":82.031580287488268},{"$f":"+$D$36","v":82.031580287488268},82.031580287488268,82.031580287488268,82.031580287488268,82.031580287488268,82.031580287488268,82.031580287488268,82.031580287488268,82.031580287488268,82.031580287488268,82.031580287488268,82.031580287488268,82.031580287488268,82.031580287488268,82.031580287488268,82.031580287488268,82.031580287488268,null,null,null,null,null,null,null,null,null,null,null,"T1 out",63,31,"x"]
[null,"Rho (in)","kg/m3",{"$f":"[3]!rho_(11,D24,D25)","v":17.087672541642732},null,null,null,{"$f":"[3]!rho_(11,H24,H25)","v":7.7660605505880893},{"$f":"[3]!rho_(11,I24,I25)","v":8.2075576819028555},{"$f":"[3]!rho_(11,J24,J25)","v":8.7037416911757592},{"$f":"[3]!rho_(11,K24,K25)","v":9.2655120522802115},{"$f":"[3]!rho_(11,L24,L25)","v":9.9068856609552576},{"$f":"[3]!rho_(11,M24,M25)","v":10.64620464678436},{"$f":"[3]!rho_(11,N24,N25)","v":11.507957758641105},{"$f":"[3]!rho_(11,O24,O25)","v":12.525615689066411},{"$f":"[3]!rho_(11,P24,P25)","v":13.746213503316968},{"$f":"[3]!rho_(11,Q24,Q25)","v":15.238095294709865},{"$f":"[3]!rho_(11,R24,R25)","v":15.44828605587977},{"$f":"[3]!rho_(11,S24,S25)","v":15.664510012945385},{"$f":"[3]!rho_(11,T24,T25)","v":15.887034489134546},{"$f":"[3]!rho_(11,U24,U25)","v":16.11614302351413},{"$f":"[3]!rho_(11,V24,V25)","v":16.352136702506165},{"$f":"[3]!rho_(11,W24,W25)","v":16.595335487574189},{"$f":"[3]!rho_(11,X24,X25)","v":16.846079803228697},{"$f":"[3]!rho_(11,Y24,Y25)","v":17.104732121090368},null,null,null,null,null,null,null,null,null,null,null,"T2 in",62,18,"y"]
[null,"Sound Speed @inlet",null,{"$f":"[3]!Sound_speed(11,D24,D25)","v":391.2334216977045},null,null,null,{"$f":"[3]!Sound_speed(11,H24,H25)","v":538.91476166545908},{"$f":"[3]!Sound_speed(11,I24,I25)","v":525.99135492327571},{"$f":"[3]!Sound_speed(11,J24,J25)","v":512.74533842609276},{"$f":"[3]!Sound_speed(11,K24,K25)","v":499.15108626106354},{"$f":"[3]!Sound_speed(11,L24,L25)","v":485.17936569915167},{"$f":"[3]!Sound_speed(11,M24,M25)","v":470.79659847734735},{"$f":"[3]!Sound_speed(11,N24,N25)","v":455.96393644824406},{"$f":"[3]!Sound_speed(11,O24,O25)","v":440.63611492300868},{"$f":"[3]!Sound_speed(11,P24,P25)","v":424.76007465614606},{"$f":"[3]!Sound_speed(11,Q24,Q25)","v":408.27345515050234},{"$f":"[3]!Sound_speed(11,R24,R25)","v":406.16618602069235},{"$f":"[3]!Sound_speed(11,S24,S25)","v":404.04809803814084},{"$f":"[3]!Sound_speed(11,T24,T25)","v":401.91903461254844},{"$f":"[3]!Sound_speed(11,U24,U25)","v":399.77883673080578},{"$f":"[3]!Sound_speed(11,V24,V25)","v":397.6273431650103},{"$f":"[3]!Sound_speed(11,W24,W25)","v":395.46439056330075},{"$f":"[3]!Sound_speed(11,X24,X25)","v":393.28981373303316},{"$f":"[3]!Sound_speed(11,Y24,Y25)","v":391.1034457875478},null,null,null,null,null,null,null,null,null,null,null,"slope",{"$f":"SLOPE(AL37:AM37,AL36:AM36)","v":1.375}]
[null,"S=Q/(rho*V) = cte",null,{"$f":"D23/(D37*D38)","v":2.8645071953707371E-2},null,null,null,{"$f":"H23/(H37*H38)","v":2.8946395095487482E-2},{"$f":"I23/(I37*I38)","v":2.8939047657983816E-2},2.892989714152313E-2,2.8918410021926164E-2,2.8903853687997205E-2,2.8885203171005156E-2,2.8860993483110303E-2,2.8829078323658098E-2,2.8786220964274054E-2,2.8727369700344441E-2,2.8718527913202244E-2,2.8709294166507082E-2,2.8699646345988428E-2,2.8689560785657105E-2,2.8679012134719479E-2,2.8667973213167133E-2,2.8656414850422127E-2,2.864430570994626E-2,null,null,null,null,null,null,null,null,null,null,null,"intercept",{"$f":"INTERCEPT(AL37:AM37,AL36:AM36)","v":-24.625}]
[null,"Hin",null,{"$f":"[3]!h_(11,D24,D25)","v":223.57106614117126},null,null,null,{"$f":"[3]!h_(11,H24,H25)","v":434.00743838312928},{"$f":"[3]!h_(11,I24,I25)","v":413.11850195273422},{"$f":"[3]!h_(11,J24,J25)","v":392.21103602348046},{"$f":"[3]!h_(11,K24,K25)","v":371.28111541481854},{"$f":"[3]!h_(11,L24,L25)","v":350.32369391769879},{"$f":"[3]!h_(11,M24,M25)","v":329.33218502048032},{"$f":"[3]!h_(11,N24,N25)","v":308.29784166725983},{"$f":"[3]!h_(11,O24,O25)","v":287.20881307640343},{"$f":"[3]!h_(11,P24,P25)","v":266.0486638443316},{"$f":"[3]!h_(11,Q24,Q25)","v":244.7939589768576},{"$f":"[3]!h_(11,R24,R25)","v":242.12891297633288},{"$f":"[3]!h_(11,S24,S25)","v":239.46178924162191},{"$f":"[3]!h_(11,T24,T25)","v":236.79250010933401},{"$f":"[3]!h_(11,U24,U25)","v":234.12095301789108},{"$f":"[3]!h_(11,V24,V25)","v":231.44705016565564},{"$f":"[3]!h_(11,W24,W25)","v":228.77068813100311},{"$f":"[3]!h_(11,X24,X25)","v":226.09175746680597},{"$f":"[3]!h_(11,Y24,Y25)","v":223.41014225053877},null,null,null,null,null,null,null,null,null,null,null,"x","y"]
[null,"Hout",null,{"$f":"[3]!h_(11,D26,D27)","v":175.9342848561293},null,null,null,{"$f":"[3]!h_(11,H26,H27)","v":358.70728688552731},{"$f":"[3]!h_(11,I26,I27)","v":340.09975037363023},{"$f":"[3]!h_(11,J26,J27)","v":321.55380984128686},{"$f":"[3]!h_(11,K26,K27)","v":303.0731130573011},{"$f":"[3]!h_(11,L26,L27)","v":284.66141305201734},{"$f":"[3]!h_(11,M26,M27)","v":266.32245272798559},{"$f":"[3]!h_(11,N26,N27)","v":248.0597566018937},{"$f":"[3]!h_(11,O26,O27)","v":229.87626312775166},{"$f":"[3]!h_(11,P26,P27)","v":211.77367295375322},{"$f":"[3]!h_(11,Q26,Q27)","v":193.75127594243526},{"$f":"[3]!h_(11,R26,R27)","v":191.50392354381847},{"$f":"[3]!h_(11,S26,S27)","v":189.25773489536206},{"$f":"[3]!h_(11,T26,T27)","v":187.01269062785181},{"$f":"[3]!h_(11,U26,U27)","v":184.7687691246206},{"$f":"[3]!h_(11,V26,V27)","v":182.52594611985575},{"$f":"[3]!h_(11,W26,W27)","v":180.28419467112852},{"$f":"[3]!h_(11,X26,X27)","v":178.04348472821363},{"$f":"[3]!h_(11,Y26,Y27)","v":175.80378314259062},null,null,null,null,null,null,null,null,null,null,null,277,{"$f":"m*AK41+p","v":356.25}]
[null,"Sin = Sout",null,{"$f":"[3]!S_(11,D24,D25)","v":15.488244062210457},null,null,null,{"$f":"[3]!S_(11,H24,H25)","v":19.378618657952245},{"$f":"[3]!S_(11,I24,I25)","v":19.09986189374176},{"$f":"[3]!S_(11,J24,J25)","v":18.804815565743773},{"$f":"[3]!S_(11,K24,K25)","v":18.491447397697637},{"$f":"[3]!S_(11,L24,L25)","v":18.157315176305566},{"$f":"[3]!S_(11,M24,M25)","v":17.799446793484467},{"$f":"[3]!S_(11,N24,N25)","v":17.414172100675714},{"$f":"[3]!S_(11,O24,O25)","v":16.996880937534449},{"$f":"[3]!S_(11,P24,P25)","v":16.541663796875227},{"$f":"[3]!S_(11,Q24,Q25)","v":16.040757786393321},{"$f":"[3]!S_(11,R24,R25)","v":15.97444699241386},{"$f":"[3]!S_(11,S24,S25)","v":15.907239105754762},{"$f":"[3]!S_(11,T24,T25)","v":15.83910880646941},{"$f":"[3]!S_(11,U24,U25)","v":15.770029657325903},{"$f":"[3]!S_(11,V24,V25)","v":15.699974025839996},{"$f":"[3]!S_(11,W24,W25)","v":15.628913018332181},{"$f":"[3]!S_(11,X24,X25)","v":15.556816390768134},{"$f":"[3]!S_(11,Y24,Y25)","v":15.48365247389737},null,null,null,null,null,null,null,null,null,null,null,31,{"$f":"m*AK42+p","v":18}]
[null,"Tout(iso)",null,{"$f":"[1]!HeCalc(2,0,1,D26*10^5,8,D42*1000,1)","v":28.580768861485691},null,null,null,{"$f":"[1]!HeCalc(2,0,1,H26*10^5,8,H42*1000,1)","v":59.749282015881604},{"$f":"[1]!HeCalc(2,0,1,I26*10^5,8,I42*1000,1)","v":56.646275328492493},{"$f":"[1]!HeCalc(2,0,1,J26*10^5,8,J42*1000,1)","v":53.540052827957339},{"$f":"[1]!HeCalc(2,0,1,K26*10^5,8,K42*1000,1)","v":50.430519641718654},{"$f":"[1]!HeCalc(2,0,1,L26*10^5,8,L42*1000,1)","v":47.317566981487801},{"$f":"[1]!HeCalc(2,0,1,M26*10^5,8,M42*1000,1)","v":44.201064034154754},{"$f":"[1]!HeCalc(2,0,1,N26*10^5,8,N42*1000,1)","v":41.080844072306064},{"$f":"[1]!HeCalc(2,0,1,O26*10^5,8,O42*1000,1)","v":37.956681121160315},{"$f":"[1]!HeCalc(2,0,1,P26*10^5,8,P42*1000,1)","v":34.828249533856798},{"$f":"[1]!HeCalc(2,0,1,Q26*10^5,8,Q42*1000,1)","v":31.695052434830323},{"$f":"[1]!HeCalc(2,0,1,R26*10^5,8,R42*1000,1)","v":31.303032583935167},{"$f":"[1]!HeCalc(2,0,1,S26*10^5,8,S42*1000,1)","v":30.910924475011289},{"$f":"[1]!HeCalc(2,0,1,T26*10^5,8,T42*1000,1)","v":30.518725971647559},{"$f":"[1]!HeCalc(2,0,1,U26*10^5,8,U42*1000,1)","v":30.126434815805911},{"$f":"[1]!HeCalc(2,0,1,V26*10^5,8,V42*1000,1)","v":29.734048565114612},{"$f":"[1]!HeCalc(2,0,1,W26*10^5,8,W42*1000,1)","v":29.341564629498517},{"$f":"[1]!HeCalc(2,0,1,X26*10^5,8,X42*1000,1)","v":28.948980209913184},{"$f":"[1]!HeCalc(2,0,1,Y26*10^5,8,Y42*1000,1)","v":28.556292351579447},null,null,null,null,null,null,null,null,null,null,null,31,{"$f":"m*AK43+p","v":18}]
[null,"Hout(iso)",null,{"$f":"[3]!h_(11,D26,D43)","v":162.49826962188638},null,null,null,{"$f":"[3]!h_(11,H26,H43)","v":326.69034040178116},{"$f":"[3]!h_(11,I26,I43)","v":310.47121985159532},{"$f":"[3]!h_(11,J26,J43)","v":294.22056641134083},{"$f":"[3]!h_(11,K26,K43)","v":277.93498688907408},{"$f":"[3]!h_(11,L26,L43)","v":261.61024067918538},{"$f":"[3]!h_(11,M26,M43)","v":245.24092329776713},{"$f":"[3]!h_(11,N26,N43)","v":228.81999388435048},{"$f":"[3]!h_(11,O26,O43)","v":212.33805337374349},{"$f":"[3]!h_(11,P26,P43)","v":195.78220327769773},{"$f":"[3]!h_(11,Q26,Q43)","v":179.13417158377612},{"$f":"[3]!h_(11,R26,R43)","v":177.04547348739771},{"$f":"[3]!h_(11,S26,S43)","v":174.95486842020244},{"$f":"[3]!h_(11,T26,T43)","v":172.86228823828279},{"$f":"[3]!h_(11,U26,U43)","v":170.76766110772618},{"$f":"[3]!h_(11,V26,V43)","v":168.67091095747458},{"$f":"[3]!h_(11,W26,W43)","v":166.57195744365336},{"$f":"[3]!h_(11,X26,X43)","v":164.4707153702546},{"$f":"[3]!h_(11,Y26,Y43)","v":162.36709469918239}]
[null,"ΔHs",null,{"$f":"D40-D44","v":61.072796519284879},null,null,null,107.31709798134813,102.6472821011389,97.990469612139634,93.346128525744462,88.713453238513409,84.091261722713199,79.47784778290935,74.870759702659939,70.266460566633867,65.659787393081473,65.08343948893517,64.50692082141947,63.930211871051227,63.353291910164899,62.776139208181064,62.198730687349752,61.621042096551378,61.043047551356381]
[null,"u1","m/s",{"$f":"(2*52.7%*D45*1000*D28)^0.5","v":224.07402231056255},null,null,null,{"$f":"PI()*$D$47*H30","v":224.07402231056253},{"$f":"PI()*$D$47*I30","v":224.07402231056253},224.07402231056253,224.07402231056253,224.07402231056253,224.07402231056253,224.07402231056253,224.07402231056253,224.07402231056253,224.07402231056253,224.07402231056253,224.07402231056253,224.07402231056253,224.07402231056253,224.07402231056253,224.07402231056253,224.07402231056253,224.07402231056253]
[null,"D1",null,{"$f":"D46/PI()/D30","v":3.5751867939057311E-2}]
[null,"Co = (2*ΔHs)^0,5",null,{"$f":"(2000*D45)^0.5","v":349.49333761685608},null,null,null,463.28630021045979,453.09443188178534,442.69734494830584,432.07899399471955,421.22073367419466,410.10062599979824,398.69248245460898,386.96449372690495,374.87720807388081,362.38042826036138,360.7864728310505,359.18496856472007,357.57575944420847,355.95868274327825,354.33356941780454,352.70024294675432,351.05851961332991,349.4082069767577]
[null,"u1/Co",null,{"$f":"D46/D48","v":0.64113961038138956},null,null,null,0.48366209449485364,0.49454154927470967,0.50615623713923075,0.51859503800201157,0.53196342059429358,0.54638790605180099,0.56202219046373236,0.57905576853441187,0.59772644878000158,0.6183391950449677,0.62107101896664563,0.6238401991206588,0.62664768623814993,0.62949446993028524,0.63238157953459562,0.63531008779143383,0.63828111209882255,0.64129581914905542]
[null,"U1/C0 off de / U1/C0 nom",null,{"$f":"D49/$D$49","v":1},null,null,null,{"$f":"H49/$D49","v":0.75437874475910394},{"$f":"I49/$D49","v":0.77134767727192166},0.78946336951188789,0.80886444949723058,0.82971541920151959,0.85221361651134864,0.87659876470493958,0.90316642297292105,0.93228750665465332,0.96443767477904108,0.96869856254427034,0.97301771567281581,0.97739661704161607,0.98183681016966484,0.9863399005380683,0.9909075613242988,0.99554153535941015,1.0002436423598489]
[null,"Rdt",null,{"$f":"(0.321*D50^4-1.6098*D50^3+1.316*D50^2+0.9448*D50)*($D28/0.97215493)","v":0.77987569327041328},null,null,null,{"$f":"(0.321*H50^4-1.6098*H50^3+1.316*H50^2+0.9448*H50)*($D28/0.97)","v":0.7032191330727835},0.7129362500744173,0.7226641218644817,0.73232315885190769,0.74180580619124925,0.75096641423816679,0.75960673713543869,0.76745472958317607,0.77413273047641618,0.77910819289026101,0.77957552887886317,0.78000291897423302,0.78038845355041053,0.78073012616008974,0.78102582731955905,0.78127333817014488,0.78147032333698496,0.78161432348982762]
[]
[]
[null,"TURBINE 2"]
[null,null,null,null,null,null,null,5]
[null,null,null,"DESIGN",null,null,null,{"$f":"H21","v":"start-up"},{"$f":"I21","v":"start-up"},"start-up","start-up","start-up","start-up","start-up","start-up","start-up","start-up",0,0,0,0,0,0,0,0]
[null,"Delta Debit",null,null,null,null,null,{"$f":"H58-H23","v":-43.70561895690642},{"$f":"I58-I23","v":-44.300794770780328},-44.819430379739444,-45.204994154694106,-45.36608241713823,-45.150459087366769,-44.294141004752888,-42.313472261047806,-38.251043749639223,-29.979700454534282,-28.441370622359074,-26.744088957077707,-24.86734748285437,-22.787048873571365,-20.474667184712189,-17.896151628910474,-15.010475265343587,-11.767680063819029]
[null,"m","g/s",191.20000000000002,null,null,null,{"$f":"H71*H59/H60^0.5","v":77.442126852450627},80.632094791917652,84.289000766053519,88.539482902672802,93.563657663127842,99.627867695860843,107.14565997583195,116.80109061267372,129.82717163711607,148.74216664674168,151.75508407240241,154.96322002766962,158.38854923736073,162.05671891849431,165.99789501474993,170.24786445561713,174.84949462526598,179.8546953299608]
[null,"Pin","Bara",6.3070000000000004,null,null,null,4.8618736607768973,4.8704293320940311,4.8835602776196776,4.9029201131654405,4.9309542284952759,4.9714219048733694,5.0303942728573565,5.1183322154684374,5.2549413354246228,5.4825565008231294,5.5215091680185919,5.5637171314713125,5.609585429427999,5.6595914286897369,5.7143023436396847,5.774398266845715,5.8407029447800785,5.914225538910558]
[null,"Tin","K",18.21,null,null,null,{"$f":"m*H27+p","v":65.96185407897174},{"$f":"m*I27+p","v":61.060262465543602},56.178657167016397,51.318710035582725,46.482301103116143,41.671547839289943,36.888835209230159,32.136842636879678,27.418558098158627,{"$f":"m*Q27+p","v":22.737257754474193},22.15486742835666,21.573115998460032,20.99201029162068,20.411557118854098,19.831763206870662,19.252635229271135,18.674179736470272,18.096403202895495]
[null,"Pout","Bara",1.35,null,null,null,1.1499999999999999,1.1499999999999999,1.1499999999999999,1.1499999999999999,1.1499999999999999,1.1499999999999999,1.1499999999999999,1.1499999999999999,1.1499999999999999,1.1499999999999999,1.1499999999999999,1.1499999999999999,1.1499999999999999,1.1499999999999999,1.1499999999999999,1.1499999999999999,1.1499999999999999,1.1499999999999999]
[null,"Tout","K",{"$f":"[3]!T2_turb(11,D59,D60,D61,D63)","v":11.618357475588732},null,null,null,{"$f":"[3]!T2_turb(11,H59,H60,H61,H63)","v":51.229742388025016},{"$f":"[3]!T2_turb(11,I59,I60,I61,I63)","v":46.905771543703366},{"$f":"[3]!T2_turb(11,J59,J60,J61,J63)","v":42.630768132060339},{"$f":"[3]!T2_turb(11,K59,K60,K61,K63)","v":38.410586051555462},{"$f":"[3]!T2_turb(11,L59,L60,L61,L63)","v":34.252296458400096},{"$f":"[3]!T2_turb(11,M59,M60,M61,M63)","v":30.164561119540227},{"$f":"[3]!T2_turb(11,N59,N60,N61,N63)","v":26.158152358210579},{"$f":"[3]!T2_turb(11,O59,O60,O61,O63)","v":22.246671637808181},{"$f":"[3]!T2_turb(11,P59,P60,P61,P63)","v":18.447473499829155},{"$f":"[3]!T2_turb(11,Q59,Q60,Q61,Q63)","v":14.782426333646871},{"$f":"[3]!T2_turb(11,R59,R60,R61,R63)","v":14.334965559480569},{"$f":"[3]!T2_turb(11,S59,S60,S61,S63)","v":13.890037026383935},{"$f":"[3]!T2_turb(11,T59,T60,T61,T63)","v":13.447682912736585},{"$f":"[3]!T2_turb(11,U59,U60,U61,U63)","v":13.007940048476648},{"$f":"[3]!T2_turb(11,V59,V60,V61,V63)","v":12.570837559016013},{"$f":"[3]!T2_turb(11,W59,W60,W61,W63)","v":12.136393743534741},{"$f":"[3]!T2_turb(11,X59,X60,X61,X63)","v":11.704611715355901},{"$f":"[3]!T2_turb(11,Y59,Y60,Y61,Y63)","v":11.27547341925103}]
[null,"Efficacity","%",0.76,null,null,null,{"$f":"(0.321*H85^4-1.6098*H85^3+1.316*H85^2+0.9448*H85)*($D$63/0.97215493)","v":0.51199332401801023},{"$f":"(0.321*I85^4-1.6098*I85^3+1.316*I85^2+0.9448*I85)*($D$63/0.97215493)","v":0.53061030362869022},0.55082963719069733,0.57282035292505762,0.59674437720892748,0.62272322529621882,0.65076377270032926,0.68058965549086037,0.71123726999764214,0.73998870679403372,0.74316356255218474,0.74618041994430995,0.74901119690451434,0.75162321005464805,0.7539782303869057,0.75603128350625293,0.75772910559421447,0.75900812286425579]
[null,"Power","W",{"$f":"+D58*(D75-D76)","v":6144.650345780522},null,null,null,5991.0340871407989,5991.0340871041244,5991.0340871111275,5991.034087200992,5991.034087158132,5991.0340871842163,5991.0340871767739,5991.0340869642459,5991.0340873441655,5991.0340872103052,5991.0340871794033,5991.034087157057,5991.0340868846633,5991.0340870483706,5991.0340871160815,5991.0340872942998,5991.0340871402213,5991.0340871361477]
[null,"Speed","Hz",1496,null,null,null,1496,1496,1496,1496,1496,1496,1496,1496,1496,1496,1496,1496,1496,1496,1496,1496,1496,1496]
[null,null,null,null,null,null,null,{"$f":"(H64/$D64*$D68/H68)^(1/3)*$D65","v":1496.0000000003986},{"$f":"(I64/$D64*$D68/I68)^(1/3)*$D65","v":1495.9999999973461},1495.9999999979289,1496.0000000054088,1496.0000000018413,1496.0000000040125,1496.0000000033931,1495.9999999857032,1496.0000000173261,1496.0000000061841,1496.0000000036118,1496.0000000017519,1495.9999999790791,1495.9999999927054,1495.9999999983413,1496.0000000131752,1496.0000000003504,1496.0000000000116]
[null,"Delta Speed Frein & Turbine",null,null,null,null,null,{"$f":"H65-H66","v":-3.985860530519858E-10},{"$f":"I65-I66","v":2.6539055397734046E-9},2.0711468096124008E-9,-5.4087649914436042E-9,-1.8412720237392932E-9,-4.0124632505467162E-9,-3.393097358639352E-9,1.4296801964519545E-8,-1.7326101442449726E-8,{"$f":"Q65-Q66","v":-6.1841092247050256E-9},{"$f":"R65-R66","v":-3.6118308344157413E-9},-1.751914169290103E-9,2.0920879251207225E-8,7.2946022555697709E-9,1.6586909623583779E-9,-1.3175167623558082E-8,-3.503828338580206E-10,-1.1596057447604835E-11]
[null,"Brake Pressure",null,8,null,null,null,{"$f":"($D68-$D61)+H61","v":7.8000000000000007},{"$f":"($D68-$D61)+I61","v":7.8000000000000007},7.8000000000000007,7.8000000000000007,7.8000000000000007,7.8000000000000007,7.8000000000000007,7.8000000000000007,7.8000000000000007,7.8000000000000007,7.8000000000000007,7.8000000000000007,7.8000000000000007,7.8000000000000007,7.8000000000000007,7.8000000000000007,7.8000000000000007,7.8000000000000007]
[null,"Rho (brake)",null,{"$f":"[3]!rho_(11,D68,330)","v":1.1632432504804469},null,null,null,{"$f":"[3]!rho_(11,H68,330)","v":1.1342549379241607},{"$f":"[3]!rho_(11,I68,330)","v":1.1342549379241607},{"$f":"[3]!rho_(11,J68,330)","v":1.1342549379241607},{"$f":"[3]!rho_(11,K68,330)","v":1.1342549379241607},{"$f":"[3]!rho_(11,L68,330)","v":1.1342549379241607},{"$f":"[3]!rho_(11,M68,330)","v":1.1342549379241607},{"$f":"[3]!rho_(11,N68,330)","v":1.1342549379241607},{"$f":"[3]!rho_(11,O68,330)","v":1.1342549379241607},{"$f":"[3]!rho_(11,P68,330)","v":1.1342549379241607},{"$f":"[3]!rho_(11,Q68,330)","v":1.1342549379241607},{"$f":"[3]!rho_(11,R68,330)","v":1.1342549379241607},{"$f":"[3]!rho_(11,S68,330)","v":1.1342549379241607},{"$f":"[3]!rho_(11,T68,330)","v":1.1342549379241607},{"$f":"[3]!rho_(11,U68,330)","v":1.1342549379241607},{"$f":"[3]!rho_(11,V68,330)","v":1.1342549379241607},{"$f":"[3]!rho_(11,W68,330)","v":1.1342549379241607},{"$f":"[3]!rho_(11,X68,330)","v":1.1342549379241607},{"$f":"[3]!rho_(11,Y68,330)","v":1.1342549379241607}]
[null,"Wheel","mm",39.5,null,null,null,{"$f":"$D$35","v":35.799999999999997},{"$f":"$D$35","v":35.799999999999997},35.799999999999997,35.799999999999997,35.799999999999997,35.799999999999997,35.799999999999997,35.799999999999997,35.799999999999997,35.799999999999997,35.799999999999997,35.799999999999997,35.799999999999997,35.799999999999997,35.799999999999997,35.799999999999997,35.799999999999997,35.799999999999997]
[null,"a = mÖT/P",null,{"$f":"D58*D60^0.5/D59","v":129.36596422035444},null,null,null,{"$f":"$D$71","v":129.36596422035444},129.36596422035444,129.36596422035444,129.36596422035444,129.36596422035444,129.36596422035444,129.36596422035444,129.36596422035444,129.36596422035444,129.36596422035444,129.36596422035444,129.36596422035444,129.36596422035444,129.36596422035444,129.36596422035444,129.36596422035444,129.36596422035444,129.36596422035444]
[null,"Rho (in)","kg/m3",{"$f":"[3]!rho_(11,D59,D60)","v":16.817250243896773},null,null,null,{"$f":"[3]!rho_(11,H59,H60)","v":3.5128910905216459},{"$f":"[3]!rho_(11,I59,I60)","v":3.7993960709878691},{"$f":"[3]!rho_(11,J59,J60)","v":4.1381903231629815},{"$f":"[3]!rho_(11,K59,K60)","v":4.545251092971875},{"$f":"[3]!rho_(11,L59,L60)","v":5.0438865212787238},{"$f":"[3]!rho_(11,M59,M60)","v":5.6695396290837152},{"$f":"[3]!rho_(11,N59,N60)","v":6.4789954222859167},{"$f":"[3]!rho_(11,O59,O60)","v":7.5696326962020599},{"$f":"[3]!rho_(11,P59,P60)","v":9.1246680889264802},{"$f":"[3]!rho_(11,Q59,Q60)","v":11.53881890139097},{"$f":"[3]!rho_(11,R59,R60)","v":11.93939519461877},{"$f":"[3]!rho_(11,S59,S60)","v":12.370591092183949},{"$f":"[3]!rho_(11,T59,T60)","v":12.83622346378303},{"$f":"[3]!rho_(11,U59,U60)","v":13.340796329486052},{"$f":"[3]!rho_(11,V59,V60)","v":13.88966811735958},{"$f":"[3]!rho_(11,W59,W60)","v":14.489271595370678},{"$f":"[3]!rho_(11,X59,X60)","v":15.147407681583996},{"$f":"[3]!rho_(11,Y59,Y60)","v":15.873644166006097}]
[null,"Sound Speed",null,{"$f":"[3]!Sound_speed(11,D59,D60)","v":258.39146376447951},null,null,null,{"$f":"[3]!Sound_speed(11,H59,H60)","v":482.99736133769642},{"$f":"[3]!Sound_speed(11,I59,I60)","v":465.09196928218023},{"$f":"[3]!Sound_speed(11,J59,J60)","v":446.53844572400476},{"$f":"[3]!Sound_speed(11,K59,K60)","v":427.25586156664428},{"$f":"[3]!Sound_speed(11,L59,L60)","v":407.1435595144394},{"$f":"[3]!Sound_speed(11,M59,M60)","v":386.07322375175693},{"$f":"[3]!Sound_speed(11,N59,N60)","v":363.87610480752301},{"$f":"[3]!Sound_speed(11,O59,O60)","v":340.32110554302523},{"$f":"[3]!Sound_speed(11,P59,P60)","v":315.07405704337151},{"$f":"[3]!Sound_speed(11,Q59,Q60)","v":287.61397302723833},{"$f":"[3]!Sound_speed(11,R59,R60)","v":283.98741949279616},{"$f":"[3]!Sound_speed(11,S59,S60)","v":280.31085379190188},{"$f":"[3]!Sound_speed(11,T59,T60)","v":276.58171928905892},{"$f":"[3]!Sound_speed(11,U59,U60)","v":272.79723582963766},{"$f":"[3]!Sound_speed(11,V59,V60)","v":268.95437798306301},{"$f":"[3]!Sound_speed(11,W59,W60)","v":265.04985485970411},{"$f":"[3]!Sound_speed(11,X59,X60)","v":261.08009314401068},{"$f":"[3]!Sound_speed(11,Y59,Y60)","v":257.04123027913158}]
[null,"S=Q/(rho*V) = cte",null,{"$f":"D58/(D72*D73)","v":4.4000208975996838E-2},null,null,null,4.5642332244054361E-2,4.5630427001084883E-2,4.5614360249108525E-2,4.5592254868881646E-2,4.5561111962078689E-2,4.5515923419136406E-2,4.5447853267919634E-2,4.5340176663542828E-2,4.5158122232068533E-2,4.4819062162052101E-2,4.4757087797925636E-2,4.4688756097261306E-2,4.4613165545918564E-2,4.4529244042277843E-2,4.4435706964217864E-2,4.4331002142427196E-2,4.421323658212311E-2,4.4080077380982664E-2]
[null,"Hin",null,{"$f":"[3]!h_(11,D59,D60)","v":105.90220745591094},null,null,null,{"$f":"[3]!h_(11,H59,H60)","v":358.81815640994091},{"$f":"[3]!h_(11,I59,I60)","v":333.26240764487693},{"$f":"[3]!h_(11,J59,J60)","v":307.78890388172204},{"$f":"[3]!h_(11,K59,K60)","v":282.39962681096983},{"$f":"[3]!h_(11,L59,L60)","v":257.09463630504973},{"$f":"[3]!h_(11,M59,M60)","v":231.87033739373845},{"$f":"[3]!h_(11,N59,N60)","v":206.71611457313998},{"$f":"[3]!h_(11,O59,O60)","v":181.60733846006403},{"$f":"[3]!h_(11,P59,P60)","v":156.48933132029757},{"$f":"[3]!h_(11,Q59,Q60)","v":131.23473629250552},{"$f":"[3]!h_(11,R59,R60)","v":128.0557200344609},{"$f":"[3]!h_(11,S59,S60)","v":124.86895118847751},{"$f":"[3]!h_(11,T59,T60)","v":121.67320123712314},{"$f":"[3]!h_(11,U59,U60)","v":118.46703083866899},{"$f":"[3]!h_(11,V59,V60)","v":115.24874126368827},{"$f":"[3]!h_(11,W59,W60)","v":112.0163119401879},{"$f":"[3]!h_(11,X59,X60)","v":108.76731750137542},{"$f":"[3]!h_(11,Y59,Y60)","v":105.49881749614187}]
[null,"Hout",null,{"$f":"[3]!h_(11,D61,D62)","v":73.764914852456329},null,null,null,{"$f":"[3]!h_(11,H61,H62)","v":281.45672109508405},{"$f":"[3]!h_(11,I61,I62)","v":258.96154639893234},{"$f":"[3]!h_(11,J61,J62)","v":236.71160989719124},{"$f":"[3]!h_(11,K61,K62)","v":214.73451413139108},{"$f":"[3]!h_(11,L61,L62)","v":193.06300012502129},{"$f":"[3]!h_(11,M61,M62)","v":171.73621803796385},{"$f":"[3]!h_(11,N61,N62)","v":150.8012591461621},{"$f":"[3]!h_(11,O61,O62)","v":130.31471734207099},{"$f":"[3]!h_(11,P61,P62)","v":110.34310467299842},{"$f":"[3]!h_(11,Q61,Q62)","v":90.956755795967254},{"$f":"[3]!h_(11,R61,R62)","v":88.577411127715621},{"$f":"[3]!h_(11,S61,S62)","v":86.20794449226068},{"$f":"[3]!h_(11,T61,T62)","v":83.848281975399786},{"$f":"[3]!h_(11,U61,U62)","v":81.498282322530429},{"$f":"[3]!h_(11,V61,V62)","v":79.157716816759347},{"$f":"[3]!h_(11,W61,W62)","v":76.826242998934688},{"$f":"[3]!h_(11,X61,X62)","v":74.503368955341074},{"$f":"[3]!h_(11,Y61,Y62)","v":72.188405020420745}]
[null,"Sin = Sout",null,{"$f":"[3]!S_(11,D59,D60)","v":13.041567593259808},null,null,null,{"$f":"[3]!S_(11,H59,H60)","v":20.454827234244185},{"$f":"[3]!S_(11,I59,I60)","v":20.048552537988616},{"$f":"[3]!S_(11,J59,J60)","v":19.608086790186853},{"$f":"[3]!S_(11,K59,K60)","v":19.127075853727025},{"$f":"[3]!S_(11,L59,L60)","v":18.597178516585931},{"$f":"[3]!S_(11,M59,M60)","v":18.007122387049847},{"$f":"[3]!S_(11,N59,N60)","v":17.341107984483042},{"$f":"[3]!S_(11,O59,O60)","v":16.575915612374949},{"$f":"[3]!S_(11,P59,P60)","v":15.675140423508285},{"$f":"[3]!S_(11,Q59,Q60)","v":14.576016346597386},{"$f":"[3]!S_(11,R59,R60)","v":14.419591819482712},{"$f":"[3]!S_(11,S59,S60)","v":14.257941658486134},{"$f":"[3]!S_(11,T59,T60)","v":14.090668015708236},{"$f":"[3]!S_(11,U59,U60)","v":13.917321321614173},{"$f":"[3]!S_(11,V59,V60)","v":13.737390144489638},{"$f":"[3]!S_(11,W59,W60)","v":13.55028831817979},{"$f":"[3]!S_(11,X59,X60)","v":13.355338277852205},{"$f":"[3]!S_(11,Y59,Y60)","v":13.151749233935188}]
[null,"Tout(iso)",null,{"$f":"[1]!HeCalc(2,0,1,D61*10^5,8,D77*1000,1)","v":9.7639107105745424},null,null,null,{"$f":"[1]!HeCalc(2,0,1,H61*10^5,8,H77*1000,1)","v":37.064181629166129},{"$f":"[1]!HeCalc(2,0,1,I61*10^5,8,I77*1000,1)","v":34.284967219147049},{"$f":"[1]!HeCalc(2,0,1,J61*10^5,8,J77*1000,1)","v":31.508718195515822},{"$f":"[1]!HeCalc(2,0,1,K61*10^5,8,K77*1000,1)","v":28.735528084709969},{"$f":"[1]!HeCalc(2,0,1,L61*10^5,8,L77*1000,1)","v":25.965405906906113},{"$f":"[1]!HeCalc(2,0,1,M61*10^5,8,M77*1000,1)","v":23.198194296252826},{"$f":"[1]!HeCalc(2,0,1,N61*10^5,8,N77*1000,1)","v":20.433406394775528},{"$f":"[1]!HeCalc(2,0,1,O61*10^5,8,O77*1000,1)","v":17.669878547274468},{"$f":"[1]!HeCalc(2,0,1,P61*10^5,8,P77*1000,1)","v":14.904955713476571},{"$f":"[1]!HeCalc(2,0,1,Q61*10^5,8,Q77*1000,1)","v":12.132291602089348},{"$f":"[1]!HeCalc(2,0,1,R61*10^5,8,R77*1000,1)","v":11.784527857974361},{"$f":"[1]!HeCalc(2,0,1,S61*10^5,8,S77*1000,1)","v":11.436358227201209},{"$f":"[1]!HeCalc(2,0,1,T61*10^5,8,T77*1000,1)","v":11.08772017123921},{"$f":"[1]!HeCalc(2,0,1,U61*10^5,8,U77*1000,1)","v":10.738540503949787},{"$f":"[1]!HeCalc(2,0,1,V61*10^5,8,V77*1000,1)","v":10.388733003032256},{"$f":"[1]!HeCalc(2,0,1,W61*10^5,8,W77*1000,1)","v":10.038195413756663},{"$f":"[1]!HeCalc(2,0,1,X61*10^5,8,X77*1000,1)","v":9.6868054754606288},{"$f":"[1]!HeCalc(2,0,1,Y61*10^5,8,Y77*1000,1)","v":9.3344157809448394}]
[null,"Hout(iso)",null,{"$f":"[3]!h_(11,D61,D78)","v":63.616296135548602},null,null,null,{"$f":"[3]!h_(11,H61,H78)","v":207.71963288283436},{"$f":"[3]!h_(11,I61,I78)","v":193.23334914785471},{"$f":"[3]!h_(11,J61,J78)","v":178.75210341645615},{"$f":"[3]!h_(11,K61,K78)","v":164.27338996541658},{"$f":"[3]!h_(11,L61,L78)","v":149.79302002587332},{"$f":"[3]!h_(11,M61,M78)","v":135.30397064682634},{"$f":"[3]!h_(11,N61,N78)","v":120.79422129539887},{"$f":"[3]!h_(11,O61,O78)","v":106.24236530160582},{"$f":"[3]!h_(11,P61,P78)","v":91.607710806439897},{"$f":"[3]!h_(11,Q61,Q78)","v":76.804202249573592},{"$f":"[3]!h_(11,R61,R78)","v":74.933754835887981},{"$f":"[3]!h_(11,S61,S78)","v":73.057076120647025},{"$f":"[3]!h_(11,T61,T78)","v":71.173396403706121},{"$f":"[3]!h_(11,U61,U78)","v":69.281816729262758},{"$f":"[3]!h_(11,V61,V78)","v":67.381279058038629},{"$f":"[3]!h_(11,W61,W78)","v":65.470527778912313},{"$f":"[3]!h_(11,X61,X78)","v":63.548058675132893},{"$f":"[3]!h_(11,Y61,Y78)","v":61.612050711560428}]
[null,"ΔHs",null,{"$f":"D75-D79","v":42.285911320362338},null,null,null,151.09852352710655,140.02905849702222,129.03680046526588,118.12623684555325,107.30161627917641,96.566366746912109,85.921893277741106,75.364973158458213,64.881620513857669,54.430534042931924,53.121965198572923,51.811875067830485,50.499804833417016,49.185214109406232,47.867462205649645,46.545784161275591,45.219258826242523,43.88676678458144]
[null,"u1","m/s",{"$f":"(2*52.7%*D80*1000*D63)^0.5","v":184.04539223806461},null,null,null,{"$f":"PI()*$D$82*H65","v":184.04539223806461},184.04539223806461,184.04539223806461,184.04539223806461,184.04539223806461,184.04539223806461,184.04539223806461,184.04539223806461,184.04539223806461,{"$f":"PI()*$D$82*Q65","v":184.04539223806461},{"$f":"PI()*$D$82*R65","v":184.04539223806461},184.04539223806461,184.04539223806461,184.04539223806461,184.04539223806461,184.04539223806461,184.04539223806461,184.04539223806461]
[null,"D1",null,{"$f":"D81/PI()/D65","v":3.9160072096222902E-2}]
[null,"Co = (2*ΔHs)^0,5",null,{"$f":"(2000*D80)^0.5","v":290.81234953269205},null,null,null,549.72451924051302,529.20517476121154,508.0094496468858,486.05809703275855,463.25288186729375,439.46869455494124,414.54045225464091,388.23954759518824,360.22665230062495,329.94100697831402,325.95080978139299,321.90643071498425,317.80435753279727,313.64060358762936,309.41060811048362,305.10910888164449,300.72997464916102,296.26598449562664]
[null,"u1/Co",null,{"$f":"D81/D83","v":0.6328664946100403},null,null,null,0.33479567637320884,0.34777700788944427,0.36228734006029495,0.37864895855373565,0.39728925483681582,0.41879067728464953,0.44397450535179744,0.47405111967100805,0.51091553349159369,0.55781302822465273,0.56464161681788494,0.57173568054941493,0.57911538302010601,0.58680346273037121,0.59482573452150711,0.60321172616795926,0.61199550345048404,0.62121675072279992]
[null,"U1/C0 off de / U1/C0 nom",null,{"$f":"D84/$D$49","v":0.98709623358564935},null,null,null,{"$f":"H84/$D84","v":0.52901469618723185},{"$f":"I84/$D84","v":0.54952665507081},0.57245460637559775,0.59830779758225561,0.62776155511537635,0.66173621269474847,0.70152948391645487,0.74905390585278009,0.80730381185120192,0.88140711030746854,0.89219704570678182,0.90340646158192817,0.9150672186824258,0.92721524638770425,0.93989133504061839,0.95314214183458434,0.96702149452165809,0.98159209882896592]
[null,"Rdt",null,{"$f":"(0.321*D85^4-1.6098*D85^3+1.316*D85^2+0.9448*D85)*($D63/0.97215493)","v":0.75935604730996153},null,null,null,{"$f":"(0.321*H85^4-1.6098*H85^3+1.316*H85^2+0.9448*H85)*($D63/0.97215493)","v":0.51199332401801023},{"$f":"(0.321*I85^4-1.6098*I85^3+1.316*I85^2+0.9448*I85)*($D63/0.97215493)","v":0.53061030362869022},0.55082963719069733,0.57282035292505762,0.59674437720892748,0.62272322529621882,0.65076377270032926,0.68058965549086037,0.71123726999764214,0.73998870679403372,0.74316356255218474,0.74618041994430995,0.74901119690451434,0.75162321005464805,0.7539782303869057,0.75603128350625293,0.75772910559421447,0.75900812286425579]
[]
[null,"TURBINE 3"]
[]
[null,null,null,"DESIGN",null,{"$f":"F56","v":0},{"$f":"G56","v":0},{"$f":"H56","v":"start-up"},{"$f":"I56","v":"start-up"}]
[]
[null,"m","g/s",399.8,null,{"$f":"F105/(F95*F94)^0.5*F93","v":161.47618188513178},{"$f":"G105/(G95*G94)^0.5*G93","v":95.080415199611181},{"$error":"#DIV/0!"},117.10102732642108]
[null,"Pin","Bara",13.07,null,13.07,7.3689999999999998,null,10.48]
[null,"Tin","K",7.2919999999999998,null,9.16,7.9119999999999999,null,10.55]
[null,"Pout","Bara",4.88,null,4.88,5.18,null,5.18]
[null,"Tout","K",{"$f":"[3]!T2_turb(11,D93,D94,D95,D97)","v":6.1198408797506243},null,{"$f":"[3]!T2_turb(11,F93,F94,F95,F97)","v":7.0494463059442776},{"$f":"[3]!T2_turb(11,G93,G94,G95,G97)","v":7.1447253899950391},{"$f":"[3]!T2_turb(11,H93,H94,H95,H97)","v":{"$error":"#VALUE!"}},{"$f":"[3]!T2_turb(11,I93,I94,I95,I97)","v":8.6903815136344829}]
[null,"Efficacity","%",0.72,null,{"$f":"(0.321*F119^4-1.6098*F119^3+1.316*F119^2+0.9448*F119)*($D$97/0.97215493)","v":0.58179731360313081},{"$f":"(0.321*G119^4-1.6098*G119^3+1.316*G119^2+0.9448*G119)*($D$97/0.97215493)","v":0.582724483494652},{"$f":"(0.321*H119^4-1.6098*H119^3+1.316*H119^2+0.9448*H119)*($D$97/0.97215493)","v":{"$error":"#VALUE!"}},{"$f":"(0.321*I119^4-1.6098*I119^3+1.316*I119^2+0.9448*I119)*($D$97/0.97215493)","v":0.50201641458397539}]
[null,"Power","W",{"$f":"+D92*(D109-D110)","v":2075.5404202052005},null,954.74184184263254,182.5140950412455,{"$error":"#DIV/0!"},610.67834348723773]
[null,"Speed","Hz",2076,null,1602.552519659416,914.20818650847264,862.66257848011605,1367.3629344539765]
[null,null,null,null,null,{"$f":"(F98/$D98*$D102/F102)^(1/3)*$D99","v":1602.5525123839127},{"$f":"(G98/$D98*$D102/G102)^(1/3)*$D99","v":914.20817108894096},{"$f":"(H98/$D98*$D102/H102)^(1/3)*$D99","v":{"$error":"#DIV/0!"}},{"$f":"(I98/$D98*$D102/I102)^(1/3)*$D99","v":1367.3629301538849}]
[null,null,null,null,null,{"$f":"F99-F100","v":7.2755033215798903E-6},{"$f":"G99-G100","v":1.5419531678162457E-5},{"$f":"H99-H100","v":{"$error":"#DIV/0!"}},{"$f":"I99-I100","v":4.300091632103431E-6}]
[null,"Brake Pressure",null,10.1,null,{"$f":"($D102-$D95)+F95","v":10.1},{"$f":"($D102-$D95)+G95","v":10.399999999999999},{"$f":"($D102-$D95)+H95","v":5.22},{"$f":"($D102-$D95)+I95","v":10.399999999999999}]
[null,"Rho (brake)",null,{"$f":"[3]!rho_(11,D102,330)","v":1.4673342046153373},null,{"$f":"[3]!rho_(11,F102,330)","v":1.4673342046153373},{"$f":"[3]!rho_(11,G102,330)","v":1.5107331217743123},{"$f":"[3]!rho_(11,H102,330)","v":0.75987987169063398},{"$f":"[3]!rho_(11,I102,330)","v":1.5107331217743123}]
[null,"Wheel","mm",29.5,null,{"$f":"$D$104","v":29.5},{"$f":"$D$104","v":29.5},{"$f":"$D$104","v":29.5},{"$f":"$D$104","v":29.5}]
[null,"a = mÖT/P",null,{"$f":"D92*D94^0.5/D93","v":82.601994178997316},null,{"$f":"$D$105","v":82.601994178997316},{"$f":"$D$105","v":82.601994178997316},82.601994178997316,82.601994178997316]
[null,"Rho (in)","kg/m3",{"$f":"[3]!rho_(11,D93,D94)","v":122.0413850208848},null,{"$f":"[3]!rho_(11,F93,F94)","v":92.042022544510019},{"$f":"[3]!rho_(11,G93,G94)","v":70.649649504414128},{"$f":"[3]!rho_(11,H93,H94)","v":"NUM"},{"$f":"[3]!rho_(11,I93,I94)","v":58.789985568547117}]
[null,"Sound Speed",null,{"$f":"[3]!Sound_speed(11,D93,D94)","v":249.05671288435045},null,{"$f":"[3]!Sound_speed(11,F93,F94)","v":219.03534618547846},{"$f":"[3]!Sound_speed(11,G93,G94)","v":170.78644408370695},{"$f":"[3]!Sound_speed(11,H93,H94)","v":"NUM"},{"$f":"[3]!Sound_speed(11,I93,I94)","v":204.26692373410398}]
[null,"S=Q/(rho*V) = cte",null,{"$f":"D92/(D106*D107)","v":1.3153381307708404E-2},null,8.0095499679843866E-3,7.8800262035761022E-3,{"$error":"#DIV/0!"},9.7512278209034905E-3]
[null,"Hin",null,{"$f":"[3]!h_(11,D93,D94)","v":28.150884578454882},null,{"$f":"[3]!h_(11,F93,F94)","v":40.890140453818937},{"$f":"[3]!h_(11,G93,G94)","v":36.811643961665368},{"$f":"[3]!h_(11,H93,H94)","v":{"$error":"#VALUE!"}},{"$f":"[3]!h_(11,I93,I94)","v":54.059832308617963}]
[null,"Hout",null,{"$f":"[3]!h_(11,D95,D96)","v":22.959437804554931},null,{"$f":"[3]!h_(11,F95,F96)","v":34.977554271159498},{"$f":"[3]!h_(11,G95,G96)","v":34.892067835939827},{"$f":"[3]!h_(11,H95,H96)","v":{"$error":"#VALUE!"}},{"$f":"[3]!h_(11,I95,I96)","v":48.844862317065612}]
[null,"Sin = Sout",null,{"$f":"[3]!S_(11,D93,D94)","v":5.0600046690749361},null,{"$f":"[3]!S_(11,F93,F94)","v":6.606972813997622},{"$f":"[3]!S_(11,G93,G94)","v":6.9458302073485418},{"$f":"[3]!S_(11,H93,H94)","v":{"$error":"#VALUE!"}},{"$f":"[3]!S_(11,I93,I94)","v":8.3000204511344844}]
[null,"Tout(iso)",null,{"$f":"[1]!HeCalc(2,0,1,D95*10^5,8,D111*1000,1)","v":5.9351387842537191},null,{"$f":"[1]!HeCalc(2,0,1,F95*10^5,8,F111*1000,1)","v":6.6999950291002683},{"$f":"[1]!HeCalc(2,0,1,G95*10^5,8,G111*1000,1)","v":7.0241819850115181},{"$f":"[1]!HeCalc(2,0,1,H95*10^5,8,H111*1000,1)","v":{"$error":"#VALUE!"}},{"$f":"[1]!HeCalc(2,0,1,I95*10^5,8,I111*1000,1)","v":8.0488946725573083}]
[null,"Hout(iso)",null,{"$f":"[3]!h_(11,D95,D112)","v":20.940541836947467},null,{"$f":"[3]!h_(11,F95,F112)","v":30.727518437529557},{"$f":"[3]!h_(11,G95,G112)","v":33.517503797489027},{"$f":"[3]!h_(11,H95,H112)","v":{"$error":"#VALUE!"}},{"$f":"[3]!h_(11,I95,I112)","v":43.671785543492518}]
[null,"ΔHs",null,{"$f":"D109-D113","v":7.2103427415074144},null,10.162622016289379,3.2941401641763406,{"$error":"#VALUE!"},10.388046765125445]
[null,"u1","m/s",{"$f":"(2*52.7%*D114*1000*D97)^0.5","v":73.971514109656738},null,{"$f":"PI()*$D$116*F99","v":57.101751598965535},{"$f":"PI()*$D$116*G99","v":32.574838038282842},30.738177791866459,48.72153497060885]
[null,"D1",null,{"$f":"D115/PI()/D99","v":1.1341938457171245E-2},null,null,null,null,null,null,null,null,"T3"]
[null,"Co = (2*ΔHs)^0,5",null,{"$f":"(2000*D114)^0.5","v":120.0861585821398},null,142.56663015088333,81.16822240478524,{"$error":"#VALUE!"},144.13914641848999,null,null,"MAX",{"$f":"ROUND(F92,0)&\"g/s @ \"&F93&\" b ; \"&F94&\"K\"","v":"161g/s @ 13,07 b ; 9,16K"}]
[null,"u1/Co",null,{"$f":"D115/D117","v":0.61598701285010871},null,0.40052676799986592,0.40132501455843644,{"$error":"#VALUE!"},0.33801736850273811,null,null,"MIN",{"$f":"ROUND(G92,0)&\"g/s @ \"&G93&\" b ; \"&G94&\"K\"","v":"95g/s @ 7,369 b ; 7,912K"}]
[null,"U1/C0 off de / U1/C0 nom",null,{"$f":"D118/$D$49","v":0.96076892283052273},null,{"$f":"F118/$D118","v":0.65021950080841751},{"$f":"G118/$D118","v":0.65151538293242062},{"$f":"H118/$D118","v":{"$error":"#VALUE!"}},{"$f":"I118/$D118","v":0.54874106344996854},null,null,"STS",{"$f":"ROUND(H92,0)&\"g/s @ \"&H93&\" b ; \"&H94&\"K\"","v":{"$error":"#DIV/0!"}}]
[null,"Rdt",null,{"$f":"(0.321*D119^4-1.6098*D119^3+1.316*D119^2+0.9448*D119)*($D97/0.97215493)","v":0.7171786087866604},null,{"$f":"(0.321*F119^4-1.6098*F119^3+1.316*F119^2+0.9448*F119)*($D97/0.97215493)","v":0.58179731360313081},{"$f":"(0.321*G119^4-1.6098*G119^3+1.316*G119^2+0.9448*G119)*($D97/0.97215493)","v":0.582724483494652},{"$f":"(0.321*H119^4-1.6098*H119^3+1.316*H119^2+0.9448*H119)*($D97/0.97215493)","v":{"$error":"#VALUE!"}},{"$f":"(0.321*I119^4-1.6098*I119^3+1.316*I119^2+0.9448*I119)*($D97/0.97215493)","v":0.50201641458397539},null,null,"BAKING",{"$f":"ROUND(I92,0)&\"g/s @ \"&I93&\" b ; \"&I94&\"K\"","v":"117g/s @ 10,48 b ; 10,55K"}]
[]
[null,null,null,null,null,null,null,null,null,null,null,null,{"$f":"M47","v":0},{"$f":"M116","v":"T3"},"T1+T2"]
[null,"Courbe de rendement TC3",null,null,null,null,null,null,null,null,null,{"$f":"L117","v":"MAX"},{"$f":"M48","v":410.10062599979824},{"$f":"M117","v":"161g/s @ 13,07 b ; 9,16K"},{"$f":"F92+F58","v":161.47618188513178}]
[null,null,null,null,null,null,null,null,null,null,null,{"$f":"L118","v":"MIN"},{"$f":"M49","v":0.54638790605180099},{"$f":"M118","v":"95g/s @ 7,369 b ; 7,912K"},{"$f":"G92+G58","v":95.080415199611181}]
[null,null,null,null,null,null,null,null,null,null,null,{"$f":"L119","v":"STS"},{"$f":"M50","v":0.85221361651134864},{"$f":"M119","v":{"$error":"#DIV/0!"}},{"$f":"H92+H58","v":{"$error":"#DIV/0!"}}]
[null,null,null,null,null,null,null,null,null,null,null,{"$f":"L120","v":"BAKING"},{"$f":"M51","v":0.75096641423816679},{"$f":"M120","v":"117g/s @ 10,48 b ; 10,55K"},{"$f":"I92+I58","v":197.73312211833871}]
[null,null,null,null,"d : mm"]
[null,null,null,null,"N : Hz"]
[null,null,null,null,"H : J/kG"]
[]
[]
[]
[]
[]
[null,"rendement=(0,321*rap^4 - 1,6098*rap^3 + 1,316*rap^2 + 0,9448*rap)*(ETAgar/0,97)",null,null,null,null,null,null,"U1/CO _nom",0.64]
[null,null,null,null,null,null,null,null,"Eta_gar",0.8]
[null,"U1/C0",{"$f":"D28","v":0.78},{"$f":"D63","v":0.76},{"$f":"D97","v":0.72}]
[null,0,{"$f":"(0.321*B138^4-1.6098*B138^3+1.316*B138^2+0.9448*B138)*$D$28/0.97215493","v":0}]
[null,{"$f":"B138+0.05","v":0.05},{"$f":"(0.321*$B139^4-1.6098*$B139^3+1.316*$B139^2+0.9448*$B139)*$C$137/0.97215493","v":4.0382461852042459E-2},{"$f":"(0.321*$B139^4-1.6098*$B139^3+1.316*$B139^2+0.9448*$B139)*$D$137/0.97215493","v":3.9347014112246496E-2},{"$f":"(0.321*$B139^4-1.6098*$B139^3+1.316*$B139^2+0.9448*$B139)*$E$137/0.97215493","v":3.7276118632654578E-2}]
[null,0.1,{"$f":"(0.321*$B140^4-1.6098*$B140^3+1.316*$B140^2+0.9448*$B140)*$C$137/0.97215493","v":8.5098158171146673E-2},{"$f":"(0.321*$B140^4-1.6098*$B140^3+1.316*$B140^2+0.9448*$B140)*$D$137/0.97215493","v":8.2916154115476232E-2},{"$f":"(0.321*$B140^4-1.6098*$B140^3+1.316*$B140^2+0.9448*$B140)*$E$137/0.97215493","v":7.8552146004135376E-2}]
[null,0.15000000000000002,0.13323633134792623,0.12982001515951785,0.12298738278270113]
[null,0.2,0.18392485650409657,0.17920883454245307,0.16977679061916603]
[null,0.25,0.23633024149247489,0.23027049171061653,0.21815099214689987]
[null,0.3,0.28965762689698032,0.28223050825859619,0.26737627098182798]
[null,0.35,0.34315078603263366,0.33435204792923284,0.3167545717224311]
[null,0.39999999999999997,0.39609212494555779,0.38593591661362037,0.36562349994974563]
[null,0.44999999999999996,0.4478026824129771,0.43632056235110589,0.41335632222736346]
[null,0.49999999999999994,0.49764212994321799,0.48488207532928934,0.45936196610143198]
[null,0.54999999999999993,0.54500877177570861,0.53103418788402379,0.50308502010065403]
[null,0.6,0.58933954488097895,0.57422827449941549,0.54400573373628835]
[null,0.65,0.63011001896066099,0.61395335180782351,0.58164001750214867]
[null,0.70000000000000007,0.66683439644748832,0.64973607858986027,0.61553944287460449]
[null,0.75000000000000011,0.69906551250529614,0.68114075577439104,0.64529124231258095]
[null,0.80000000000000016,0.7263948350290218,0.70776932643853407,0.67051830925755851]
[null,0.8500000000000002,0.74845246464470438,0.72926137580766071,0.69087919813357312]
[null,0.90000000000000024,0.76490713470948513,0.74529413125539579,0.70606812434721711]
[null,0.95000000000000029,0.77546621131160665,0.7555824623036167,0.71581496428763691]
[null,1.0000000000000002,0.77987569327041351,0.75987888062245412,0.71988525532653547]
[null,1.0500000000000003,0.77792021213635165,0.75797354003029138,0.71808019581817073]
[null,1.1000000000000003,0.76942303219096997,0.74969423649376565,0.7102366450993568]
[null,1.1500000000000004,0.75424605044691839,0.73490640812776653,0.69622712348946292]
[null,1.2000000000000004,0.7322897966479478,0.71351313519543635,0.67595981229041324,null,"F Let u be the peripheral speed of the wheel : u = p . Æ . N / 60                      (in m/s)"]
[null,1.2500000000000004,0.70349343326891334,0.68545514010817188,0.64937855378668918,null,"F Let n, be the speed ratio of the turbine : n =  u / [ 2 . (H1 - H2S ) ] 0.5       (dimensionless number)"]
[null,1.3000000000000005,0.66783475551576954,0.65071078742562172,0.61646285124532574,null,null,"N = speed of rotation of the turbine (in rpm)"]
[null,1.3500000000000005,0.62533019132557388,0.60929608385568745,0.57722786891591438,null,null,"Æ = diameter of the wheel of the turbine (in m)"]
[null,1.4000000000000006,0.57603480136648577,0.56126467825452464,0.53172443203060227]
[null,1.4500000000000006,0.5200422790377659,0.50670786162654113,0.48003902680409161]
[null,1.5000000000000007,0.45748495046977738,0.44575456712439848,0.42229380043364062]

{"sheet":"Turbines_JT60SA_serial","index":5,"n_rows":173,"n_cols":40,"rows_kept":173,"cut":false,"hidden":false,"merged":[]}
[]
[]
[]
[]
[null,null,null,null,"Vitesse de la roue ajustée en fonction de la puissance du frein",null,null,null,null,null,null,{"$f":"D70*0.3","v":448.8}]
[]
[1,2,3,4,5,6,7,8,9,10,11,12,13,14,15,16,17,18,19,20,21,22,23,24,25,26,27,28,29,30,31,32,33]
[null,"Relation entre la puissance et la vitesse de rotation",null,null,null,null,null,null,null,null,null,null,"²"]
[]
[null,"CV330"]
[null,"Pin","Bara",15,null,null,null,15,15,15,15,15,15,15,15,15,15,15,15,15,15,15,15,15,15]
[null,"Tin","K",{"$f":"[3]!T_P_H_(11,D11,[3]!h_(11,D29,D30))","v":40.028139559593733},null,null,null,{"$f":"[3]!T_P_H_(11,H11,[3]!h_(11,H29,H30))","v":79.74905181387355},{"$f":"[3]!T_P_H_(11,I11,[3]!h_(11,I29,I30))","v":75.76249620793493},{"$f":"[3]!T_P_H_(11,J11,[3]!h_(11,J29,J30))","v":71.777830878028993},{"$f":"[3]!T_P_H_(11,K11,[3]!h_(11,K29,K30))","v":65.804972525710028},{"$f":"[3]!T_P_H_(11,L11,[3]!h_(11,L29,L30))","v":61.826263590656708},{"$f":"[3]!T_P_H_(11,M11,[3]!h_(11,M29,M30))","v":57.850464304103362},{"$f":"[3]!T_P_H_(11,N11,[3]!h_(11,N29,N30))","v":53.877809985341152},{"$f":"[3]!T_P_H_(11,O11,[3]!h_(11,O29,O30))","v":49.908314917844102},{"$f":"[3]!T_P_H_(11,P11,[3]!h_(11,P29,P30))","v":45.941370455652802},{"$f":"[3]!T_P_H_(11,Q11,[3]!h_(11,Q29,Q30))","v":41.974573789497299},{"$f":"[3]!T_P_H_(11,R11,[3]!h_(11,R29,R30))","v":41.478445457580861},{"$f":"[3]!T_P_H_(11,S11,[3]!h_(11,S29,S30))","v":40.982183445201102},{"$f":"[3]!T_P_H_(11,T11,[3]!h_(11,T29,T30))","v":40.485754672971986},{"$f":"[3]!T_P_H_(11,U11,[3]!h_(11,U29,U30))","v":39.989119449356529},{"$f":"[3]!T_P_H_(11,V11,[3]!h_(11,V29,V30))","v":39.492229789598206},{"$f":"[3]!T_P_H_(11,W11,[3]!h_(11,W29,W30))","v":38.995027169174534},{"$f":"[3]!T_P_H_(11,X11,[3]!h_(11,X29,X30))","v":38.497439471580599},{"$f":"[3]!T_P_H_(11,Y11,[3]!h_(11,Y29,Y30))","v":37.999376754089582}]
[null,"Rho",null,{"$f":"[3]!rho_(11,D11,D12)","v":17.34400697294025},null,null,null,{"$f":"[3]!rho_(11,H11,H12)","v":8.8185700956575843},{"$f":"[3]!rho_(11,I11,I12)","v":9.2721137159717859},{"$f":"[3]!rho_(11,J11,J12)","v":9.7751109935317757},{"$f":"[3]!rho_(11,K11,K12)","v":10.641792036831724},{"$f":"[3]!rho_(11,L11,L12)","v":11.311121939414722},{"$f":"[3]!rho_(11,M11,M12)","v":12.071289020220251},{"$f":"[3]!rho_(11,N11,N12)","v":12.942511103191086},{"$f":"[3]!rho_(11,O11,O12)","v":13.951703210826363},{"$f":"[3]!rho_(11,P11,P12)","v":15.135701183093179},{"$f":"[3]!rho_(11,Q11,Q12)","v":16.546873262265752},{"$f":"[3]!rho_(11,R11,R12)","v":16.74276622727653},{"$f":"[3]!rho_(11,S11,S12)","v":16.943577857885877},{"$f":"[3]!rho_(11,T11,T12)","v":17.149515896587125},{"$f":"[3]!rho_(11,U11,U12)","v":17.360802974706992},{"$f":"[3]!rho_(11,V11,V12)","v":17.577678625673283},{"$f":"[3]!rho_(11,W11,W12)","v":17.800401802557978},{"$f":"[3]!rho_(11,X11,X12)","v":18.029254093599924},{"$f":"[3]!rho_(11,Y11,Y12)","v":18.264543932788179}]
[null,"dP",null,{"$f":"(D11-D29)*1000","v":230.00000000000043},null,null,null,{"$f":"(H11-H29)*1000","v":5269.6596513491013},{"$f":"(I11-I29)*1000","v":5197.115883366605},5106.2506378624557,4922.8684741141142,4756.288108253385,4537.6950578747674,4242.938204403993,3829.5977319102212,3214.3888874442796,2202.6005791354974,2027.4762410181459,1836.3974184347303,1626.9050002994625,1395.9648783322809,1139.7788040147886,853.51195393756279,530.88868019897359,163.57311283525001]
[null,"Cvs",null,30,null,null,null,30,30,30,30,30,30,30,30,30,30,30,30,30,30,30,30,30,30]
[null,"Range",null,250,null,null,null,250,250,250,250,250,250,250,250,250,250,250,250,250,250,250,250,250,250]
[null,"Flow",null,{"$f":"IF(D11/2>D29,\"S\",\"SS\")","v":"SS"},null,null,null,{"$f":"IF(H11/2>H29,\"S\",\"SS\")","v":"SS"},{"$f":"IF(I11/2>I29,\"S\",\"SS\")","v":"SS"},"SS","SS","SS","SS","SS","SS","SS","SS","SS","SS","SS","SS","SS","SS","SS","SS"]
[null,"Cv",null,{"$f":"[3]!Cv_Simple(D12,D11,D11-D29,D13,D28,D17)","v":12.717086074964683},null,null,null,{"$f":"[3]!Cv_Simple(H12,H11,H11-H29,H13,H28,H17)","v":2.1392298461395423},{"$f":"[3]!Cv_Simple(I12,I11,I11-I29,I13,I28,I17)","v":2.1633578267508948},{"$f":"[3]!Cv_Simple(J12,J11,J11-J29,J13,J28,J17)","v":2.1939720321481877},{"$f":"[3]!Cv_Simple(K12,K11,K11-K29,K13,K28,K17)","v":2.257401407335716},{"$f":"[3]!Cv_Simple(L12,L11,L11-L29,L13,L28,L17)","v":2.3172597052951271},{"$f":"[3]!Cv_Simple(M12,M11,M11-M29,M13,M28,M17)","v":2.3995732317518139},{"$f":"[3]!Cv_Simple(N12,N11,N11-N29,N13,N28,N17)","v":2.5184661694733164},{"$f":"[3]!Cv_Simple(O12,O11,O11-O29,O13,O28,O17)","v":2.7038836966976385},{"$f":"[3]!Cv_Simple(P12,P11,P11-P29,P13,P28,P17)","v":3.0344183212594702},{"$f":"[3]!Cv_Simple(Q12,Q11,Q11-Q29,Q13,Q28,Q17)","v":3.8233069689131787},{"$f":"[3]!Cv_Simple(R12,R11,R11-R29,R13,R28,R17)","v":4.012596513384465},{"$f":"[3]!Cv_Simple(S12,S11,S11-S29,S13,S28,S17)","v":4.2475485396746793},{"$f":"[3]!Cv_Simple(T12,T11,T11-T29,T13,T28,T17)","v":4.5489401161984429},{"$f":"[3]!Cv_Simple(U12,U11,U11-U29,U13,U28,U17)","v":4.9534812384085321},{"$f":"[3]!Cv_Simple(V12,V11,V11-V29,V13,V28,V17)","v":5.5338104687094551},{"$f":"[3]!Cv_Simple(W12,W11,W11-W29,W13,W28,W17)","v":6.4610202776805048},{"$f":"[3]!Cv_Simple(X12,X11,X11-X29,X13,X28,X17)","v":8.2856912817392203},{"$f":"[3]!Cv_Simple(Y12,Y11,Y11-Y29,Y13,Y28,Y17)","v":15.116153124259892}]
[null,"Cv",null,{"$f":"[3]!cv_gaz(11,D28,D11,D29,D12,0.87)","v":12.689488996002535},null,null,null,{"$f":"[3]!cv_gaz(11,H28,H11,H29,H12,0.87)","v":1.9436992107946489},{"$f":"[3]!cv_gaz(11,I28,I11,I29,I12,0.87)","v":1.9693440128641393},{"$f":"[3]!cv_gaz(11,J28,J11,J29,J12,0.87)","v":2.0018924768918045},{"$f":"[3]!cv_gaz(11,K28,K11,K29,K12,0.87)","v":2.0693185341607467},{"$f":"[3]!cv_gaz(11,L28,L11,L29,L12,0.87)","v":2.1328984876744532},{"$f":"[3]!cv_gaz(11,M28,M11,M29,M12,0.87)","v":2.2202128715999501},{"$f":"[3]!cv_gaz(11,N28,N11,N29,N12,0.87)","v":2.3460470728593648},{"$f":"[3]!cv_gaz(11,O28,O11,O29,O12,0.87)","v":2.5415750456955561},{"$f":"[3]!cv_gaz(11,P28,P11,P29,P12,0.87)","v":2.888020498818074},{"$f":"[3]!cv_gaz(11,Q28,Q11,Q29,Q12,0.87)","v":3.7059149416372059},{"$f":"[3]!cv_gaz(11,R28,R11,R29,R12,0.87)","v":3.9007125211640608},{"$f":"[3]!cv_gaz(11,S28,S11,S29,S12,0.87)","v":4.1418972481935787},{"$f":"[3]!cv_gaz(11,T28,T11,T29,T12,0.87)","v":4.4504377282561967},{"$f":"[3]!cv_gaz(11,U28,U11,U29,U12,0.87)","v":4.8633301108776621},{"$f":"[3]!cv_gaz(11,V28,V11,V29,V12,0.87)","v":5.4536769671678389},{"$f":"[3]!cv_gaz(11,W28,W11,W29,W12,0.87)","v":6.3934263566416112},{"$f":"[3]!cv_gaz(11,X28,X11,X29,X12,0.87)","v":8.235152395316641},{"$f":"[3]!cv_gaz(11,Y28,Y11,Y29,Y12,0.87)","v":15.095890474206236}]
[null,"Trim",null,{"$f":"[3]!Trim_From_Cv(D18/D15,D16)","v":0.84456089703109605},null,null,null,{"$f":"[3]!Trim_From_Cv(H18/H15,H16)","v":0.52172956728878139},{"$f":"[3]!Trim_From_Cv(I18/I15,I16)","v":0.52376085664233774},{"$f":"[3]!Trim_From_Cv(J18/J15,J16)","v":0.52630584437268313},{"$f":"[3]!Trim_From_Cv(K18/K15,K16)","v":0.53146765173655774},{"$f":"[3]!Trim_From_Cv(L18/L15,L16)","v":0.53620751940282274},{"$f":"[3]!Trim_From_Cv(M18/M15,M16)","v":0.54252932008409571},{"$f":"[3]!Trim_From_Cv(N18/N15,N16)","v":0.55128771801287346},{"$f":"[3]!Trim_From_Cv(O18/O15,O16)","v":0.56415371370327283},{"$f":"[3]!Trim_From_Cv(P18/P15,P16)","v":0.58504141086586525},{"$f":"[3]!Trim_From_Cv(Q18/Q15,Q16)","v":0.62689555073879311},{"$f":"[3]!Trim_From_Cv(R18/R15,R16)","v":0.6356473639418132},{"$f":"[3]!Trim_From_Cv(S18/S15,S16)","v":0.64595323440264529},{"$f":"[3]!Trim_From_Cv(T18/T15,T16)","v":0.65836883654705802},{"$f":"[3]!Trim_From_Cv(U18/U15,U16)","v":0.67379887341878419},{"$f":"[3]!Trim_From_Cv(V18/V15,V16)","v":0.69386349472615638},{"$f":"[3]!Trim_From_Cv(W18/W15,W16)","v":0.72191958587447169},{"$f":"[3]!Trim_From_Cv(X18/X15,X16)","v":0.7669697720119184},{"$f":"[3]!Trim_From_Cv(Y18/Y15,Y16)","v":0.87586012534054936}]
[]
[]
[]
[null,"TURBINE 1"]
[]
[null,null,null,"DESIGN",null,null,null,"start-up","start-up","start-up","start-up","start-up","start-up","start-up","start-up","start-up","start-up"]
[]
[null,"m","g/s",191.5,null,null,null,{"$f":"H41*H29/H30^0.5","v":89.240935826493427},92.241881020687188,95.647964911157828,101.7527223113034,106.71920677945342,112.69235518470391,120.08198591056735,129.58803039064682,142.54574852921488,161.98625233094222,165.18914467162824,168.64128853373413,172.37945217950357,176.44884783100846,180.90588353632617,185.82212039686431,191.29013393552344,197.43247984118725]
[null,"Pin","Bara",14.77,null,null,null,9.7303403486508984,9.8028841166333951,9.8937493621375445,10.077131525885886,10.243711891746615,10.462304942125233,10.757061795596007,11.170402268089779,11.785611112555721,12.797399420864503,12.972523758981854,13.16360258156527,13.373094999700537,13.604035121667719,13.860221195985211,14.146488046062437,14.469111319801026,14.83642688716475]
[null,"Tin","K",40.03,null,null,null,80,{"$f":"H30-4","v":76},{"$f":"I30-4","v":72},66,62,58,54,50,46,42,{"$f":"Q30-0.5","v":41.5},{"$f":"R30-0.5","v":41},40.5,40,39.5,39,38.5,38]
[null,"Pout","Bara",6.36,null,null,null,{"$f":"H64","v":4.8611803786639429},4.8693514385585583,4.881990177216764,4.9130637687379588,4.9457777111148831,4.9932641526823787,5.0633001662480153,5.1699190045544059,5.3414192726405281,5.6457491347923821,{"$f":"R64","v":5.7005047579863737},5.7608224612458026,5.8275921609718768,5.9019153476654225,{"$f":"V64","v":5.9851753682022801},6.0791388401038642,6.1861064588873731,6.3091445919169935]
[null,"Tout","K",{"$f":"[3]!T2_turb(11,D29,D30,D31,D33)","v":31.094586910112792},null,null,null,{"$f":"[3]!T2_turb(11,H29,H30,H31,H33)","v":66.26207257386136},{"$f":"[3]!T2_turb(11,I29,I30,I31,I33)","v":62.685949527727971},{"$f":"[3]!T2_turb(11,J29,J30,J31,J33)","v":59.122712416246827},{"$f":"[3]!T2_turb(11,K29,K30,K31,K33)","v":53.803819897507616},{"$f":"[3]!T2_turb(11,L29,L30,L31,L33)","v":50.276397438897376},{"$f":"[3]!T2_turb(11,M29,M30,M31,M33)","v":46.764632754845891},{"$f":"[3]!T2_turb(11,N29,N30,N31,N33)","v":43.268977108660906},{"$f":"[3]!T2_turb(11,O29,O30,O31,O33)","v":39.78924801695419},{"$f":"[3]!T2_turb(11,P29,P30,P31,P33)","v":36.323763953436277},{"$f":"[3]!T2_turb(11,Q29,Q30,Q31,Q33)","v":32.866985893659795},{"$f":"[3]!T2_turb(11,R29,R30,R31,R33)","v":32.43488051662716},{"$f":"[3]!T2_turb(11,S29,S30,S31,S33)","v":32.002625179927065},{"$f":"[3]!T2_turb(11,T29,T30,T31,T33)","v":31.570152846024563},{"$f":"[3]!T2_turb(11,U29,U30,U31,U33)","v":31.13738356248794},{"$f":"[3]!T2_turb(11,V29,V30,V31,V33)","v":30.704221148752286},{"$f":"[3]!T2_turb(11,W29,W30,W31,W33)","v":30.270548701052626},{"$f":"[3]!T2_turb(11,X29,X30,X31,X33)","v":29.836222367707588},{"$f":"[3]!T2_turb(11,Y29,Y30,Y31,Y33)","v":29.401062569758071}]
[null,"Efficacity","%",0.78,null,null,null,{"$f":"(0.321*H55^4-1.6098*H55^3+1.316*H55^2+0.9448*H55)*($D$33/0.97215493)","v":0.71244306313186256},{"$f":"(0.321*I55^4-1.6098*I55^3+1.316*I55^2+0.9448*I55)*($D$33/0.97215493)","v":0.72150652369888379},0.7304755833371277,0.74354615694171233,0.75182065691706701,0.75954738283124834,0.76650239252378305,0.77239817818647472,0.77687216580188656,0.77949230067234387,{"$f":"(0.321*R55^4-1.6098*R55^3+1.316*R55^2+0.9448*R55)*($D$33/0.97215493)","v":0.77966724514469299},0.77980580491105245,0.77990747889990819,0.77997193336167769,{"$f":"(0.321*V55^4-1.6098*V55^3+1.316*V55^2+0.9448*V55)*($D$33/0.97215493)","v":0.77999905905380928},0.77998904922991719,0.77994250839431545,0.77986060797742085]
[null,"Power","W",{"$f":"+D28*(D45-D46)","v":9122.4436160855366},null,null,null,{"$f":"+H28*(H45-H46)","v":6493.040253146135},6507.3748748966182,6529.5472173087837,6584.0601202491152,6641.4507140008336,6724.7569428635015,6847.6222492632023,7034.6653909980778,7335.5310703158502,7869.4218405401161,7965.4805056850773,8071.2968199577072,8188.4319755721008,8318.8183458983367,8464.8827494618454,8629.724378541825,8817.379386213217,9033.2271602769451]
[null,"Speed","Hz",1995,null,null,null,1995,1995,1995,1995,1995,1995,1995,1995,1995,1995,1995,1995,1995,1995,1995,1995,1995,1995]
[null,"Speed calculated from P=K.rho.N^3",null,null,null,null,null,{"$f":"(H34/$D34*$D38/H38)^(1/3)*$D35","v":1994.9999999810127},1994.9999999796835,1994.9999999749607,1995.0000001439248,1995.0000000024156,1995.0000000852592,1995.0000002411759,1995.0000001649325,1995.0000002748548,1995.0000002073709,1994.9999997794641,1994.9999995792584,1994.9999994006878,1995.0000001128817,1995.0000009525615,1995.0000008872719,1995.0000004157534,1995.0000003200303]
[null,"Delta Speed Frein & Turbine",null,{"$f":"D31-D38","v":1.1600000000000001},null,null,null,{"$f":"H35-H36","v":1.898729351523798E-8},{"$f":"I35-I36","v":2.0316520021879114E-8},2.5039298634510487E-8,-1.4392480807146057E-7,-2.4156179279088974E-9,-8.5259216575650498E-8,-2.4117593966366258E-7,-1.6493254406668711E-7,-2.7485475584398955E-7,-2.0737093109346461E-7,{"$f":"R35-R36","v":2.2053586690162774E-7},4.2074157136084978E-7,5.9931221585429739E-7,-1.1288170753687155E-7,{"$f":"V35-V36","v":-9.5256154963863082E-7},-8.8727188085613307E-7,-4.1575344766897615E-7,-3.2003026717575267E-7]
[null,"Brake Pressure",null,5.2,null,null,null,{"$f":"($D38-$D31)+H31","v":3.7011803786639428},3.7093514385585582,3.7219901772167638,3.7530637687379587,3.7857777111148829,3.8332641526823785,3.9033001662480151,4.0099190045544058,4.1814192726405279,4.4857491347923819,4.5405047579863735,4.6008224612458024,4.6675921609718767,4.7419153476654223,4.82517536820228,4.919138840103864,5.026106458887373,5.1491445919169934]
[null,"Rho (brake)",null,{"$f":"[3]!rho_(11,D38,330)","v":0.75697464940773784},null,null,null,{"$f":"[3]!rho_(11,H38,330)","v":0.53911899755141035},{"$f":"[3]!rho_(11,I38,330)","v":0.54030739824463503},{"$f":"[3]!rho_(11,J38,330)","v":0.54214556342679965},{"$f":"[3]!rho_(11,K38,330)","v":0.54666479380443866},{"$f":"[3]!rho_(11,L38,330)","v":0.5514224665906603},{"$f":"[3]!rho_(11,M38,330)","v":0.55832831514530123},{"$f":"[3]!rho_(11,N38,330)","v":0.56851300815502748},{"$f":"[3]!rho_(11,O38,330)","v":0.58401648329463018},{"$f":"[3]!rho_(11,P38,330)","v":0.60895154562504872},{"$f":"[3]!rho_(11,Q38,330)","v":0.65319057732983643},{"$f":"[3]!rho_(11,R38,330)","v":0.6611489801396303},{"$f":"[3]!rho_(11,S38,330)","v":0.6699153850309375},{"$f":"[3]!rho_(11,T38,330)","v":0.6796189999681892},{"$f":"[3]!rho_(11,U38,330)","v":0.69041973633186571},{"$f":"[3]!rho_(11,V38,330)","v":0.70251840370540597},{"$f":"[3]!rho_(11,W38,330)","v":0.71617141868355016},{"$f":"[3]!rho_(11,X38,330)","v":0.73171267461372347},{"$f":"[3]!rho_(11,Y38,330)","v":0.74958712187058896}]
[null,"Wheel","mm",35.799999999999997,null,null,null,{"$f":"$D$40","v":35.799999999999997},{"$f":"$D$40","v":35.799999999999997},35.799999999999997,35.799999999999997,35.799999999999997,35.799999999999997,35.799999999999997,35.799999999999997,35.799999999999997,35.799999999999997,35.799999999999997,35.799999999999997,35.799999999999997,35.799999999999997,35.799999999999997,35.799999999999997,35.799999999999997,35.799999999999997]
[null,"a = mÖT/P",null,{"$f":"D28*D30^0.5/D29","v":82.031580287488268},null,null,null,{"$f":"+$D$41","v":82.031580287488268},{"$f":"+$D$41","v":82.031580287488268},82.031580287488268,82.031580287488268,82.031580287488268,82.031580287488268,82.031580287488268,82.031580287488268,82.031580287488268,82.031580287488268,82.031580287488268,82.031580287488268,82.031580287488268,82.031580287488268,82.031580287488268,82.031580287488268,82.031580287488268,82.031580287488268,null,null,null,null,null,null,null,null,null,null,null,"T1 out",63,31,"x"]
[null,"Rho (in)","kg/m3",{"$f":"[3]!rho_(11,D29,D30)","v":17.087672541642732},null,null,null,{"$f":"[3]!rho_(11,H29,H30)","v":5.7555168615424357},{"$f":"[3]!rho_(11,I29,I30)","v":6.0982917528727665},{"$f":"[3]!rho_(11,J29,J30)","v":6.4904975724958094},{"$f":"[3]!rho_(11,K29,K30)","v":7.19985259599685},{"$f":"[3]!rho_(11,L29,L30)","v":7.7810966770108561},{"$f":"[3]!rho_(11,M29,M30)","v":8.4828229066841523},{"$f":"[3]!rho_(11,N29,N30)","v":9.3519905891128694},{"$f":"[3]!rho_(11,O29,O30)","v":10.467011044747862},{"$f":"[3]!rho_(11,P29,P30)","v":11.973325917509028},{"$f":"[3]!rho_(11,Q29,Q30)","v":14.189691783084196},{"$f":"[3]!rho_(11,R29,R30)","v":14.549095894995501},{"$f":"[3]!rho_(11,S29,S30)","v":14.934571603767919},{"$f":"[3]!rho_(11,T29,T30)","v":15.349753891698512},{"$f":"[3]!rho_(11,U29,U30)","v":15.79908441227159},{"$f":"[3]!rho_(11,V29,V30)","v":16.288068677425454},{"$f":"[3]!rho_(11,W29,W30)","v":16.823644158629577},{"$f":"[3]!rho_(11,X29,X30)","v":17.414722775561259},{"$f":"[3]!rho_(11,Y29,Y30)","v":18.073016374672587},null,null,null,null,null,null,null,null,null,null,null,"T2 in",62,18,"y"]
[null,"Sound Speed @inlet",null,{"$f":"[3]!Sound_speed(11,D29,D30)","v":391.2334216977045},null,null,null,{"$f":"[3]!Sound_speed(11,H29,H30)","v":535.59028692683853},{"$f":"[3]!Sound_speed(11,I29,I30)","v":522.58331366954212},{"$f":"[3]!Sound_speed(11,J29,J30)","v":509.25707950766298},{"$f":"[3]!Sound_speed(11,K29,K30)","v":488.62137721921403},{"$f":"[3]!Sound_speed(11,L29,L30)","v":474.39995156477397},{"$f":"[3]!Sound_speed(11,M29,M30)","v":459.78117196162543},{"$f":"[3]!Sound_speed(11,N29,N30)","v":444.74807915139166},{"$f":"[3]!Sound_speed(11,O29,O30)","v":429.29925981866364},{"$f":"[3]!Sound_speed(11,P29,P30)","v":413.47783122229521},{"$f":"[3]!Sound_speed(11,Q29,Q30)","v":397.46820847483536},{"$f":"[3]!Sound_speed(11,R29,R30)","v":395.47799777005798},{"$f":"[3]!Sound_speed(11,S29,S30)","v":393.49681203060476},{"$f":"[3]!Sound_speed(11,T29,T30)","v":391.52793825998316},{"$f":"[3]!Sound_speed(11,U29,U30)","v":389.57549536417565},{"$f":"[3]!Sound_speed(11,V29,V30)","v":387.64471272983729},{"$f":"[3]!Sound_speed(11,W29,W30)","v":385.74233251170807},{"$f":"[3]!Sound_speed(11,X29,X30)","v":383.8772080268385},{"$f":"[3]!Sound_speed(11,Y29,Y30)","v":382.06122307408418},null,null,null,null,null,null,null,null,null,null,null,"slope",{"$f":"SLOPE(AL42:AM42,AL41:AM41)","v":1.375}]
[null,"S=Q/(rho*V) = cte",null,{"$f":"D28/(D42*D43)","v":2.8645071953707371E-2},null,null,null,{"$f":"H28/(H42*H43)","v":2.8949901667898816E-2},2.8944390867796058E-2,2.8937477260906386E-2,2.8923441617505655E-2,2.891060241753584E-2,2.8893680890140331E-2,2.8870859913145499E-2,2.8839124170815501E-2,2.8793021062825577E-2,2.872121436009982E-2,2.8709337537002274E-2,2.86965656425071E-2,2.8682785299181179E-2,2.866786005997899E-2,2.8651623449606967E-2,2.8633869104180039E-2,2.8614336391318509E-2,2.8592688754042469E-2,null,null,null,null,null,null,null,null,null,null,null,"intercept",{"$f":"INTERCEPT(AL42:AM42,AL41:AM41)","v":-24.625}]
[null,"Hin",null,{"$f":"[3]!h_(11,D29,D30)","v":223.57106614117126},null,null,null,{"$f":"[3]!h_(11,H29,H30)","v":433.14130806490056},{"$f":"[3]!h_(11,I29,I30)","v":412.28780837150464},{"$f":"[3]!h_(11,J29,J30)","v":391.42240219138097},{"$f":"[3]!h_(11,K29,K30)","v":360.09597164241666},{"$f":"[3]!h_(11,L29,L30)","v":339.18727578243715},{"$f":"[3]!h_(11,M29,M30)","v":318.25274418907128},{"$f":"[3]!h_(11,N29,N30)","v":297.28434837717924},{"$f":"[3]!h_(11,O29,O30)","v":276.27001547205668},{"$f":"[3]!h_(11,P29,P30)","v":255.19026741778114},{"$f":"[3]!h_(11,Q29,Q30)","v":234.00999262491322},{"$f":"[3]!h_(11,R29,R30)","v":231.35239894925536},{"$f":"[3]!h_(11,S29,S30)","v":228.69195383292379},{"$f":"[3]!h_(11,T29,T30)","v":226.02840016111742},{"$f":"[3]!h_(11,U29,U30)","v":223.3614407670874},{"$f":"[3]!h_(11,V29,V30)","v":220.69072892714823},{"$f":"[3]!h_(11,W29,W30)","v":218.01585571705743},{"$f":"[3]!h_(11,X29,X30)","v":215.33633290287648},{"$f":"[3]!h_(11,Y29,Y30)","v":212.6515692894715},null,null,null,null,null,null,null,null,null,null,null,"x","y"]
[null,"Hout",null,{"$f":"[3]!h_(11,D31,D32)","v":175.9342848561293},null,null,null,{"$f":"[3]!h_(11,H31,H32)","v":360.38276745781616},{"$f":"[3]!h_(11,I31,I32)","v":341.74095044872223},{"$f":"[3]!h_(11,J31,J32)","v":323.15595006797486},{"$f":"[3]!h_(11,K31,K32)","v":295.38949528785025},{"$f":"[3]!h_(11,L31,L32)","v":276.95432902032246},{"$f":"[3]!h_(11,M31,M32)","v":258.57915824048092},{"$f":"[3]!h_(11,N31,N32)","v":240.25978971970451},{"$f":"[3]!h_(11,O31,O32)","v":221.98517627979581},{"$f":"[3]!h_(11,P31,P32)","v":203.72937752100231},{"$f":"[3]!h_(11,Q31,Q32)","v":185.42919192546449},{"$f":"[3]!h_(11,R31,R32)","v":183.13203603425097},{"$f":"[3]!h_(11,S31,S32)","v":180.83121409276717},{"$f":"[3]!h_(11,T31,T32)","v":178.52603330682868},{"$f":"[3]!h_(11,U31,U32)","v":176.21566198668089},{"$f":"[3]!h_(11,V31,V32)","v":173.89909018112544},{"$f":"[3]!h_(11,W31,W32)","v":171.57507482342035},{"$f":"[3]!h_(11,X31,X32)","v":169.2420613123447},{"$f":"[3]!h_(11,Y31,Y32)","v":166.89806830755006},null,null,null,null,null,null,null,null,null,null,null,277,{"$f":"m*AK46+p","v":356.25}]
[null,"Sin = Sout",null,{"$f":"[3]!S_(11,D29,D30)","v":15.488244062210457},null,null,null,{"$f":"[3]!S_(11,H29,H30)","v":20.01562118310105},{"$f":"[3]!S_(11,I29,I30)","v":19.732505616083731},{"$f":"[3]!S_(11,J29,J30)","v":19.430946493965195},{"$f":"[3]!S_(11,K29,K30)","v":18.937734332412656},{"$f":"[3]!S_(11,L29,L30)","v":18.57613609839909},{"$f":"[3]!S_(11,M29,M30)","v":18.182227457665064},{"$f":"[3]!S_(11,N29,N30)","v":17.748496073484809},{"$f":"[3]!S_(11,O29,O30)","v":17.263769977421802},{"$f":"[3]!S_(11,P29,P30)","v":16.709765263523995},{"$f":"[3]!S_(11,Q29,Q30)","v":16.051486138016557},{"$f":"[3]!S_(11,R29,R30)","v":15.958636607834118},{"$f":"[3]!S_(11,S29,S30)","v":15.86271487892351},{"$f":"[3]!S_(11,T29,T30)","v":15.763396197691039},{"$f":"[3]!S_(11,U29,U30)","v":15.660291125774306},{"$f":"[3]!S_(11,V29,V30)","v":15.552926123564552},{"$f":"[3]!S_(11,W29,W30)","v":15.440716141003705},{"$f":"[3]!S_(11,X29,X30)","v":15.322924765222192},{"$f":"[3]!S_(11,Y29,Y30)","v":15.198604497007498},null,null,null,null,null,null,null,null,null,null,null,31,{"$f":"m*AK47+p","v":18}]
[null,"Tout(iso)",null,{"$f":"[1]!HeCalc(2,0,1,D31*10^5,8,D47*1000,1)","v":28.580768861485691},null,null,null,{"$f":"[1]!HeCalc(2,0,1,H31*10^5,8,H47*1000,1)","v":60.629926357654455},{"$f":"[1]!HeCalc(2,0,1,I31*10^5,8,I47*1000,1)","v":57.466628480689572},{"$f":"[1]!HeCalc(2,0,1,J31*10^5,8,J47*1000,1)","v":54.29818007316576},{"$f":"[1]!HeCalc(2,0,1,K31*10^5,8,K47*1000,1)","v":49.534925244288196},{"$f":"[1]!HeCalc(2,0,1,L31*10^5,8,L47*1000,1)","v":46.351521044004926},{"$f":"[1]!HeCalc(2,0,1,M31*10^5,8,M47*1000,1)","v":43.160811516301905},{"$f":"[1]!HeCalc(2,0,1,N31*10^5,8,N47*1000,1)","v":39.961483812341818},{"$f":"[1]!HeCalc(2,0,1,O31*10^5,8,O47*1000,1)","v":36.751425276763769},{"$f":"[1]!HeCalc(2,0,1,P31*10^5,8,P47*1000,1)","v":33.526903935128971},{"$f":"[1]!HeCalc(2,0,1,Q31*10^5,8,Q47*1000,1)","v":30.280389206499791},{"$f":"[1]!HeCalc(2,0,1,R31*10^5,8,R47*1000,1)","v":29.872327425857858},{"$f":"[1]!HeCalc(2,0,1,S31*10^5,8,S47*1000,1)","v":29.463612136169761},{"$f":"[1]!HeCalc(2,0,1,T31*10^5,8,T47*1000,1)","v":29.05417622202798},{"$f":"[1]!HeCalc(2,0,1,U31*10^5,8,U47*1000,1)","v":28.643940649326506},{"$f":"[1]!HeCalc(2,0,1,V31*10^5,8,V47*1000,1)","v":28.232811421690801},{"$f":"[1]!HeCalc(2,0,1,W31*10^5,8,W47*1000,1)","v":27.820675444335478},{"$f":"[1]!HeCalc(2,0,1,X31*10^5,8,X47*1000,1)","v":27.407394792476449},{"$f":"[1]!HeCalc(2,0,1,Y31*10^5,8,Y47*1000,1)","v":26.992798647056564},null,null,null,null,null,null,null,null,null,null,null,31,{"$f":"m*AK48+p","v":18}]
[null,"Hout(iso)",null,{"$f":"[3]!h_(11,D31,D48)","v":162.49826962188638},null,null,null,{"$f":"[3]!h_(11,H31,H48)","v":331.01589710610523},{"$f":"[3]!h_(11,I31,I48)","v":314.51064959944523},{"$f":"[3]!h_(11,J31,J48)","v":297.96759866251341},{"$f":"[3]!h_(11,K31,K48)","v":273.07181618082257},{"$f":"[3]!h_(11,L31,L48)","v":256.41095647071643},{"$f":"[3]!h_(11,M31,M48)","v":239.68807884040751},{"$f":"[3]!h_(11,N31,N48)","v":222.88854842446693},{"$f":"[3]!h_(11,O31,O48)","v":205.98911538019337},{"$f":"[3]!h_(11,P31,P48)","v":188.9491377157523},{"$f":"[3]!h_(11,Q31,Q48)","v":171.68634855871022},{"$f":"[3]!h_(11,R31,R48)","v":169.50503622458999},{"$f":"[3]!h_(11,S31,S48)","v":167.3167506236891},{"$f":"[3]!h_(11,T31,T48)","v":165.12070515953474},{"$f":"[3]!h_(11,U31,U48)","v":162.91595963649272},{"$f":"[3]!h_(11,V31,V48)","v":160.70137611589689},{"$f":"[3]!h_(11,W31,W48)","v":158.47555711993181},{"$f":"[3]!h_(11,X31,X48)","v":156.23675685152438},{"$f":"[3]!h_(11,Y31,Y48)","v":153.9827501262825}]
[null,"ΔHs",null,{"$f":"D45-D49","v":61.072796519284879},null,null,null,102.12541095879533,{"$f":"I45-I49","v":97.777158772059408},93.454803528867558,87.024155461594091,82.776319311720727,78.564665348663766,74.395799952712309,70.280900091863316,66.241129702028843,62.323644066203002,{"$f":"R45-R49","v":61.847362724665373},61.375203209234684,60.907695001582681,60.445481130594686,{"$f":"V45-V49","v":59.989352811251337},59.540298597125627,59.099576051352102,58.668819163188999]
[null,"u1","m/s",{"$f":"(2*52.7%*D50*1000*D33)^0.5","v":224.07402231056255},null,null,null,{"$f":"PI()*$D$52*H35","v":224.07402231056253},{"$f":"PI()*$D$52*I35","v":224.07402231056253},224.07402231056253,224.07402231056253,224.07402231056253,224.07402231056253,224.07402231056253,224.07402231056253,224.07402231056253,224.07402231056253,{"$f":"PI()*$D$52*R35","v":224.07402231056253},224.07402231056253,224.07402231056253,224.07402231056253,{"$f":"PI()*$D$52*V35","v":224.07402231056253},224.07402231056253,224.07402231056253,224.07402231056253]
[null,"D1",null,{"$f":"D51/PI()/D35","v":3.5751867939057311E-2}]
[null,"Co = (2*ΔHs)^0,5",null,{"$f":"(2000*D50)^0.5","v":349.49333761685608},null,null,null,451.94117085920669,{"$f":"(2000*I50)^0.5","v":442.21523893248957},432.33043734825696,417.1909765601219,406.88160270948777,396.39542214476637,385.7351421706669,374.91572410840098,363.98112506565184,353.05422831684939,{"$f":"(2000*R50)^0.5","v":351.70260938658208},350.35754083288884,349.02061544150274,347.69377656378805,{"$f":"(2000*V50)^0.5","v":346.37942436366319},345.08056623671416,343.80103563355391,342.54581930944363]
[null,"u1/Co",null,{"$f":"D51/D53","v":0.64113961038138956},null,null,null,0.49580351771130926,{"$f":"I51/I53","v":0.50670805205962299},0.51829342316248539,0.53710179486173748,0.55071062642896318,0.56527903651906741,0.58090123977198305,0.59766504283980115,0.61561989586725396,0.63467310214301342,{"$f":"R51/R53","v":0.63711219743685887},0.63955815472925648,0.64200798576644025,0.64445796103990316,{"$f":"V51/V53","v":0.64690338556399807},0.64933828280800654,0.65175493697289377,0.65414321144623888]
[null,"U1/C0 off de / U1/C0 nom",null,{"$f":"D54/$D$54","v":1},null,null,null,{"$f":"H54/$D54","v":0.77331599808093998},{"$f":"I54/$D54","v":0.79032404776582377},0.80839401398733168,0.83772985815403922,0.85895586158117165,0.8816785414066125,0.90604484634232318,0.9321917304162084,0.96019632214120276,0.98991404035303721,{"$f":"R54/$D54","v":0.99371835263440522},0.99753336773063772,1.0013544247945219,1.005175706827004,{"$f":"V54/$D54","v":1.0089898909524244},1.0127876554401933,1.0165569657834579,1.0202820116777904]
[null,"Rdt",null,{"$f":"(0.321*D55^4-1.6098*D55^3+1.316*D55^2+0.9448*D55)*($D33/0.97215493)","v":0.77987569327041328},null,null,null,{"$f":"(0.321*H55^4-1.6098*H55^3+1.316*H55^2+0.9448*H55)*($D33/0.97)","v":0.71402581048241387},0.72310940622786768,0.73209839132558208,0.74519800222004062,0.75349088463687142,0.76123477607009837,0.76820523685442355,0.77411412046082462,0.77859804738565097,0.78122400308831075,0.7813993362133318,0.78153820380092565,0.78164010366640901,0.78170470131874892,0.78173188727270293,0.78172185521121307,0.78167521098154658,0.78159312861654329]
[]
[]
[null,"TURBINE 2"]
[null,null,null,null,null,null,null,5]
[null,null,null,"DESIGN",null,null,null,{"$f":"H26","v":"start-up"},{"$f":"I26","v":"start-up"},"start-up","start-up","start-up","start-up","start-up","start-up","start-up","start-up",{"$f":"R26","v":0},0,0,0,{"$f":"V26","v":0},0,0,0]
[null,"Delta Debit",null,null,null,null,null,{"$f":"H63-H28","v":-12.115294719387791},-11.960840980623402,-11.7512042031519,-11.282482297350541,-10.812275887263567,-10.141660781147493,-9.1571729993420377,-7.6533618867704405,-5.2227292045968738,-0.93837038124681271,-0.17844016627137194,0.65335373126669083,1.5670103078157354,2.5745351242336767,3.6905071610476341,4.9328653360027488,6.3240291490754146,7.8925469638173524]
[null,"m","g/s",191.20000000000002,null,null,null,{"$f":"H76*H64/H65^0.5","v":77.125641107105636},{"$f":"I76*I64/I65^0.5","v":80.281040040063786},83.896760708005928,90.470240013952861,95.906930892189848,102.55069440355642,110.92481291122532,121.93466850387638,137.323019324618,161.04788194969541,{"$f":"R76*R64/R65^0.5","v":165.01070450535687},{"$f":"S76*S64/S65^0.5","v":169.29464226500082},{"$f":"T76*T64/T65^0.5","v":173.94646248731931},{"$f":"U76*U64/U65^0.5","v":179.02338295524214},{"$f":"V76*V64/V65^0.5","v":184.59639069737381},{"$f":"W76*W64/W65^0.5","v":190.75498573286706},{"$f":"X76*X64/X65^0.5","v":197.61416308459886},{"$f":"Y76*Y64/Y65^0.5","v":205.3250268050046}]
[null,"Pin","Bara",6.3070000000000004,null,null,null,4.8611803786639429,4.8693514385585583,4.881990177216764,4.9130637687379588,4.9457777111148831,4.9932641526823787,5.0633001662480153,5.1699190045544059,5.3414192726405281,5.6457491347923821,5.7005047579863737,5.7608224612458026,5.8275921609718768,5.9019153476654225,5.9851753682022801,6.0791388401038642,6.1861064588873731,6.3091445919169935]
[null,"Tin","K",18.21,null,null,null,{"$f":"m*H32+p","v":66.48534978905937},{"$f":"m*I32+p","v":61.568180600625965},56.668729572339387,49.355252359072978,44.505046478483891,39.676370037913102,34.869843524408743,30.085216023312014,25.320175435974882,{"$f":"m*Q32+p","v":20.567105603782217},19.972960710362344,19.378609622399715,18.783960163283773,18.188902398420922,17.593304079534391,16.997004463947363,16.399805755597932,15.801461033417347]
[null,"Pout","Bara",1.35,null,null,null,1.1499999999999999,1.1499999999999999,1.1499999999999999,1.1499999999999999,1.1499999999999999,1.1499999999999999,1.1499999999999999,1.1499999999999999,1.1499999999999999,1.1499999999999999,1.1499999999999999,1.1499999999999999,1.1499999999999999,1.1499999999999999,1.1499999999999999,1.1499999999999999,1.1499999999999999,1.1499999999999999]
[null,"Tout","K",{"$f":"[3]!T2_turb(11,D64,D65,D66,D68)","v":11.618357475588732},null,null,null,{"$f":"[3]!T2_turb(11,H64,H65,H66,H68)","v":51.693240397603432},{"$f":"[3]!T2_turb(11,I64,I65,I66,I68)","v":47.352444352911981},{"$f":"[3]!T2_turb(11,J64,J65,J66,J68)","v":43.058400969883103},{"$f":"[3]!T2_turb(11,K64,K65,K66,K68)","v":36.717056599420516},{"$f":"[3]!T2_turb(11,L64,L65,L66,L68)","v":32.565860813113616},{"$f":"[3]!T2_turb(11,M64,M65,M66,M68)","v":28.485618276037787},{"$f":"[3]!T2_turb(11,N64,N65,N66,N68)","v":24.486994466221351},{"$f":"[3]!T2_turb(11,O64,O65,O66,O68)","v":20.5832029382698},{"$f":"[3]!T2_turb(11,P64,P65,P66,P68)","v":16.790318034891868},{"$f":"[3]!T2_turb(11,Q64,Q65,Q66,Q68)","v":13.125572102451054},{"$f":"[3]!T2_turb(11,R64,R65,R66,R68)","v":12.677086928580154},{"$f":"[3]!T2_turb(11,S64,S65,S66,S68)","v":12.230711821463579},{"$f":"[3]!T2_turb(11,T64,T65,T66,T68)","v":11.786390759819342},{"$f":"[3]!T2_turb(11,U64,U65,U66,U68)","v":11.344034200589419},{"$f":"[3]!T2_turb(11,V64,V65,V66,V68)","v":10.903506472478442},{"$f":"[3]!T2_turb(11,W64,W65,W66,W68)","v":10.464607593488596},{"$f":"[3]!T2_turb(11,X64,X65,X66,X68)","v":10.027046326412488},{"$f":"[3]!T2_turb(11,Y64,Y65,Y66,Y68)","v":9.5903993039665707}]
[null,"Efficacity","%",0.76,null,null,null,{"$f":"(0.321*H90^4-1.6098*H90^3+1.316*H90^2+0.9448*H90)*($D$68/0.97215493)","v":0.51009692899935322},{"$f":"(0.321*I90^4-1.6098*I90^3+1.316*I90^2+0.9448*I90)*($D$68/0.97215493)","v":0.52860604588210169},0.54871853876323895,0.58227698186897314,0.60715163225203528,0.63415601410632827,0.66322653737460568,0.69388656592558695,0.72461052751481636,0.75094647665398517,{"$f":"(0.321*R90^4-1.6098*R90^3+1.316*R90^2+0.9448*R90)*($D$68/0.97215493)","v":0.75343044192121955},0.75561275023008778,0.75743684704083103,0.7588344063745277,{"$f":"(0.321*V90^4-1.6098*V90^3+1.316*V90^2+0.9448*V90)*($D$68/0.97215493)","v":0.75972199554180075},0.7599964341290173,0.75952815675156971,0.75815141173528433]
[null,"Power","W",{"$f":"+D63*(D80-D81)","v":6144.650345780522},null,null,null,5991.0340876816708,{"$f":"+I63*(I80-I81)","v":5991.0340876527944},5991.0340877352901,5991.0340815718973,5991.0340870474874,5991.0340871210819,5991.0340870803875,5991.0340870872615,5991.0340870257332,5991.0340870384134,{"$f":"+R63*(R80-R81)","v":5991.034090852113},5991.0340942792427,5991.0340973679304,5991.0340870880063,{"$f":"+V63*(V80-V81)","v":5991.0340867665282},5991.0340868390585,5991.0340870248547,5991.0340870881473]
[null,"Speed","Hz",1496,null,null,null,1496,1496,1496,1496,1496,1496,1496,1496,1496,1496,1496,1496,1496,1496,1496,1496,1496,1496]
[null,null,null,null,null,null,null,{"$f":"(H69/$D69*$D73/H73)^(1/3)*$D70","v":1496.0000000454186},{"$f":"(I69/$D69*$D73/I73)^(1/3)*$D70","v":1496.0000000430148},1496.0000000498812,1495.9999995368685,1495.9999999926317,1495.9999999987574,1495.9999999953702,1495.9999999959425,1495.9999999908212,1495.9999999918766,{"$f":"(R69/$D69*$D73/R73)^(1/3)*$D70","v":1496.0000003093119},1496.0000005945703,1496.000000851659,1495.9999999960044,{"$f":"(V69/$D69*$D73/V73)^(1/3)*$D70","v":1495.9999999692461},1495.9999999752831,1495.9999999907479,1495.9999999960162]
[null,"Delta Speed Frein & Turbine",null,null,null,null,null,{"$f":"H70-H71","v":-4.5418573790811934E-8},{"$f":"I70-I71","v":-4.3014779294026084E-8},-4.9881236918736249E-8,4.6313152779475786E-7,7.3682713264133781E-9,1.2425971362972632E-9,4.6297827793750912E-9,4.0574832382844761E-9,9.178847903967835E-9,{"$f":"Q70-Q71","v":8.1233793025603518E-9},{"$f":"R70-R71","v":-3.0931187211535871E-7},-5.9457033785292879E-7,-8.5165902419248596E-7,3.995637598563917E-9,{"$f":"V70-V71","v":3.0753881219425239E-8},{"$f":"W70-W71","v":2.4716882762731984E-8},{"$f":"X70-X71","v":9.2520622274605557E-9},{"$f":"Y70-Y71","v":3.9838141674408689E-9}]
[null,"Brake Pressure",null,8,null,null,null,{"$f":"($D73-$D66)+H66","v":7.8000000000000007},{"$f":"($D73-$D66)+I66","v":7.8000000000000007},7.8000000000000007,7.8000000000000007,7.8000000000000007,7.8000000000000007,7.8000000000000007,7.8000000000000007,7.8000000000000007,7.8000000000000007,{"$f":"($D73-$D66)+R66","v":7.8000000000000007},7.8000000000000007,7.8000000000000007,7.8000000000000007,{"$f":"($D73-$D66)+V66","v":7.8000000000000007},7.8000000000000007,7.8000000000000007,7.8000000000000007]
[null,"Rho (brake)",null,{"$f":"[3]!rho_(11,D73,330)","v":1.1632432504804469},null,null,null,{"$f":"[3]!rho_(11,H73,330)","v":1.1342549379241607},{"$f":"[3]!rho_(11,I73,330)","v":1.1342549379241607},{"$f":"[3]!rho_(11,J73,330)","v":1.1342549379241607},{"$f":"[3]!rho_(11,K73,330)","v":1.1342549379241607},{"$f":"[3]!rho_(11,L73,330)","v":1.1342549379241607},{"$f":"[3]!rho_(11,M73,330)","v":1.1342549379241607},{"$f":"[3]!rho_(11,N73,330)","v":1.1342549379241607},{"$f":"[3]!rho_(11,O73,330)","v":1.1342549379241607},{"$f":"[3]!rho_(11,P73,330)","v":1.1342549379241607},{"$f":"[3]!rho_(11,Q73,330)","v":1.1342549379241607},{"$f":"[3]!rho_(11,R73,330)","v":1.1342549379241607},{"$f":"[3]!rho_(11,S73,330)","v":1.1342549379241607},{"$f":"[3]!rho_(11,T73,330)","v":1.1342549379241607},{"$f":"[3]!rho_(11,U73,330)","v":1.1342549379241607},{"$f":"[3]!rho_(11,V73,330)","v":1.1342549379241607},{"$f":"[3]!rho_(11,W73,330)","v":1.1342549379241607},{"$f":"[3]!rho_(11,X73,330)","v":1.1342549379241607},{"$f":"[3]!rho_(11,Y73,330)","v":1.1342549379241607}]
[null,"Wheel","mm",39.5,null,null,null,{"$f":"$D$40","v":35.799999999999997},{"$f":"$D$40","v":35.799999999999997},35.799999999999997,35.799999999999997,35.799999999999997,35.799999999999997,35.799999999999997,35.799999999999997,35.799999999999997,35.799999999999997,35.799999999999997,35.799999999999997,35.799999999999997,35.799999999999997,35.799999999999997,35.799999999999997,35.799999999999997,35.799999999999997]
[null,"a = mÖT/P",null,{"$f":"D63*D65^0.5/D64","v":129.36596422035444},null,null,null,{"$f":"$D$76","v":129.36596422035444},129.36596422035444,129.36596422035444,129.36596422035444,129.36596422035444,129.36596422035444,129.36596422035444,129.36596422035444,129.36596422035444,129.36596422035444,129.36596422035444,129.36596422035444,129.36596422035444,129.36596422035444,129.36596422035444,129.36596422035444,129.36596422035444,129.36596422035444]
[null,"Rho (in)","kg/m3",{"$f":"[3]!rho_(11,D64,D65)","v":16.817250243896773},null,null,null,{"$f":"[3]!rho_(11,H64,H65)","v":3.4849388683231344},{"$f":"[3]!rho_(11,I64,I65)","v":3.7674473693343984},{"$f":"[3]!rho_(11,J64,J65)","v":4.1013358792179879},{"$f":"[3]!rho_(11,K64,K65)","v":4.7346866662819451},{"$f":"[3]!rho_(11,L64,L65)","v":5.2826426838271034},{"$f":"[3]!rho_(11,M64,M65)","v":5.9799300321293254},{"$f":"[3]!rho_(11,N64,N65)","v":6.8992687181104078},{"$f":"[3]!rho_(11,O64,O65)","v":8.1714182146186687},{"$f":"[3]!rho_(11,P64,P65)","v":10.060116857250442},{"$f":"[3]!rho_(11,Q64,Q65)","v":13.201419469649757},{"$f":"[3]!rho_(11,R64,R65)","v":13.75153503586453},{"$f":"[3]!rho_(11,S64,S65)","v":14.354094906567873},{"$f":"[3]!rho_(11,T64,T65)","v":15.017528527363433},{"$f":"[3]!rho_(11,U64,U65)","v":15.752281190518724},{"$f":"[3]!rho_(11,V64,V65)","v":16.571484198733668},{"$f":"[3]!rho_(11,W64,W65)","v":17.491921762209021},{"$f":"[3]!rho_(11,X64,X65)","v":18.535465975154494},{"$f":"[3]!rho_(11,Y64,Y65)","v":19.731275923202748}]
[null,"Sound Speed",null,{"$f":"[3]!Sound_speed(11,D64,D65)","v":258.39146376447951},null,null,null,{"$f":"[3]!Sound_speed(11,H64,H65)","v":484.87024700921472},{"$f":"[3]!Sound_speed(11,I64,I65)","v":466.97958776956682},{"$f":"[3]!Sound_speed(11,J64,J65)","v":448.43617740835174},{"$f":"[3]!Sound_speed(11,K64,K65)","v":419.20956711507318},{"$f":"[3]!Sound_speed(11,L64,L65)","v":398.62206349434712},{"$f":"[3]!Sound_speed(11,M64,M65)","v":376.97829777008803},{"$f":"[3]!Sound_speed(11,N64,N65)","v":354.06984864688832},{"$f":"[3]!Sound_speed(11,O64,O65)","v":329.59892654129015},{"$f":"[3]!Sound_speed(11,P64,P65)","v":303.10821756465009},{"$f":"[3]!Sound_speed(11,Q64,Q65)","v":273.81740970507252},{"$f":"[3]!Sound_speed(11,R64,R65)","v":269.89618752802619},{"$f":"[3]!Sound_speed(11,S64,S65)","v":265.9049938351539},{"$f":"[3]!Sound_speed(11,T64,T65)","v":261.83903218399689},{"$f":"[3]!Sound_speed(11,U64,U65)","v":257.69296887659203},{"$f":"[3]!Sound_speed(11,V64,V65)","v":253.46088283408116},{"$f":"[3]!Sound_speed(11,W64,W65)","v":249.13623755760167},{"$f":"[3]!Sound_speed(11,X64,X65)","v":244.71191058016592},{"$f":"[3]!Sound_speed(11,Y64,Y65)","v":240.18035703209551}]
[null,"S=Q/(rho*V) = cte",null,{"$f":"D63/(D77*D78)","v":4.4000208975996838E-2},null,null,null,4.5643410478681992E-2,{"$f":"I63/(I77*I78)","v":4.5631831343665788E-2},4.5616211507543525E-2,4.5580943817437498E-2,4.5544655800325726E-2,4.5491070186932415E-2,4.5408452234503467E-2,4.5273490075895338E-2,4.5034216107141957E-2,4.4552628239857686E-2,{"$f":"R63/(R77*R78)","v":4.4459460559112235E-2},4.4354828766097698E-2,4.4236702714821143E-2,4.4102553439774692E-2,{"$f":"V63/(V77*V78)","v":4.3949187946287445E-2},4.3772511977128635E-2,4.3567180113592251E-2,4.3326063540759817E-2]
[null,"Hin",null,{"$f":"[3]!h_(11,D64,D65)","v":105.90220745591094},null,null,null,{"$f":"[3]!h_(11,H64,H65)","v":361.5464578882453},{"$f":"[3]!h_(11,I64,I65)","v":335.91149993347784},{"$f":"[3]!h_(11,J64,J65)","v":310.34740218217763},{"$f":"[3]!h_(11,K64,K65)","v":272.13182647531204},{"$f":"[3]!h_(11,L64,L65)","v":246.7348487730531},{"$f":"[3]!h_(11,M64,M65)","v":221.38804751721855},{"$f":"[3]!h_(11,N64,N65)","v":196.06544025627954},{"$f":"[3]!h_(11,O64,O65)","v":170.71458412439625},{"$f":"[3]!h_(11,P64,P65)","v":145.22413607516057},{"$f":"[3]!h_(11,Q64,Q65)","v":119.32768195638531},{"$f":"[3]!h_(11,R64,R65)","v":116.03405168051044},{"$f":"[3]!h_(11,S64,S65)","v":112.72108140707688},{"$f":"[3]!h_(11,T64,T65)","v":109.38561261689215},{"$f":"[3]!h_(11,U64,U65)","v":106.02379965627202},{"$f":"[3]!h_(11,V64,V65)","v":102.63089980121451},{"$f":"[3]!h_(11,W64,W65)","v":99.200976578468925},{"$f":"[3]!h_(11,X64,X65)","v":95.726469441564078},{"$f":"[3]!h_(11,Y64,Y65)","v":92.197551193630147}]
[null,"Hout",null,{"$f":"[3]!h_(11,D66,D67)","v":73.764914852456329},null,null,null,{"$f":"[3]!h_(11,H66,H67)","v":283.86756923742911},{"$f":"[3]!h_(11,I66,I67)","v":261.28573419024627},{"$f":"[3]!h_(11,J66,J67)","v":238.93780260792863},{"$f":"[3]!h_(11,K66,K67)","v":205.91077875124361},{"$f":"[3]!h_(11,L66,L67)","v":184.26768366501642},{"$f":"[3]!h_(11,M66,M67)","v":162.96782791787359},{"$f":"[3]!h_(11,N66,N67)","v":142.05557600818659},{"$f":"[3]!h_(11,O66,O67)","v":121.58143634455215},{"$f":"[3]!h_(11,P66,P67)","v":101.59682496234909},{"$f":"[3]!h_(11,Q66,Q67)","v":82.127353616086111},{"$f":"[3]!h_(11,R66,R67)","v":79.727109601745966},{"$f":"[3]!h_(11,S66,S67)","v":77.332872931457558},{"$f":"[3]!h_(11,T66,T67)","v":74.94378487460807},{"$f":"[3]!h_(11,U66,U67)","v":72.558707062273655},{"$f":"[3]!h_(11,V66,V67)","v":70.176126096628963},{"$f":"[3]!h_(11,W66,W67)","v":67.794017206885883},{"$f":"[3]!h_(11,X66,X67)","v":65.409643999958021},{"$f":"[3]!h_(11,Y66,Y67)","v":63.019256758155507}]
[null,"Sin = Sout",null,{"$f":"[3]!S_(11,D64,D65)","v":13.041567593259808},null,null,null,{"$f":"[3]!S_(11,H64,H65)","v":20.496324982048964},{"$f":"[3]!S_(11,I64,I65)","v":20.092222635192414},{"$f":"[3]!S_(11,J64,J65)","v":19.65410693896504},{"$f":"[3]!S_(11,K64,K65)","v":18.918723531130624},{"$f":"[3]!S_(11,L64,L65)","v":18.363108733209259},{"$f":"[3]!S_(11,M64,M65)","v":17.740128701525808},{"$f":"[3]!S_(11,N64,N65)","v":17.030456663077725},{"$f":"[3]!S_(11,O64,O65)","v":16.204561658933915},{"$f":"[3]!S_(11,P64,P65)","v":15.213431422388446},{"$f":"[3]!S_(11,Q64,Q65)","v":13.964417156292173},{"$f":"[3]!S_(11,R64,R65)","v":13.781864750123916},{"$f":"[3]!S_(11,S64,S65)","v":13.591649072941776},{"$f":"[3]!S_(11,T64,T65)","v":13.392992352625573},{"$f":"[3]!S_(11,U64,U65)","v":13.184976632879993},{"$f":"[3]!S_(11,V64,V65)","v":12.966504836569881},{"$f":"[3]!S_(11,W64,W65)","v":12.736246559020126},{"$f":"[3]!S_(11,X64,X65)","v":12.492560446961006},{"$f":"[3]!S_(11,Y64,Y65)","v":12.233379615955437}]
[null,"Tout(iso)",null,{"$f":"[1]!HeCalc(2,0,1,D66*10^5,8,D82*1000,1)","v":9.7639107105745424},null,null,null,{"$f":"[1]!HeCalc(2,0,1,H66*10^5,8,H82*1000,1)","v":37.360542110758679},{"$f":"[1]!HeCalc(2,0,1,I66*10^5,8,I82*1000,1)","v":34.573334060568634},{"$f":"[1]!HeCalc(2,0,1,J66*10^5,8,J82*1000,1)","v":31.787833625381506},{"$f":"[1]!HeCalc(2,0,1,K66*10^5,8,K82*1000,1)","v":27.61225393938977},{"$f":"[1]!HeCalc(2,0,1,L66*10^5,8,L82*1000,1)","v":24.829587074322529},{"$f":"[1]!HeCalc(2,0,1,M66*10^5,8,M82*1000,1)","v":22.04662866233258},{"$f":"[1]!HeCalc(2,0,1,N66*10^5,8,N82*1000,1)","v":19.261489115684469},{"$f":"[1]!HeCalc(2,0,1,O66*10^5,8,O82*1000,1)","v":16.470574844455228},{"$f":"[1]!HeCalc(2,0,1,P66*10^5,8,P82*1000,1)","v":13.666529061152191},{"$f":"[1]!HeCalc(2,0,1,Q66*10^5,8,Q82*1000,1)","v":10.832209356395143},{"$f":"[1]!HeCalc(2,0,1,R66*10^5,8,R82*1000,1)","v":10.47402172646958},{"$f":"[1]!HeCalc(2,0,1,S66*10^5,8,S82*1000,1)","v":10.114548351528178},{"$f":"[1]!HeCalc(2,0,1,T66*10^5,8,T82*1000,1)","v":9.753596549200104},{"$f":"[1]!HeCalc(2,0,1,U66*10^5,8,U82*1000,1)","v":9.3909338664159545},{"$f":"[1]!HeCalc(2,0,1,V66*10^5,8,V82*1000,1)","v":9.0262766526737881},{"$f":"[1]!HeCalc(2,0,1,W66*10^5,8,W82*1000,1)","v":8.659274299023263},{"$f":"[1]!HeCalc(2,0,1,X66*10^5,8,X82*1000,1)","v":8.2894868317624244},{"$f":"[1]!HeCalc(2,0,1,Y66*10^5,8,Y82*1000,1)","v":7.9163523955364932}]
[null,"Hout(iso)",null,{"$f":"[3]!h_(11,D66,D83)","v":63.616296135548602},null,null,null,{"$f":"[3]!h_(11,H66,H83)","v":209.26385386787368},{"$f":"[3]!h_(11,I66,I83)","v":194.73686463640868},{"$f":"[3]!h_(11,J66,J83)","v":180.2085522442847},{"$f":"[3]!h_(11,K66,K83)","v":158.40408214388688},{"$f":"[3]!h_(11,L66,L83)","v":143.84924031914085},{"$f":"[3]!h_(11,M66,M83)","v":129.26526022224593},{"$f":"[3]!h_(11,N66,N83)","v":114.63042340382971},{"$f":"[3]!h_(11,O66,O83)","v":99.905967562452304},{"$f":"[3]!h_(11,P66,P83)","v":85.016190625569564},{"$f":"[3]!h_(11,Q66,Q83)","v":69.78975948546254},{"$f":"[3]!h_(11,R66,R83)","v":67.845207616575635},{"$f":"[3]!h_(11,S66,S83)","v":65.887291923186197},{"$f":"[3]!h_(11,T66,T83)","v":63.914062246920132},{"$f":"[3]!h_(11,U66,U83)","v":61.923146980406365},{"$f":"[3]!h_(11,V66,V83)","v":59.911623669216524},{"$f":"[3]!h_(11,W66,W83)","v":57.875836119857652},{"$f":"[3]!h_(11,X66,X83)","v":55.811128354976489},{"$f":"[3]!h_(11,Y66,Y83)","v":53.711446724484205}]
[null,"ΔHs",null,{"$f":"D80-D84","v":42.285911320362338},null,null,null,152.28260402037162,{"$f":"I80-I84","v":141.17463529706916},130.13884993789293,113.72774433142516,102.88560845391225,92.122787294972625,81.435016852449834,70.80861656194395,60.207945449591008,49.537922470922766,{"$f":"R80-R84","v":48.188844063934809},46.833789483890683,45.471550369972014,44.100652675865653,{"$f":"V80-V84","v":42.719276131997987},41.325140458611273,39.915341086587588,38.486104469145943]
[null,"u1","m/s",{"$f":"(2*52.7%*D85*1000*D68)^0.5","v":184.04539223806461},null,null,null,{"$f":"PI()*$D$87*H70","v":184.04539223806461},{"$f":"PI()*$D$87*I70","v":184.04539223806461},184.04539223806461,184.04539223806461,184.04539223806461,184.04539223806461,184.04539223806461,184.04539223806461,184.04539223806461,{"$f":"PI()*$D$87*Q70","v":184.04539223806461},{"$f":"PI()*$D$87*R70","v":184.04539223806461},184.04539223806461,184.04539223806461,184.04539223806461,{"$f":"PI()*$D$87*V70","v":184.04539223806461},184.04539223806461,184.04539223806461,184.04539223806461]
[null,"D1",null,{"$f":"D86/PI()/D70","v":3.9160072096222902E-2}]
[null,"Co = (2*ΔHs)^0,5",null,{"$f":"(2000*D85)^0.5","v":290.81234953269205},null,null,null,551.87426832634912,{"$f":"(2000*I85)^0.5","v":531.36547742033292},510.17418581871215,476.9229378661193,453.6201240110766,429.23836570132596,403.57159675192662,376.3206520029002,347.00992910748539,314.76315690030424,{"$f":"(2000*R85)^0.5","v":310.44756099520191},306.051595270767,301.56773822798755,296.98704576417356,{"$f":"(2000*V85)^0.5","v":292.29873804721768},287.48961879904903,282.54323947526183,277.43865797377964]
[null,"u1/Co",null,{"$f":"D86/D88","v":0.6328664946100403},null,null,null,0.33349152660480619,{"$f":"I86/I88","v":0.34636309669865284},0.36075010722605283,0.38590174140403666,0.40572580998097552,0.42877199930009907,0.45604148983556037,0.48906535226944231,0.53037500313444075,0.58471072043656558,{"$f":"R86/R88","v":0.59283890537928596},0.60135413466882193,0.61029536289098962,0.61970848514452803,{"$f":"V86/V88","v":0.62964826145891217},0.64018100203718875,0.65138841254836954,0.66337327891579734]
[null,"U1/C0 off de / U1/C0 nom",null,{"$f":"D89/$D$54","v":0.98709623358564935},null,null,null,{"$f":"H89/$D89","v":0.52695399336995552},{"$f":"I89/$D89","v":0.54729251690291314},0.57002560618782616,0.60976800745601423,0.6410922579034235,0.67750782029359891,0.72059667199882971,0.77277807631575535,0.83805195511455732,0.92390847898631867,{"$f":"R89/$D89","v":0.93675192229062698},0.95020693904701703,0.96433508186752948,0.97920887015259039,{"$f":"V89/$D89","v":0.99491483088686639},1.0115577416239352,1.02926670647929,1.0482041387331695]
[null,"Rdt",null,{"$f":"(0.321*D90^4-1.6098*D90^3+1.316*D90^2+0.9448*D90)*($D68/0.97215493)","v":0.75935604730996153},null,null,null,{"$f":"(0.321*H90^4-1.6098*H90^3+1.316*H90^2+0.9448*H90)*($D68/0.97215493)","v":0.51009692899935322},{"$f":"(0.321*I90^4-1.6098*I90^3+1.316*I90^2+0.9448*I90)*($D68/0.97215493)","v":0.52860604588210169},0.54871853876323895,0.58227698186897314,0.60715163225203528,0.63415601410632827,0.66322653737460568,0.69388656592558695,0.72461052751481636,0.75094647665398517,{"$f":"(0.321*R90^4-1.6098*R90^3+1.316*R90^2+0.9448*R90)*($D68/0.97215493)","v":0.75343044192121955},0.75561275023008778,0.75743684704083103,0.7588344063745277,{"$f":"(0.321*V90^4-1.6098*V90^3+1.316*V90^2+0.9448*V90)*($D68/0.97215493)","v":0.75972199554180075},0.7599964341290173,0.75952815675156971,0.75815141173528433]
[]
[null,"TURBINE 3"]
[]
[null,null,null,"DESIGN",null,{"$f":"F61","v":0},{"$f":"G61","v":0},{"$f":"H61","v":"start-up"},{"$f":"I61","v":"start-up"}]
[]
[null,"m","g/s",399.8,null,{"$f":"F110/(F100*F99)^0.5*F98","v":161.47618188513178},{"$f":"G110/(G100*G99)^0.5*G98","v":95.080415199611181},{"$error":"#DIV/0!"},117.10102732642108]
[null,"Pin","Bara",13.07,null,13.07,7.3689999999999998,null,10.48]
[null,"Tin","K",7.2919999999999998,null,9.16,7.9119999999999999,null,10.55]
[null,"Pout","Bara",4.88,null,4.88,5.18,null,5.18]
[null,"Tout","K",{"$f":"[3]!T2_turb(11,D98,D99,D100,D102)","v":6.1198408797506243},null,{"$f":"[3]!T2_turb(11,F98,F99,F100,F102)","v":7.0494463059442776},{"$f":"[3]!T2_turb(11,G98,G99,G100,G102)","v":7.1447253899950391},{"$f":"[3]!T2_turb(11,H98,H99,H100,H102)","v":{"$error":"#VALUE!"}},{"$f":"[3]!T2_turb(11,I98,I99,I100,I102)","v":8.6903815136344829}]
[null,"Efficacity","%",0.72,null,{"$f":"(0.321*F124^4-1.6098*F124^3+1.316*F124^2+0.9448*F124)*($D$102/0.97215493)","v":0.58179731360313081},{"$f":"(0.321*G124^4-1.6098*G124^3+1.316*G124^2+0.9448*G124)*($D$102/0.97215493)","v":0.582724483494652},{"$f":"(0.321*H124^4-1.6098*H124^3+1.316*H124^2+0.9448*H124)*($D$102/0.97215493)","v":{"$error":"#VALUE!"}},{"$f":"(0.321*I124^4-1.6098*I124^3+1.316*I124^2+0.9448*I124)*($D$102/0.97215493)","v":0.50201641458397539}]
[null,"Power","W",{"$f":"+D97*(D114-D115)","v":2075.5404202052005},null,954.74184184263254,182.5140950412455,{"$error":"#DIV/0!"},610.67834348723773]
[null,"Speed","Hz",2076,null,1602.552519659416,914.20818650847264,862.66257848011605,1367.3629344539765]
[null,null,null,null,null,{"$f":"(F103/$D103*$D107/F107)^(1/3)*$D104","v":1602.5525123839127},{"$f":"(G103/$D103*$D107/G107)^(1/3)*$D104","v":914.20817108894096},{"$f":"(H103/$D103*$D107/H107)^(1/3)*$D104","v":{"$error":"#DIV/0!"}},{"$f":"(I103/$D103*$D107/I107)^(1/3)*$D104","v":1367.3629301538849}]
[null,null,null,null,null,{"$f":"F104-F105","v":7.2755033215798903E-6},{"$f":"G104-G105","v":1.5419531678162457E-5},{"$f":"H104-H105","v":{"$error":"#DIV/0!"}},{"$f":"I104-I105","v":4.300091632103431E-6}]
[null,"Brake Pressure",null,10.1,null,{"$f":"($D107-$D100)+F100","v":10.1},{"$f":"($D107-$D100)+G100","v":10.399999999999999},{"$f":"($D107-$D100)+H100","v":5.22},{"$f":"($D107-$D100)+I100","v":10.399999999999999}]
[null,"Rho (brake)",null,{"$f":"[3]!rho_(11,D107,330)","v":1.4673342046153373},null,{"$f":"[3]!rho_(11,F107,330)","v":1.4673342046153373},{"$f":"[3]!rho_(11,G107,330)","v":1.5107331217743123},{"$f":"[3]!rho_(11,H107,330)","v":0.75987987169063398},{"$f":"[3]!rho_(11,I107,330)","v":1.5107331217743123}]
[null,"Wheel","mm",29.5,null,{"$f":"$D$109","v":29.5},{"$f":"$D$109","v":29.5},{"$f":"$D$109","v":29.5},{"$f":"$D$109","v":29.5}]
[null,"a = mÖT/P",null,{"$f":"D97*D99^0.5/D98","v":82.601994178997316},null,{"$f":"$D$110","v":82.601994178997316},{"$f":"$D$110","v":82.601994178997316},82.601994178997316,82.601994178997316]
[null,"Rho (in)","kg/m3",{"$f":"[3]!rho_(11,D98,D99)","v":122.0413850208848},null,{"$f":"[3]!rho_(11,F98,F99)","v":92.042022544510019},{"$f":"[3]!rho_(11,G98,G99)","v":70.649649504414128},{"$f":"[3]!rho_(11,H98,H99)","v":"NUM"},{"$f":"[3]!rho_(11,I98,I99)","v":58.789985568547117}]
[null,"Sound Speed",null,{"$f":"[3]!Sound_speed(11,D98,D99)","v":249.05671288435045},null,{"$f":"[3]!Sound_speed(11,F98,F99)","v":219.03534618547846},{"$f":"[3]!Sound_speed(11,G98,G99)","v":170.78644408370695},{"$f":"[3]!Sound_speed(11,H98,H99)","v":"NUM"},{"$f":"[3]!Sound_speed(11,I98,I99)","v":204.26692373410398}]
[null,"S=Q/(rho*V) = cte",null,{"$f":"D97/(D111*D112)","v":1.3153381307708404E-2},null,8.0095499679843866E-3,7.8800262035761022E-3,{"$error":"#DIV/0!"},9.7512278209034905E-3]
[null,"Hin",null,{"$f":"[3]!h_(11,D98,D99)","v":28.150884578454882},null,{"$f":"[3]!h_(11,F98,F99)","v":40.890140453818937},{"$f":"[3]!h_(11,G98,G99)","v":36.811643961665368},{"$f":"[3]!h_(11,H98,H99)","v":{"$error":"#VALUE!"}},{"$f":"[3]!h_(11,I98,I99)","v":54.059832308617963}]
[null,"Hout",null,{"$f":"[3]!h_(11,D100,D101)","v":22.959437804554931},null,{"$f":"[3]!h_(11,F100,F101)","v":34.977554271159498},{"$f":"[3]!h_(11,G100,G101)","v":34.892067835939827},{"$f":"[3]!h_(11,H100,H101)","v":{"$error":"#VALUE!"}},{"$f":"[3]!h_(11,I100,I101)","v":48.844862317065612}]
[null,"Sin = Sout",null,{"$f":"[3]!S_(11,D98,D99)","v":5.0600046690749361},null,{"$f":"[3]!S_(11,F98,F99)","v":6.606972813997622},{"$f":"[3]!S_(11,G98,G99)","v":6.9458302073485418},{"$f":"[3]!S_(11,H98,H99)","v":{"$error":"#VALUE!"}},{"$f":"[3]!S_(11,I98,I99)","v":8.3000204511344844}]
[null,"Tout(iso)",null,{"$f":"[1]!HeCalc(2,0,1,D100*10^5,8,D116*1000,1)","v":5.9351387842537191},null,{"$f":"[1]!HeCalc(2,0,1,F100*10^5,8,F116*1000,1)","v":6.6999950291002683},{"$f":"[1]!HeCalc(2,0,1,G100*10^5,8,G116*1000,1)","v":7.0241819850115181},{"$f":"[1]!HeCalc(2,0,1,H100*10^5,8,H116*1000,1)","v":{"$error":"#VALUE!"}},{"$f":"[1]!HeCalc(2,0,1,I100*10^5,8,I116*1000,1)","v":8.0488946725573083}]
[null,"Hout(iso)",null,{"$f":"[3]!h_(11,D100,D117)","v":20.940541836947467},null,{"$f":"[3]!h_(11,F100,F117)","v":30.727518437529557},{"$f":"[3]!h_(11,G100,G117)","v":33.517503797489027},{"$f":"[3]!h_(11,H100,H117)","v":{"$error":"#VALUE!"}},{"$f":"[3]!h_(11,I100,I117)","v":43.671785543492518}]
[null,"ΔHs",null,{"$f":"D114-D118","v":7.2103427415074144},null,10.162622016289379,3.2941401641763406,{"$error":"#VALUE!"},10.388046765125445]
[null,"u1","m/s",{"$f":"(2*52.7%*D119*1000*D102)^0.5","v":73.971514109656738},null,{"$f":"PI()*$D$121*F104","v":57.101751598965535},{"$f":"PI()*$D$121*G104","v":32.574838038282842},30.738177791866459,48.72153497060885]
[null,"D1",null,{"$f":"D120/PI()/D104","v":1.1341938457171245E-2},null,null,null,null,null,null,null,null,"T3"]
[null,"Co = (2*ΔHs)^0,5",null,{"$f":"(2000*D119)^0.5","v":120.0861585821398},null,142.56663015088333,81.16822240478524,{"$error":"#VALUE!"},144.13914641848999,null,null,"MAX",{"$f":"ROUND(F97,0)&\"g/s @ \"&F98&\" b ; \"&F99&\"K\"","v":"161g/s @ 13,07 b ; 9,16K"}]
[null,"u1/Co",null,{"$f":"D120/D122","v":0.61598701285010871},null,0.40052676799986592,0.40132501455843644,{"$error":"#VALUE!"},0.33801736850273811,null,null,"MIN",{"$f":"ROUND(G97,0)&\"g/s @ \"&G98&\" b ; \"&G99&\"K\"","v":"95g/s @ 7,369 b ; 7,912K"}]
[null,"U1/C0 off de / U1/C0 nom",null,{"$f":"D123/$D$54","v":0.96076892283052273},null,{"$f":"F123/$D123","v":0.65021950080841751},{"$f":"G123/$D123","v":0.65151538293242062},{"$f":"H123/$D123","v":{"$error":"#VALUE!"}},{"$f":"I123/$D123","v":0.54874106344996854},null,null,"STS",{"$f":"ROUND(H97,0)&\"g/s @ \"&H98&\" b ; \"&H99&\"K\"","v":{"$error":"#DIV/0!"}}]
[null,"Rdt",null,{"$f":"(0.321*D124^4-1.6098*D124^3+1.316*D124^2+0.9448*D124)*($D102/0.97215493)","v":0.7171786087866604},null,{"$f":"(0.321*F124^4-1.6098*F124^3+1.316*F124^2+0.9448*F124)*($D102/0.97215493)","v":0.58179731360313081},{"$f":"(0.321*G124^4-1.6098*G124^3+1.316*G124^2+0.9448*G124)*($D102/0.97215493)","v":0.582724483494652},{"$f":"(0.321*H124^4-1.6098*H124^3+1.316*H124^2+0.9448*H124)*($D102/0.97215493)","v":{"$error":"#VALUE!"}},{"$f":"(0.321*I124^4-1.6098*I124^3+1.316*I124^2+0.9448*I124)*($D102/0.97215493)","v":0.50201641458397539},null,null,"BAKING",{"$f":"ROUND(I97,0)&\"g/s @ \"&I98&\" b ; \"&I99&\"K\"","v":"117g/s @ 10,48 b ; 10,55K"}]
[]
[null,null,null,null,null,null,null,null,null,null,null,null,{"$f":"M52","v":0},{"$f":"M121","v":"T3"},"T1+T2"]
[null,"Courbe de rendement TC3",null,null,null,null,null,null,null,null,null,{"$f":"L122","v":"MAX"},{"$f":"M53","v":396.39542214476637},{"$f":"M122","v":"161g/s @ 13,07 b ; 9,16K"},{"$f":"F97+F63","v":161.47618188513178}]
[null,null,null,null,null,null,null,null,null,null,null,{"$f":"L123","v":"MIN"},{"$f":"M54","v":0.56527903651906741},{"$f":"M123","v":"95g/s @ 7,369 b ; 7,912K"},{"$f":"G97+G63","v":95.080415199611181}]
[null,null,null,null,null,null,null,null,null,null,null,{"$f":"L124","v":"STS"},{"$f":"M55","v":0.8816785414066125},{"$f":"M124","v":{"$error":"#DIV/0!"}},{"$f":"H97+H63","v":{"$error":"#DIV/0!"}}]
[null,null,null,null,null,null,null,null,null,null,null,{"$f":"L125","v":"BAKING"},{"$f":"M56","v":0.76123477607009837},{"$f":"M125","v":"117g/s @ 10,48 b ; 10,55K"},{"$f":"I97+I63","v":197.38206736648488}]
[null,null,null,null,"d : mm"]
[null,null,null,null,"N : Hz"]
[null,null,null,null,"H : J/kG"]
[]
[]
[]
[]
[]
[null,"rendement=(0,321*rap^4 - 1,6098*rap^3 + 1,316*rap^2 + 0,9448*rap)*(ETAgar/0,97)",null,null,null,null,null,null,"U1/CO _nom",0.64]
[null,null,null,null,null,null,null,null,"Eta_gar",0.8]
[null,"U1/C0",{"$f":"D33","v":0.78},{"$f":"D68","v":0.76},{"$f":"D102","v":0.72}]
[null,0,{"$f":"(0.321*B143^4-1.6098*B143^3+1.316*B143^2+0.9448*B143)*$D$33/0.97215493","v":0}]
[null,{"$f":"B143+0.05","v":0.05},{"$f":"(0.321*$B144^4-1.6098*$B144^3+1.316*$B144^2+0.9448*$B144)*$C$142/0.97215493","v":4.0382461852042459E-2},{"$f":"(0.321*$B144^4-1.6098*$B144^3+1.316*$B144^2+0.9448*$B144)*$D$142/0.97215493","v":3.9347014112246496E-2},{"$f":"(0.321*$B144^4-1.6098*$B144^3+1.316*$B144^2+0.9448*$B144)*$E$142/0.97215493","v":3.7276118632654578E-2}]
[null,0.1,{"$f":"(0.321*$B145^4-1.6098*$B145^3+1.316*$B145^2+0.9448*$B145)*$C$142/0.97215493","v":8.5098158171146673E-2},{"$f":"(0.321*$B145^4-1.6098*$B145^3+1.316*$B145^2+0.9448*$B145)*$D$142/0.97215493","v":8.2916154115476232E-2},{"$f":"(0.321*$B145^4-1.6098*$B145^3+1.316*$B145^2+0.9448*$B145)*$E$142/0.97215493","v":7.8552146004135376E-2}]
[null,0.15000000000000002,0.13323633134792623,0.12982001515951785,0.12298738278270113]
[null,0.2,0.18392485650409657,0.17920883454245307,0.16977679061916603]
[null,0.25,0.23633024149247489,0.23027049171061653,0.21815099214689987]
[null,0.3,0.28965762689698032,0.28223050825859619,0.26737627098182798]
[null,0.35,0.34315078603263366,0.33435204792923284,0.3167545717224311]
[null,0.39999999999999997,0.39609212494555779,0.38593591661362037,0.36562349994974563]
[null,0.44999999999999996,0.4478026824129771,0.43632056235110589,0.41335632222736346]
[null,0.49999999999999994,0.49764212994321799,0.48488207532928934,0.45936196610143198]
[null,0.54999999999999993,0.54500877177570861,0.53103418788402379,0.50308502010065403]
[null,0.6,0.58933954488097895,0.57422827449941549,0.54400573373628835]
[null,0.65,0.63011001896066099,0.61395335180782351,0.58164001750214867]
[null,0.70000000000000007,0.66683439644748832,0.64973607858986027,0.61553944287460449]
[null,0.75000000000000011,0.69906551250529614,0.68114075577439104,0.64529124231258095]
[null,0.80000000000000016,0.7263948350290218,0.70776932643853407,0.67051830925755851]
[null,0.8500000000000002,0.74845246464470438,0.72926137580766071,0.69087919813357312]
[null,0.90000000000000024,0.76490713470948513,0.74529413125539579,0.70606812434721711]
[null,0.95000000000000029,0.77546621131160665,0.7555824623036167,0.71581496428763691]
[null,1.0000000000000002,0.77987569327041351,0.75987888062245412,0.71988525532653547]
[null,1.0500000000000003,0.77792021213635165,0.75797354003029138,0.71808019581817073]
[null,1.1000000000000003,0.76942303219096997,0.74969423649376565,0.7102366450993568]
[null,1.1500000000000004,0.75424605044691839,0.73490640812776653,0.69622712348946292]
[null,1.2000000000000004,0.7322897966479478,0.71351313519543635,0.67595981229041324,null,"F Let u be the peripheral speed of the wheel : u = p . Æ . N / 60                      (in m/s)"]
[null,1.2500000000000004,0.70349343326891334,0.68545514010817188,0.64937855378668918,null,"F Let n, be the speed ratio of the turbine : n =  u / [ 2 . (H1 - H2S ) ] 0.5       (dimensionless number)"]
[null,1.3000000000000005,0.66783475551576954,0.65071078742562172,0.61646285124532574,null,null,"N = speed of rotation of the turbine (in rpm)"]
[null,1.3500000000000005,0.62533019132557388,0.60929608385568745,0.57722786891591438,null,null,"Æ = diameter of the wheel of the turbine (in m)"]
[null,1.4000000000000006,0.57603480136648577,0.56126467825452464,0.53172443203060227]
[null,1.4500000000000006,0.5200422790377659,0.50670786162654113,0.48003902680409161]
[null,1.5000000000000007,0.45748495046977738,0.44575456712439848,0.42229380043364062]

{"sheet":"Turbines_JT60SA_serial_Frein T1","index":6,"n_rows":168,"n_cols":40,"rows_kept":168,"cut":false,"hidden":false,"merged":[]}
[]
[]
[]
[]
[null,null,null,null,"Vitesse de la roue ajustée en fonction de la puissance du frein",null,null,null,null,null,null,{"$f":"D65*0.3","v":448.8}]
[]
[1,2,3,4,5,6,7,8,9,10,11,12,13,14,15,16,17,18,19,20,21,22,23,24,25,26,27,28,29,30,31,32,33]
[null,"Relation entre la puissance et la vitesse de rotation",null,null,null,null,null,null,null,null,null,null,"²"]
[]
[null,"Cvs",null,30,null,null,null,30]
[null,"Range",null,100,null,null,null,100]
[null,"Trim",null,0.85,null,null,null,0.85]
[null,"Cv",null,{"$f":"[3]!Cv_From_Trim(D12,D11)*D10","v":15.035617008818171},null,null,null,{"$f":"[3]!Cv_From_Trim(H12,H11)*H10","v":15.035617008818171}]
[null,"Pin","Bara",15,null,null,null,15]
[null,"Tin","K",40.03,null,null,null,{"$f":"H25","v":80}]
[null,"Rho",null,{"$f":"[3]!rho_(11,D14,D15)","v":17.343206998481495},null,null,null,{"$f":"[3]!rho_(11,H14,H15)","v":8.7915125131395992}]
[null,"Flow",null,{"$f":"IF(D14/2>D24,\"S\",\"SS\")","v":"SS"},null,null,null,{"$f":"IF(H14/2>H24,\"S\",\"SS\")","v":"SS"}]
[null,"m","g/s",{"$f":"[3]!q_gs(D15,D14,(D14-D24),D16,D13,D17)","v":226.408332585029},null,null,null,{"$f":"[3]!q_gs(H15,H14,(H14-H24),H16,H13,H17)","v":551.05876686643217}]
[null,"TURBINE 1"]
[]
[null,null,null,"DESIGN",null,null,null,"start-up","start-up","start-up","start-up","start-up","start-up","start-up","start-up","start-up","start-up"]
[]
[null,"m","g/s",191.5,null,null,null,{"$f":"H36*H24/H25^0.5","v":106.09696702681093},{"$f":"I36*I24/I25^0.5","v":109.41632084058156},113.11923072234391,119.58337462239092,124.678955146749,130.61491890435522,137.6720060026698,146.29487071401371,157.24979897252499,172.02733882410544,174.27673465907139,176.64361423052631,179.13973231720547,181.77861112833543,184.57589294609386,187.54978491746618,190.72161706738413,194.11655508693445]
[null,"Pin","Bara",14.77,null,null,null,11.568229194028468,11.628075032728878,11.700963191890374,11.842999056991831,11.967623579949523,12.126227278936183,12.332793006915608,12.610520822852695,13.001334640562161,13.590675347823593,13.686184316147024,13.78823867226822,13.897553497294171,14.014954705322092,14.141401339031875,14.278013751592558,14.426108925045712,14.5872456216537]
[null,"Tin","K",40.03,null,null,null,80,{"$f":"H25-4","v":76},{"$f":"I25-4","v":72},66,62,58,54,50,46,42,{"$f":"Q25-0.5","v":41.5},{"$f":"R25-0.5","v":41},40.5,40,39.5,39,38.5,38]
[null,"Pout","Bara",6.36,null,null,null,{"$f":"H59","v":4.8648442828706333},4.8749470369194778,4.8900582675092412,4.926261723222316,4.9637310001802595,5.0174710467590122,5.0957088330809759,5.2127541468270833,5.3956808651743886,5.702092132838291,5.7545341855530507,5.8113091128544658,5.872924698366937,5.9399693637357851,6.013128605254467,6.0932055837465464,6.1811470911073343,6.2780766155336671]
[null,"Tout","K",{"$f":"[3]!T2_turb(11,D24,D25,D26,D28)","v":31.094586910112792},null,null,null,{"$f":"[3]!T2_turb(11,H24,H25,H26,H28)","v":64.447286262863329},{"$f":"[3]!T2_turb(11,I24,I25,I26,I28)","v":60.92489198191489},{"$f":"[3]!T2_turb(11,J24,J25,J26,J28)","v":57.423929485675458},{"$f":"[3]!T2_turb(11,K24,K25,K26,K28)","v":52.219423100978254},{"$f":"[3]!T2_turb(11,L24,L25,L26,L28)","v":48.787018789229855},{"$f":"[3]!T2_turb(11,M24,M25,M26,M28)","v":45.391033167282991},{"$f":"[3]!T2_turb(11,N24,N25,N26,N28)","v":42.039704372334981},{"$f":"[3]!T2_turb(11,O24,O25,O26,O28)","v":38.745337941708804},{"$f":"[3]!T2_turb(11,P24,P25,P26,P28)","v":35.52782818153905},{"$f":"[3]!T2_turb(11,Q24,Q25,Q26,Q28)","v":32.422945561304793},{"$f":"[3]!T2_turb(11,R24,R25,R26,R28)","v":32.045737398077762},{"$f":"[3]!T2_turb(11,S24,S25,S26,S28)","v":31.671542305417073},{"$f":"[3]!T2_turb(11,T24,T25,T26,T28)","v":31.300595545336577},{"$f":"[3]!T2_turb(11,U24,U25,U26,U28)","v":30.933161477480976},{"$f":"[3]!T2_turb(11,V24,V25,V26,V28)","v":30.569538340311297},{"$f":"[3]!T2_turb(11,W24,W25,W26,W28)","v":30.210063820088262},{"$f":"[3]!T2_turb(11,X24,X25,X26,X28)","v":29.855121855946173},{"$f":"[3]!T2_turb(11,Y24,Y25,Y26,Y28)","v":29.505150740610084}]
[null,"Efficacity","%",0.78,null,null,null,{"$f":"(0.321*H50^4-1.6098*H50^3+1.316*H50^2+0.9448*H50)*($D$28/0.97215493)","v":0.6688324145168677},{"$f":"(0.321*I50^4-1.6098*I50^3+1.316*I50^2+0.9448*I50)*($D$28/0.97215493)","v":0.68019103877173193},0.69188088207003773,0.70996120526831485,0.72228340755290776,0.73468412444992448,0.74695504300963067,0.75873420055018737,0.76935353273459961,0.77744295902758931,0.77814963807987503,0.77876142081009747,0.77926677120507204,0.77965235023374224,0.77990264787109398,0.77999952200327627,0.77992161744176935,0.77964362762181205]
[null,"Power","W",{"$f":"+D23*(D40-D41)","v":9122.4436160855366},null,null,null,{"$f":"+H23*(H40-H41)","v":8771.5804028058537},8771.5804032003543,8771.5804035318106,8771.5804036784048,8771.5804033582099,8771.5804026112946,8771.5804089995108,8771.5804032497745,8771.5804068516009,8771.580408475993,8771.5804024218196,8771.5804113422364,8771.5804009699805,8771.5804096497741,8771.5804020907199,8771.5804051163559,8771.5804000191383,8771.5804010352476]
[null,"Speed","Hz",1995,null,null,null,1995,1995,1995,1995,1995,1995,1995,1995,1995,1995,1995,1995,1995,1995,1995,1995,1995,1995]
[null,"Speed calculated from P=K.rho.N^3",null,null,null,null,null,{"$f":"(H29/$D29*$D33/H33)^(1/3)*$D30","v":1995.0000002064849},{"$f":"(I29/$D29*$D33/I33)^(1/3)*$D30","v":1995.0000002363931},1995.000000261522,1995.0000002726354,1995.0000002483605,1995.0000001917347,1995.0000006760449,1995.0000002401398,1995.0000005132054,1995.0000006363553,1995.0000001773701,1995.0000008536538,1995.0000000673017,1995.0000007253432,1995.0000001522683,1995.0000003816513,1994.9999999952156,1995.0000000722498]
[null,"Delta Speed Frein & Turbine",null,{"$f":"D61-D33","v":-3.85},null,null,null,{"$f":"H30-H31","v":-2.0648485588026233E-7},{"$f":"I30-I31","v":-2.3639313440071419E-7},-2.6152201826334931E-7,-2.7263536139798816E-7,-2.4836049306031782E-7,-1.9173467080690898E-7,-6.7604491960082669E-7,-2.4013979782466777E-7,-5.1320535021659452E-7,-6.3635525293648243E-7,-1.7737011148710735E-7,-8.5365377344714943E-7,-6.7301698436494917E-8,-7.2534317041572649E-7,-1.5226828509184998E-7,-3.8165126170497388E-7,4.784396878676489E-9,-7.2249804361490533E-8]
[null,"Brake Pressure",null,5.2,null,null,null,{"$f":"($D33-$D61)+H61","v":5},{"$f":"($D33-$D61)+I61","v":5},{"$f":"($D33-$D61)+J61","v":5},5,5,5,5,5,5,5,5,5,5,5,5,5,5,5]
[null,"Rho (brake)",null,{"$f":"[3]!rho_(11,D33,330)","v":0.75697464940773784},null,null,null,{"$f":"[3]!rho_(11,H33,330)","v":0.72791980970899706},{"$f":"[3]!rho_(11,I33,330)","v":0.72791980970899706},{"$f":"[3]!rho_(11,J33,330)","v":0.72791980970899706},{"$f":"[3]!rho_(11,K33,330)","v":0.72791980970899706},{"$f":"[3]!rho_(11,L33,330)","v":0.72791980970899706},{"$f":"[3]!rho_(11,M33,330)","v":0.72791980970899706},{"$f":"[3]!rho_(11,N33,330)","v":0.72791980970899706},{"$f":"[3]!rho_(11,O33,330)","v":0.72791980970899706},{"$f":"[3]!rho_(11,P33,330)","v":0.72791980970899706},{"$f":"[3]!rho_(11,Q33,330)","v":0.72791980970899706},{"$f":"[3]!rho_(11,R33,330)","v":0.72791980970899706},{"$f":"[3]!rho_(11,S33,330)","v":0.72791980970899706},{"$f":"[3]!rho_(11,T33,330)","v":0.72791980970899706},{"$f":"[3]!rho_(11,U33,330)","v":0.72791980970899706},{"$f":"[3]!rho_(11,V33,330)","v":0.72791980970899706},{"$f":"[3]!rho_(11,W33,330)","v":0.72791980970899706},{"$f":"[3]!rho_(11,X33,330)","v":0.72791980970899706},{"$f":"[3]!rho_(11,Y33,330)","v":0.72791980970899706}]
[null,"Wheel","mm",35.799999999999997,null,null,null,{"$f":"$D$35","v":35.799999999999997},{"$f":"$D$35","v":35.799999999999997},35.799999999999997,35.799999999999997,35.799999999999997,35.799999999999997,35.799999999999997,35.799999999999997,35.799999999999997,35.799999999999997,35.799999999999997,35.799999999999997,35.799999999999997,35.799999999999997,35.799999999999997,35.799999999999997,35.799999999999997,35.799999999999997]
[null,"a = mÖT/P",null,{"$f":"D23*D25^0.5/D24","v":82.031580287488268},null,null,null,{"$f":"+$D$36","v":82.031580287488268},{"$f":"+$D$36","v":82.031580287488268},82.031580287488268,82.031580287488268,82.031580287488268,82.031580287488268,82.031580287488268,82.031580287488268,82.031580287488268,82.031580287488268,82.031580287488268,82.031580287488268,82.031580287488268,82.031580287488268,82.031580287488268,82.031580287488268,82.031580287488268,82.031580287488268,null,null,null,null,null,null,null,null,null,null,null,"T1 out",63,31,"x"]
[null,"Rho (in)","kg/m3",{"$f":"[3]!rho_(11,D24,D25)","v":17.087672541642732},null,null,null,{"$f":"[3]!rho_(11,H24,H25)","v":6.8207006087461206},{"$f":"[3]!rho_(11,I24,I25)","v":7.2097258936483577},{"$f":"[3]!rho_(11,J24,J25)","v":7.6497565053536611},{"$f":"[3]!rho_(11,K24,K25)","v":8.4312866720161672},{"$f":"[3]!rho_(11,L24,L25)","v":9.0574513810389661},{"$f":"[3]!rho_(11,M24,M25)","v":9.7958059321539359},{"$f":"[3]!rho_(11,N24,N25)","v":10.682949625104165},{"$f":"[3]!rho_(11,O24,O25)","v":11.775528056684704},{"$f":"[3]!rho_(11,P24,P25)","v":13.168231144944331},{"$f":"[3]!rho_(11,Q24,Q25)","v":15.0382428881233},{"$f":"[3]!rho_(11,R24,R25)","v":15.320931168786426},{"$f":"[3]!rho_(11,S24,S25)","v":15.61766023293892},{"$f":"[3]!rho_(11,T24,T25)","v":15.929734898363112},{"$f":"[3]!rho_(11,U24,U25)","v":16.258647011177583},{"$f":"[3]!rho_(11,V24,V25)","v":16.606111805042953},{"$f":"[3]!rho_(11,W24,W25)","v":16.974113550589177},{"$f":"[3]!rho_(11,X24,X25)","v":17.364962689404631},{"$f":"[3]!rho_(11,Y24,Y25)","v":17.781368532866477},null,null,null,null,null,null,null,null,null,null,null,"T2 in",62,18,"y"]
[null,"Sound Speed @inlet",null,{"$f":"[3]!Sound_speed(11,D24,D25)","v":391.2334216977045},null,null,null,{"$f":"[3]!Sound_speed(11,H24,H25)","v":537.34696724469177},{"$f":"[3]!Sound_speed(11,I24,I25)","v":524.37413698369437},{"$f":"[3]!Sound_speed(11,J24,J25)","v":511.07881051288234},{"$f":"[3]!Sound_speed(11,K24,K25)","v":490.47807072811639},{"$f":"[3]!Sound_speed(11,L24,L25)","v":476.26635904686287},{"$f":"[3]!Sound_speed(11,M24,M25)","v":461.63798975854132},{"$f":"[3]!Sound_speed(11,N24,N25)","v":446.56252130543885},{"$f":"[3]!Sound_speed(11,O24,O25)","v":431.01261748531073},{"$f":"[3]!Sound_speed(11,P24,P25)","v":414.97483903421613},{"$f":"[3]!Sound_speed(11,Q24,Q25)","v":398.48209340679887},{"$f":"[3]!Sound_speed(11,R24,R25)","v":396.39467894072266},{"$f":"[3]!Sound_speed(11,S24,S25)","v":394.30323002764749},{"$f":"[3]!Sound_speed(11,T24,T25)","v":392.20855276524236},{"$f":"[3]!Sound_speed(11,U24,U25)","v":390.11161495363615},{"$f":"[3]!Sound_speed(11,V24,V25)","v":388.01358087809945},{"$f":"[3]!Sound_speed(11,W24,W25)","v":385.91585549057726},{"$f":"[3]!Sound_speed(11,X24,X25)","v":383.82014021655397},{"$f":"[3]!Sound_speed(11,Y24,Y25)","v":381.72850473798167},null,null,null,null,null,null,null,null,null,null,null,"slope",{"$f":"SLOPE(AL37:AM37,AL36:AM36)","v":1.375}]
[null,"S=Q/(rho*V) = cte",null,{"$f":"D23/(D37*D38)","v":2.8645071953707371E-2},null,null,null,{"$f":"H23/(H37*H38)","v":2.8948041068784472E-2},2.894157024550998E-2,2.8933498927269412E-2,2.891727426986546E-2,2.890262154923838E-2,2.8883583332199196E-2,2.8858396015574588E-2,2.8824296999264101E-2,2.8776693593398812E-2,2.8707248307164774E-2,2.8696335200643647E-2,2.8684787501925713E-2,2.8672549594999496E-2,2.8659558624057124E-2,2.8645743175626806E-2,2.8631021641162279E-2,2.8615300176352509E-2,2.8598470124223382E-2,null,null,null,null,null,null,null,null,null,null,null,"intercept",{"$f":"INTERCEPT(AL37:AM37,AL36:AM36)","v":-24.625}]
[null,"Hin",null,{"$f":"[3]!h_(11,D24,D25)","v":223.57106614117126},null,null,null,{"$f":"[3]!h_(11,H24,H25)","v":433.59885604961028},{"$f":"[3]!h_(11,I24,I25)","v":412.72413154210858},{"$f":"[3]!h_(11,J24,J25)","v":391.83401039244882},{"$f":"[3]!h_(11,K24,K25)","v":360.46259768488272},{"$f":"[3]!h_(11,L24,L25)","v":339.5175491495574},{"$f":"[3]!h_(11,M24,M25)","v":318.54056369584094},{"$f":"[3]!h_(11,N24,N25)","v":297.52270217130808},{"$f":"[3]!h_(11,O24,O25)","v":276.45117930193686},{"$f":"[3]!h_(11,P24,P25)","v":255.30673858557543},{"$f":"[3]!h_(11,Q24,Q25)","v":234.05800411516284},{"$f":"[3]!h_(11,R24,R25)","v":231.39216412810913},{"$f":"[3]!h_(11,S24,S25)","v":228.72370541825617},{"$f":"[3]!h_(11,T24,T25)","v":226.05245307713869},{"$f":"[3]!h_(11,U24,U25)","v":223.37821252315288},{"$f":"[3]!h_(11,V24,V25)","v":220.70076617857225},{"$f":"[3]!h_(11,W24,W25)","v":218.01986941266208},{"$f":"[3]!h_(11,X24,X25)","v":215.33524552413058},{"$f":"[3]!h_(11,Y24,Y25)","v":212.64657950554874},null,null,null,null,null,null,null,null,null,null,null,"x","y"]
[null,"Hout",null,{"$f":"[3]!h_(11,D26,D27)","v":175.9342848561293},null,null,null,{"$f":"[3]!h_(11,H26,H27)","v":350.92372735729566},{"$f":"[3]!h_(11,I26,I27)","v":332.55711134061181},{"$f":"[3]!h_(11,J26,J27)","v":314.29122348062799},{"$f":"[3]!h_(11,K26,K27)","v":287.11142799782152},{"$f":"[3]!h_(11,L26,L27)","v":269.16421331165333},{"$f":"[3]!h_(11,M26,M27)","v":251.38452611460247},{"$f":"[3]!h_(11,N26,N27)","v":233.80909282047602},{"$f":"[3]!h_(11,O26,O27)","v":216.49295684041937},{"$f":"[3]!h_(11,P26,P27)","v":199.52555181035933},{"$f":"[3]!h_(11,Q26,Q27)","v":183.06854820406048},{"$f":"[3]!h_(11,R26,R27)","v":181.06083092071796},{"$f":"[3]!h_(11,S26,S27)","v":179.066770750383},{"$f":"[3]!h_(11,T26,T27)","v":177.08743405255956},{"$f":"[3]!h_(11,U26,U27)","v":175.1240182854323},{"$f":"[3]!h_(11,V26,V27)","v":173.17787322606466},{"$f":"[3]!h_(11,W26,W27)","v":171.25052542766946},{"$f":"[3]!h_(11,X26,X27)","v":169.34370804193716},{"$f":"[3]!h_(11,Y26,Y27)","v":167.45939597497906},null,null,null,null,null,null,null,null,null,null,null,277,{"$f":"m*AK41+p","v":356.25}]
[null,"Sin = Sout",null,{"$f":"[3]!S_(11,D24,D25)","v":15.488244062210457},null,null,null,{"$f":"[3]!S_(11,H24,H25)","v":19.655146228579529},{"$f":"[3]!S_(11,I24,I25)","v":19.3765172196515},{"$f":"[3]!S_(11,J24,J25)","v":19.080880529117202},{"$f":"[3]!S_(11,K24,K25)","v":18.600273917541095},{"$f":"[3]!S_(11,L24,L25)","v":18.250604534566243},{"$f":"[3]!S_(11,M24,M25)","v":17.872776018578424},{"$f":"[3]!S_(11,N24,N25)","v":17.461210835597278},{"$f":"[3]!S_(11,O24,O25)","v":17.008127082111411},{"$f":"[3]!S_(11,P24,P25)","v":16.501909282144688},{"$f":"[3]!S_(11,Q24,Q25)","v":15.923352628419423},{"$f":"[3]!S_(11,R24,R25)","v":15.844427943748512},{"$f":"[3]!S_(11,S24,S25)","v":15.763742910570906},{"$f":"[3]!S_(11,T24,T25)","v":15.681182072483475},{"$f":"[3]!S_(11,U24,U25)","v":15.596615812506165},{"$f":"[3]!S_(11,V24,V25)","v":15.509897871218822},{"$f":"[3]!S_(11,W24,W25)","v":15.420862262190374},{"$f":"[3]!S_(11,X24,X25)","v":15.329319501021169},{"$f":"[3]!S_(11,Y24,Y25)","v":15.235051887057329},null,null,null,null,null,null,null,null,null,null,null,31,{"$f":"m*AK42+p","v":18}]
[null,"Tout(iso)",null,{"$f":"[1]!HeCalc(2,0,1,D26*10^5,8,D42*1000,1)","v":28.580768861485691},null,null,null,{"$f":"[1]!HeCalc(2,0,1,H26*10^5,8,H42*1000,1)","v":56.600372350900081},{"$f":"[1]!HeCalc(2,0,1,I26*10^5,8,I42*1000,1)","v":53.704410509210284},{"$f":"[1]!HeCalc(2,0,1,J26*10^5,8,J42*1000,1)","v":50.813940030072182},{"$f":"[1]!HeCalc(2,0,1,K26*10^5,8,K42*1000,1)","v":46.492083368970597},{"$f":"[1]!HeCalc(2,0,1,L26*10^5,8,L42*1000,1)","v":43.623509464211317},{"$f":"[1]!HeCalc(2,0,1,M26*10^5,8,M42*1000,1)","v":40.769199018070502},{"$f":"[1]!HeCalc(2,0,1,N26*10^5,8,N42*1000,1)","v":37.934741264276781},{"$f":"[1]!HeCalc(2,0,1,O26*10^5,8,O42*1000,1)","v":35.129068251802344},{"$f":"[1]!HeCalc(2,0,1,P26*10^5,8,P42*1000,1)","v":32.367466423444554},{"$f":"[1]!HeCalc(2,0,1,Q26*10^5,8,Q42*1000,1)","v":29.678542624432723},{"$f":"[1]!HeCalc(2,0,1,R26*10^5,8,R42*1000,1)","v":29.349959144869015},{"$f":"[1]!HeCalc(2,0,1,S26*10^5,8,S42*1000,1)","v":29.023529514283961},{"$f":"[1]!HeCalc(2,0,1,T26*10^5,8,T42*1000,1)","v":28.699444332668442},{"$f":"[1]!HeCalc(2,0,1,U26*10^5,8,U42*1000,1)","v":28.377917113671284},{"$f":"[1]!HeCalc(2,0,1,V26*10^5,8,V42*1000,1)","v":28.059187851853135},{"$f":"[1]!HeCalc(2,0,1,W26*10^5,8,W42*1000,1)","v":27.743527033289936},{"$f":"[1]!HeCalc(2,0,1,X26*10^5,8,X42*1000,1)","v":27.431240534638672},{"$f":"[1]!HeCalc(2,0,1,Y26*10^5,8,Y42*1000,1)","v":27.122675299940717},null,null,null,null,null,null,null,null,null,null,null,31,{"$f":"m*AK43+p","v":18}]
[null,"Hout(iso)",null,{"$f":"[3]!h_(11,D26,D43)","v":162.49826962188638},null,null,null,{"$f":"[3]!h_(11,H26,H43)","v":309.98772881075598},{"$f":"[3]!h_(11,I26,I43)","v":294.86456616726934},{"$f":"[3]!h_(11,J26,J43)","v":279.75866777014562},{"$f":"[3]!h_(11,K26,K43)","v":257.14544578594246},{"$f":"[3]!h_(11,L26,L43)","v":242.11348988110379},{"$f":"[3]!h_(11,M26,M43)","v":227.13252131909871},{"$f":"[3]!h_(11,N26,N43)","v":212.22491892840063},{"$f":"[3]!h_(11,O26,O43)","v":197.42716480774439},{"$f":"[3]!h_(11,P26,P43)","v":182.8027668718864},{"$f":"[3]!h_(11,Q26,Q43)","v":168.47189864077652},{"$f":"[3]!h_(11,R26,R43)","v":166.71137428467176},{"$f":"[3]!h_(11,S26,S43)","v":164.95971642119173},{"$f":"[3]!h_(11,T26,T43)","v":163.21772069292714},{"$f":"[3]!h_(11,U26,U43)","v":161.48627540110866},{"$f":"[3]!h_(11,V26,V43)","v":159.76637509497812},{"$f":"[3]!h_(11,W26,W43)","v":158.05913525108841},{"$f":"[3]!h_(11,X26,X43)","v":156.36581006592226},{"$f":"[3]!h_(11,Y26,Y43)","v":154.68781228210975}]
[null,"ΔHs",null,{"$f":"D40-D44","v":61.072796519284879},null,null,null,123.61112723885429,117.85956537483924,112.0753426223032,103.31715189894027,97.404059268453608,91.40804237674223,85.297783242907457,79.024014494192471,72.503971713689026,65.586105474386329,64.680789843437367,63.763988997064445,62.834732384211549,61.891937122044226,60.934391083594136,59.960734161573669,58.969435458208324,57.958767223438997]
[null,"u1","m/s",{"$f":"(2*52.7%*D45*1000*D28)^0.5","v":224.07402231056255},null,null,null,{"$f":"PI()*$D$47*H30","v":224.07402231056253},{"$f":"PI()*$D$47*I30","v":224.07402231056253},224.07402231056253,224.07402231056253,224.07402231056253,224.07402231056253,224.07402231056253,224.07402231056253,224.07402231056253,224.07402231056253,224.07402231056253,224.07402231056253,224.07402231056253,224.07402231056253,224.07402231056253,224.07402231056253,224.07402231056253,224.07402231056253]
[null,"D1",null,{"$f":"D46/PI()/D30","v":3.5751867939057311E-2}]
[null,"Co = (2*ΔHs)^0,5",null,{"$f":"(2000*D45)^0.5","v":349.49333761685608},null,null,null,497.21449544206632,485.50914589704536,473.44554622955997,454.57046076255386,441.37072686904287,427.56997644068093,413.03216156349731,397.55254871322978,380.79908538148834,362.17704365237267,359.66870823978383,357.11059630614278,354.49889247841537,351.82932544642784,349.09709561551534,346.29679225073301,343.42229239875599,340.4666421940305]
[null,"u1/Co",null,{"$f":"D46/D48","v":0.64113961038138956},null,null,null,0.45065866816964278,0.46152379250560716,0.47328362067200769,0.49293573087585252,0.50767757957143933,0.52406397702634178,0.54250986524233324,0.56363372096551667,0.58843109375140157,0.61868643040124549,0.62300115961485569,0.62746394150250573,0.63208666392154067,0.63688273291670705,0.64186733468946033,0.64705774735656174,0.65247372482851151,0.65813796284589809]
[null,"U1/C0 off de / U1/C0 nom",null,{"$f":"D49/$D$49","v":1},null,null,null,{"$f":"H49/$D49","v":0.70290255175711747},{"$f":"I49/$D49","v":0.71984913275138973},0.73819120361393564,0.7688430458736184,0.79183624182795576,0.81739447780273011,0.84616494825458499,0.87911230539980589,0.9177893304726038,0.96497926564420577,0.97170904671488945,0.97866974890110336,0.98587991396372521,0.99336045161497621,1.0011350481178942,1.0092306525432919,1.0176780755136619,1.0265127160906451]
[null,"Rdt",null,{"$f":"(0.321*D50^4-1.6098*D50^3+1.316*D50^2+0.9448*D50)*($D28/0.97215493)","v":0.77987569327041328},null,null,null,{"$f":"(0.321*H50^4-1.6098*H50^3+1.316*H50^2+0.9448*H50)*($D28/0.97)","v":0.6703182774395634},0.68170213575645389,0.69341794894550079,0.71153843897972602,0.72388801598944175,0.73631628203786348,0.74861446139193255,0.76041978724172521,0.77106271109366742,0.77917010867263814,0.77987835766707858,0.78049149951993901,0.78099797258988957,0.78138440821218469,0.78163526190509069,0.78173235125064799,0.78165427361813411,0.7813756662222977]
[]
[]
[null,"TURBINE 2"]
[null,null,null,null,null,null,null,5]
[null,null,null,"DESIGN",null,null,null,{"$f":"H21","v":"start-up"},{"$f":"I21","v":"start-up"},"start-up","start-up","start-up","start-up","start-up","start-up","start-up","start-up",0,0,0,0,0,0,0,0]
[null,"Delta Debit",null,null,null,null,null,{"$f":"H58-H23","v":-27.422672868317434},{"$f":"I58-I23","v":-27.414296264357631},{"$f":"J58-J23","v":-27.296444704250476},-26.799244452429619,-26.129813897885711,-25.023203714664049,-23.229040245939473,-20.307743163218035,-15.433043299223442,-6.9028347754183983,-5.4249496106897936,-3.8233127069360648,-2.0846387429801609,-0.19380132754184842,1.8664903939556439,4.1160834465846392,6.5778633391341543,9.2783492845603632]
[null,"m","g/s",191.20000000000002,null,null,null,{"$f":"H71*H59/H60^0.5","v":78.674294158493495},{"$f":"I71*I59/I60^0.5","v":82.002024576223931},85.822786018093439,92.784130169961301,98.549141248863293,105.59171518969117,114.44296575673033,125.98712755079568,141.81675567330154,165.12450404868704,168.8517850483816,172.82030152359025,177.05509357422531,181.58480980079358,186.4423833400495,191.66586836405082,197.29948040651828,203.39490437149482]
[null,"Pin","Bara",6.3070000000000004,null,null,null,4.8648442828706333,4.8749470369194778,4.8900582675092412,4.926261723222316,4.9637310001802595,5.0174710467590122,5.0957088330809759,5.2127541468270833,5.3956808651743886,5.702092132838291,5.7545341855530507,5.8113091128544658,5.872924698366937,5.9399693637357851,6.013128605254467,6.0932055837465464,6.1811470911073343,6.2780766155336671]
[null,"Tin","K",18.21,null,null,null,{"$f":"m*H27+p","v":63.99001861143708},{"$f":"m*I27+p","v":59.146726475132979},54.33290304280375,47.176706763845104,42.457150835191044,37.787670605014114,33.179593511960597,28.649839669849605,24.225763749616192,{"$f":"m*Q27+p","v":19.956550146794093},19.437888922356919,18.923370669948476,18.413318874837792,17.908097031536343,17.408115217928035,16.913837752621362,16.425792551925987,15.944582268338863]
[null,"Pout","Bara",1.35,null,null,null,1.1499999999999999,1.1499999999999999,1.1499999999999999,1.1499999999999999,1.1499999999999999,1.1499999999999999,1.1499999999999999,1.1499999999999999,1.1499999999999999,1.1499999999999999,1.1499999999999999,1.1499999999999999,1.1499999999999999,1.1499999999999999,1.1499999999999999,1.1499999999999999,1.1499999999999999,1.1499999999999999]
[null,"Tout","K",{"$f":"[3]!T2_turb(11,D59,D60,D61,D63)","v":11.618357475588732},null,null,null,{"$f":"[3]!T2_turb(11,H59,H60,H61,H63)","v":49.486754249914846},{"$f":"[3]!T2_turb(11,I59,I60,I61,I63)","v":45.226046274436612},{"$f":"[3]!T2_turb(11,J59,J60,J61,J63)","v":41.023481985474177},{"$f":"[3]!T2_turb(11,K59,K60,K61,K63)","v":34.846529967859865},{"$f":"[3]!T2_turb(11,L59,L60,L61,L63)","v":30.828417932151755},{"$f":"[3]!T2_turb(11,M59,M60,M61,M63)","v":26.906189341484318},{"$f":"[3]!T2_turb(11,N59,N60,N61,N63)","v":23.098314293927196},{"$f":"[3]!T2_turb(11,O59,O60,O61,O63)","v":19.429686904509566},{"$f":"[3]!T2_turb(11,P59,P60,P61,P63)","v":15.935032850351334},{"$f":"[3]!T2_turb(11,Q59,Q60,Q61,Q63)","v":12.664731607796734},{"$f":"[3]!T2_turb(11,R59,R60,R61,R63)","v":12.275130142645626},{"$f":"[3]!T2_turb(11,S59,S60,S61,S63)","v":11.89035374374839},{"$f":"[3]!T2_turb(11,T59,T60,T61,T63)","v":11.510597109678917},{"$f":"[3]!T2_turb(11,U59,U60,U61,U63)","v":11.136065676293184},{"$f":"[3]!T2_turb(11,V59,V60,V61,V63)","v":10.766976144104159},{"$f":"[3]!T2_turb(11,W59,W60,W61,W63)","v":10.403556812660732},{"$f":"[3]!T2_turb(11,X59,X60,X61,X63)","v":10.046047927867395},{"$f":"[3]!T2_turb(11,Y59,Y60,Y61,Y63)","v":9.6947018124914859}]
[null,"Efficacity","%",0.76,null,null,null,{"$f":"(0.321*H85^4-1.6098*H85^3+1.316*H85^2+0.9448*H85)*($D$63/0.97215493)","v":0.51929193708231935},{"$f":"(0.321*I85^4-1.6098*I85^3+1.316*I85^2+0.9448*I85)*($D$63/0.97215493)","v":0.53832570561364601},0.55895183636083101,0.59317735698995133,0.61832769366220386,0.64532987935431363,0.67390677089009465,0.70324096155243965,0.73133216049441052,0.75349499632897088,0.75541020039948259,0.75704483227416264,0.75836248748235957,0.75932231074780865,0.75987838961674159,0.75997905272047361,0.75956605357811835,0.75857361781388766]
[null,"Power","W",{"$f":"+D58*(D75-D76)","v":6144.650345780522},null,null,null,5991.0340871315884,5991.0340871263224,5991.0340871188782,5991.0340871045819,5991.0340870961882,5991.03408709408,5991.0340869370111,5991.0340870421915,5991.0340868781914,5991.03408677277,5991.0340870357022,5991.0340866634888,5991.0340871001581,5991.0340867728,5991.0340870669243,5991.0340869882457,5991.0340871374128,5991.034087123976]
[null,"Speed","Hz",1496,null,null,null,1496,1496,1496,1496,1496,1496,1496,1496,1496,1496,1496,1496,1496,1496,1496,1496,1496,1496]
[null,null,null,null,null,null,null,{"$f":"(H64/$D64*$D68/H68)^(1/3)*$D65","v":1495.9999999996319},{"$f":"(I64/$D64*$D68/I68)^(1/3)*$D65","v":1495.9999999991937},1495.9999999985741,1495.9999999973841,1495.9999999966853,1495.99999999651,1495.9999999834363,1495.9999999921911,1495.9999999785405,1495.9999999697657,1495.9999999916508,1495.9999999606696,1495.9999999970159,1495.9999999697682,1495.9999999942497,1495.9999999877007,1496.0000000001169,1495.9999999989984]
[null,"Delta Speed Frein & Turbine",null,null,null,null,null,{"$f":"H65-H66","v":3.681179805425927E-10},{"$f":"I65-I66","v":8.0626705312170088E-10},1.4258603187045082E-9,2.6159341359743848E-9,3.314653440611437E-9,3.4899585443781689E-9,1.6563717508688569E-8,7.8089215094223619E-9,2.1459527488332242E-8,{"$f":"Q65-Q66","v":3.0234332371037453E-8},{"$f":"R65-R66","v":8.3491613622754812E-9},3.9330416257143952E-8,2.9840521165169775E-9,3.0231831260607578E-8,5.7502802519593388E-9,1.2299324225750752E-8,-1.1687006917782128E-10,1.0015810403274372E-9]
[null,"Brake Pressure",null,8,null,null,null,{"$f":"($D68-$D61)+H61","v":7.8000000000000007},{"$f":"($D68-$D61)+I61","v":7.8000000000000007},7.8000000000000007,7.8000000000000007,7.8000000000000007,7.8000000000000007,7.8000000000000007,7.8000000000000007,7.8000000000000007,7.8000000000000007,7.8000000000000007,7.8000000000000007,7.8000000000000007,7.8000000000000007,7.8000000000000007,7.8000000000000007,7.8000000000000007,7.8000000000000007]
[null,"Rho (brake)",null,{"$f":"[3]!rho_(11,D68,330)","v":1.1632432504804469},null,null,null,{"$f":"[3]!rho_(11,H68,330)","v":1.1342549379241607},{"$f":"[3]!rho_(11,I68,330)","v":1.1342549379241607},{"$f":"[3]!rho_(11,J68,330)","v":1.1342549379241607},{"$f":"[3]!rho_(11,K68,330)","v":1.1342549379241607},{"$f":"[3]!rho_(11,L68,330)","v":1.1342549379241607},{"$f":"[3]!rho_(11,M68,330)","v":1.1342549379241607},{"$f":"[3]!rho_(11,N68,330)","v":1.1342549379241607},{"$f":"[3]!rho_(11,O68,330)","v":1.1342549379241607},{"$f":"[3]!rho_(11,P68,330)","v":1.1342549379241607},{"$f":"[3]!rho_(11,Q68,330)","v":1.1342549379241607},{"$f":"[3]!rho_(11,R68,330)","v":1.1342549379241607},{"$f":"[3]!rho_(11,S68,330)","v":1.1342549379241607},{"$f":"[3]!rho_(11,T68,330)","v":1.1342549379241607},{"$f":"[3]!rho_(11,U68,330)","v":1.1342549379241607},{"$f":"[3]!rho_(11,V68,330)","v":1.1342549379241607},{"$f":"[3]!rho_(11,W68,330)","v":1.1342549379241607},{"$f":"[3]!rho_(11,X68,330)","v":1.1342549379241607},{"$f":"[3]!rho_(11,Y68,330)","v":1.1342549379241607}]
[null,"Wheel","mm",39.5,null,null,null,{"$f":"$D$35","v":35.799999999999997},{"$f":"$D$35","v":35.799999999999997},35.799999999999997,35.799999999999997,35.799999999999997,35.799999999999997,35.799999999999997,35.799999999999997,35.799999999999997,35.799999999999997,35.799999999999997,35.799999999999997,35.799999999999997,35.799999999999997,35.799999999999997,35.799999999999997,35.799999999999997,35.799999999999997]
[null,"a = mÖT/P",null,{"$f":"D58*D60^0.5/D59","v":129.36596422035444},null,null,null,{"$f":"$D$71","v":129.36596422035444},129.36596422035444,129.36596422035444,129.36596422035444,129.36596422035444,129.36596422035444,129.36596422035444,129.36596422035444,129.36596422035444,129.36596422035444,129.36596422035444,129.36596422035444,129.36596422035444,129.36596422035444,129.36596422035444,129.36596422035444,129.36596422035444,129.36596422035444]
[null,"Rho (in)","kg/m3",{"$f":"[3]!rho_(11,D59,D60)","v":16.817250243896773},null,null,null,{"$f":"[3]!rho_(11,H59,H60)","v":3.6225364975506773},{"$f":"[3]!rho_(11,I59,I60)","v":3.9250425508969169},{"$f":"[3]!rho_(11,J59,J60)","v":4.2834668971466456},{"$f":"[3]!rho_(11,K59,K60)","v":4.9653197629524595},{"$f":"[3]!rho_(11,L59,L60)","v":5.5564111829551104},{"$f":"[3]!rho_(11,M59,M60)","v":6.3087297168304932},{"$f":"[3]!rho_(11,N59,N60)","v":7.2982014467038452},{"$f":"[3]!rho_(11,O59,O60)","v":8.6567135517087284},{"$f":"[3]!rho_(11,P59,P60)","v":10.634451553256186},{"$f":"[3]!rho_(11,Q59,Q60)","v":13.76743637989002},{"$f":"[3]!rho_(11,R59,R60)","v":14.29142897365462},{"$f":"[3]!rho_(11,S59,S60)","v":14.856052737710192},{"$f":"[3]!rho_(11,T59,T60)","v":15.466108083860259},{"$f":"[3]!rho_(11,U59,U60)","v":16.127165066662116},{"$f":"[3]!rho_(11,V59,V60)","v":16.845720285511145},{"$f":"[3]!rho_(11,W59,W60)","v":17.629392996690076},{"$f":"[3]!rho_(11,X59,X60)","v":18.48717142526985},{"$f":"[3]!rho_(11,Y59,Y60)","v":19.429724735305907}]
[null,"Sound Speed",null,{"$f":"[3]!Sound_speed(11,D59,D60)","v":258.39146376447951},null,null,null,{"$f":"[3]!Sound_speed(11,H59,H60)","v":475.87607050814597},{"$f":"[3]!Sound_speed(11,I59,I60)","v":457.90987584885238},{"$f":"[3]!Sound_speed(11,J59,J60)","v":439.31639779651942},{"$f":"[3]!Sound_speed(11,K59,K60)","v":410.0932418327713},{"$f":"[3]!Sound_speed(11,L59,L60)","v":389.59418528959492},{"$f":"[3]!Sound_speed(11,M59,M60)","v":368.15393207032912},{"$f":"[3]!Sound_speed(11,N59,N60)","v":345.63508895900139},{"$f":"[3]!Sound_speed(11,O59,O60)","v":321.86896646919303},{"$f":"[3]!Sound_speed(11,P59,P60)","v":296.65437078241479},{"$f":"[3]!Sound_speed(11,Q59,Q60)","v":269.78692631420131},{"$f":"[3]!Sound_speed(11,R59,R60)","v":266.30626118631369},{"$f":"[3]!Sound_speed(11,S59,S60)","v":262.79902273185087},{"$f":"[3]!Sound_speed(11,T59,T60)","v":259.26597126593077},{"$f":"[3]!Sound_speed(11,U59,U60)","v":255.7082371842408},{"$f":"[3]!Sound_speed(11,V59,V60)","v":252.12743427485526},{"$f":"[3]!Sound_speed(11,W59,W60)","v":248.52580938527777},{"$f":"[3]!Sound_speed(11,X59,X60)","v":244.90644535373434},{"$f":"[3]!Sound_speed(11,Y59,Y60)","v":241.27353631849809}]
[null,"S=Q/(rho*V) = cte",null,{"$f":"D58/(D72*D73)","v":4.4000208975996838E-2},null,null,null,4.5637959509947493E-2,4.562471825262969E-2,4.5606818768404042E-2,4.5566310619433219E-2,4.5524585590822612E-2,4.5463040746040469E-2,4.5368605600550373E-2,4.5216195901970214E-2,4.4953312288370871E-2,4.4456733334319987E-2,4.4365831312535478E-2,4.4265724852356053E-2,4.4155200897901904E-2,4.4032846984338521E-2,4.3897011694071418E-2,4.3745755874553281E-2,4.3576792280394398E-2,4.3387410501045019E-2]
[null,"Hin",null,{"$f":"[3]!h_(11,D59,D60)","v":105.90220745591094},null,null,null,{"$f":"[3]!h_(11,H59,H60)","v":348.53976600967707},{"$f":"[3]!h_(11,I59,I60)","v":323.28001922359067},{"$f":"[3]!h_(11,J59,J60)","v":298.15018908459007},{"$f":"[3]!h_(11,K59,K60)","v":260.73077905947883},{"$f":"[3]!h_(11,L59,L60)","v":235.9940165068642},{"$f":"[3]!h_(11,M59,M60)","v":211.45086092152738},{"$f":"[3]!h_(11,N59,N60)","v":187.12996531798069},{"$f":"[3]!h_(11,O59,O60)","v":163.06841047629896},{"$f":"[3]!h_(11,P59,P60)","v":139.31606808781771},{"$f":"[3]!h_(11,Q59,Q60)","v":115.94283288735825},{"$f":"[3]!h_(11,R59,R60)","v":113.05239757366947},{"$f":"[3]!h_(11,S59,S60)","v":110.16961290434323},{"$f":"[3]!h_(11,T59,T60)","v":107.29471079261661},{"$f":"[3]!h_(11,U59,U60)","v":104.42792571544564},{"$f":"[3]!h_(11,V59,V60)","v":101.56949201279384},{"$f":"[3]!h_(11,W59,W60)","v":98.719638849939315},{"$f":"[3]!h_(11,X59,X60)","v":95.878584353285547},{"$f":"[3]!h_(11,Y59,Y60)","v":93.046526993049937}]
[null,"Hout",null,{"$f":"[3]!h_(11,D61,D62)","v":73.764914852456329},null,null,null,{"$f":"[3]!h_(11,H61,H62)","v":272.389936497863},{"$f":"[3]!h_(11,I61,I62)","v":250.22043175502233},{"$f":"[3]!h_(11,J61,J62)","v":228.34315571869783},{"$f":"[3]!h_(11,K61,K62)","v":196.1611799682307},{"$f":"[3]!h_(11,L61,L62)","v":175.20166447644718},{"$f":"[3]!h_(11,M61,M62)","v":154.71313224336893},{"$f":"[3]!h_(11,N61,N62)","v":134.78044739590882},{"$f":"[3]!h_(11,O61,O62)","v":115.51566279874979},{"$f":"[3]!h_(11,P61,P62)","v":97.071172141392779},{"$f":"[3]!h_(11,Q61,Q62)","v":79.660912640038021},{"$f":"[3]!h_(11,R61,R62)","v":77.571374466220092},{"$f":"[3]!h_(11,S61,S62)","v":75.503349543810302},{"$f":"[3]!h_(11,T61,T62)","v":73.45759283029949},{"$f":"[3]!h_(11,U61,U62)","v":71.434890156220035},{"$f":"[3]!h_(11,V61,V62)","v":69.436057652324607},{"$f":"[3]!h_(11,W61,W62)","v":67.461939510332044},{"$f":"[3]!h_(11,X61,X62)","v":65.51340511006903},{"$f":"[3]!h_(11,Y61,Y62)","v":63.59134420154043}]
[null,"Sin = Sout",null,{"$f":"[3]!S_(11,D59,D60)","v":13.041567593259808},null,null,null,{"$f":"[3]!S_(11,H59,H60)","v":20.295345571907735},{"$f":"[3]!S_(11,I59,I60)","v":19.880505013610161},{"$f":"[3]!S_(11,J59,J60)","v":19.430838647969683},{"$f":"[3]!S_(11,K59,K60)","v":18.676828730365838},{"$f":"[3]!S_(11,L59,L60)","v":18.108415649778841},{"$f":"[3]!S_(11,M59,M60)","v":17.473335244686407},{"$f":"[3]!S_(11,N59,N60)","v":16.754355698754644},{"$f":"[3]!S_(11,O59,O60)","v":15.926797440588436},{"$f":"[3]!S_(11,P59,P60)","v":14.953718445589042},{"$f":"[3]!S_(11,Q59,Q60)","v":13.776717910825422},{"$f":"[3]!S_(11,R59,R60)","v":13.610982125704078},{"$f":"[3]!S_(11,S59,S60)","v":13.440358212124927},{"$f":"[3]!S_(11,T59,T60)","v":13.264571284703859},{"$f":"[3]!S_(11,U59,U60)","v":13.083324102877413},{"$f":"[3]!S_(11,V59,V60)","v":12.896294702713062},{"$f":"[3]!S_(11,W59,W60)","v":12.70313363203895},{"$f":"[3]!S_(11,X59,X60)","v":12.503460841681411},{"$f":"[3]!S_(11,Y59,Y60)","v":12.296862069730325}]
[null,"Tout(iso)",null,{"$f":"[1]!HeCalc(2,0,1,D61*10^5,8,D77*1000,1)","v":9.7639107105745424},null,null,null,{"$f":"[1]!HeCalc(2,0,1,H61*10^5,8,H77*1000,1)","v":35.947103438643005},{"$f":"[1]!HeCalc(2,0,1,I61*10^5,8,I77*1000,1)","v":33.197752244297476},{"$f":"[1]!HeCalc(2,0,1,J61*10^5,8,J77*1000,1)","v":30.456638271221998},{"$f":"[1]!HeCalc(2,0,1,K61*10^5,8,K77*1000,1)","v":26.363826148126638},{"$f":"[1]!HeCalc(2,0,1,L61*10^5,8,L77*1000,1)","v":23.650965006561574},{"$f":"[1]!HeCalc(2,0,1,M61*10^5,8,M77*1000,1)","v":20.954167971623924},{"$f":"[1]!HeCalc(2,0,1,N61*10^5,8,N77*1000,1)","v":18.277902606733804},{"$f":"[1]!HeCalc(2,0,1,O61*10^5,8,O77*1000,1)","v":15.628888838466809},{"$f":"[1]!HeCalc(2,0,1,P61*10^5,8,P77*1000,1)","v":13.017937656422019},{"$f":"[1]!HeCalc(2,0,1,Q61*10^5,8,Q77*1000,1)","v":10.464112510387567},{"$f":"[1]!HeCalc(2,0,1,R61*10^5,8,R77*1000,1)","v":10.150457262628809},{"$f":"[1]!HeCalc(2,0,1,S61*10^5,8,S77*1000,1)","v":9.8383432454338173},{"$f":"[1]!HeCalc(2,0,1,T61*10^5,8,T77*1000,1)","v":9.5278899343344516},{"$f":"[1]!HeCalc(2,0,1,U61*10^5,8,U77*1000,1)","v":9.2192311353453924},{"$f":"[1]!HeCalc(2,0,1,V61*10^5,8,V77*1000,1)","v":8.9125174281755406},{"$f":"[1]!HeCalc(2,0,1,W61*10^5,8,W77*1000,1)","v":8.60791903177401},{"$f":"[1]!HeCalc(2,0,1,X61*10^5,8,X77*1000,1)","v":8.3056294361162006},{"$f":"[1]!HeCalc(2,0,1,Y61*10^5,8,Y77*1000,1)","v":8.0058698488834654}]
[null,"Hout(iso)",null,{"$f":"[3]!h_(11,D61,D78)","v":63.616296135548602},null,null,null,{"$f":"[3]!h_(11,H61,H78)","v":201.89811018180592},{"$f":"[3]!h_(11,I61,I78)","v":187.56369227374427},{"$f":"[3]!h_(11,J61,J78)","v":173.26101469635464},{"$f":"[3]!h_(11,K61,K78)","v":151.87699640853057},{"$f":"[3]!h_(11,L61,L78)","v":137.67664749115869},{"$f":"[3]!h_(11,M61,M78)","v":123.53035624114978},{"$f":"[3]!h_(11,N61,N78)","v":109.44931246902843},{"$f":"[3]!h_(11,O61,O78)","v":95.448988006120203},{"$f":"[3]!h_(11,P61,P78)","v":81.551760392302825},{"$f":"[3]!h_(11,Q61,Q78)","v":67.791325015262842},{"$f":"[3]!h_(11,R61,R78)","v":66.083183908450238},{"$f":"[3]!h_(11,S61,S78)","v":64.378053563796058},{"$f":"[3]!h_(11,T61,T78)","v":62.676050823471002},{"$f":"[3]!h_(11,U61,U78)","v":60.977292048737773},{"$f":"[3]!h_(11,V61,V78)","v":59.281890722395282},{"$f":"[3]!h_(11,W61,W78)","v":57.589953437119739},{"$f":"[3]!h_(11,X61,X78)","v":55.90157498040211},{"$f":"[3]!h_(11,Y61,Y78)","v":54.216831232741818}]
[null,"ΔHs",null,{"$f":"D75-D79","v":42.285911320362338},null,null,null,146.64165582787115,135.7163269498464,124.88917438823543,108.85378265094826,98.317369015705509,87.920504680377604,77.680652848952263,67.619422470178762,57.764307695514887,48.151507872095408,46.969213665219229,45.791559340547167,44.618659969145611,43.450633666707866,42.287601290398563,41.129685412819576,39.977009372883437,38.82969576030812]
[null,"u1","m/s",{"$f":"(2*52.7%*D80*1000*D63)^0.5","v":184.04539223806461},null,null,null,{"$f":"PI()*$D$82*H65","v":184.04539223806461},184.04539223806461,184.04539223806461,184.04539223806461,184.04539223806461,184.04539223806461,184.04539223806461,184.04539223806461,184.04539223806461,{"$f":"PI()*$D$82*Q65","v":184.04539223806461},{"$f":"PI()*$D$82*R65","v":184.04539223806461},184.04539223806461,184.04539223806461,184.04539223806461,184.04539223806461,184.04539223806461,184.04539223806461,184.04539223806461]
[null,"D1",null,{"$f":"D81/PI()/D65","v":3.9160072096222902E-2}]
[null,"Co = (2*ΔHs)^0,5",null,{"$f":"(2000*D80)^0.5","v":290.81234953269205},null,null,null,541.55637901860439,520.99199024523671,499.77829962541477,466.59143294953083,443.43515651266421,419.33400692139816,394.15898530656955,367.74834457867723,339.89500642261544,310.32727199553506,306.49376393401292,302.62702899954974,298.7261621256016,294.79020901891522,290.81816067913832,286.80894481455624,282.76141664973824,278.67434672143082]
[null,"u1/Co",null,{"$f":"D81/D83","v":0.6328664946100403},null,null,null,0.33984530395817197,0.35325954272623733,0.36825406860603421,0.39444657411438583,0.41504465655241385,0.43889927647237753,0.46693187038452899,0.50046558999177049,0.54147718783849386,0.59306870148593527,0.60048658046331072,0.60815913517869691,0.61610068207109814,0.62432667913422912,0.63285384863266214,0.64170032199331828,0.65088580478448022,0.66043177064317493]
[null,"U1/C0 off de / U1/C0 nom",null,{"$f":"D84/$D$49","v":0.98709623358564935},null,null,null,{"$f":"H84/$D84","v":0.53699367378830487},{"$f":"I84/$D84","v":0.5581896746546976},0.58188270629328387,0.62326980093556061,0.65581708004332906,0.69351005340047034,0.73780469397774495,0.79079172977888079,0.85559465139980473,0.93711502589716389,0.94883610615745828,0.96095960263061864,0.97350813689501303,0.98650613431340961,0.99998001793824476,1.0139584374564199,1.0284725298746351,1.0435562259463897]
[null,"Rdt",null,{"$f":"(0.321*D85^4-1.6098*D85^3+1.316*D85^2+0.9448*D85)*($D63/0.97215493)","v":0.75935604730996153},null,null,null,{"$f":"(0.321*H85^4-1.6098*H85^3+1.316*H85^2+0.9448*H85)*($D63/0.97215493)","v":0.51929193708231935},{"$f":"(0.321*I85^4-1.6098*I85^3+1.316*I85^2+0.9448*I85)*($D63/0.97215493)","v":0.53832570561364601},0.55895183636083101,0.59317735698995133,0.61832769366220386,0.64532987935431363,0.67390677089009465,0.70324096155243965,0.73133216049441052,0.75349499632897088,0.75541020039948259,0.75704483227416264,0.75836248748235957,0.75932231074780865,0.75987838961674159,0.75997905272047361,0.75956605357811835,0.75857361781388766]
[]
[null,"TURBINE 3"]
[]
[null,null,null,"DESIGN",null,{"$f":"F56","v":0},{"$f":"G56","v":0},{"$f":"H56","v":"start-up"},{"$f":"I56","v":"start-up"}]
[]
[null,"m","g/s",399.8,null,{"$f":"F105/(F95*F94)^0.5*F93","v":161.47618188513178},{"$f":"G105/(G95*G94)^0.5*G93","v":95.080415199611181},{"$error":"#DIV/0!"},117.10102732642108]
[null,"Pin","Bara",13.07,null,13.07,7.3689999999999998,null,10.48]
[null,"Tin","K",7.2919999999999998,null,9.16,7.9119999999999999,null,10.55]
[null,"Pout","Bara",4.88,null,4.88,5.18,null,5.18]
[null,"Tout","K",{"$f":"[3]!T2_turb(11,D93,D94,D95,D97)","v":6.1198408797506243},null,{"$f":"[3]!T2_turb(11,F93,F94,F95,F97)","v":7.0494463059442776},{"$f":"[3]!T2_turb(11,G93,G94,G95,G97)","v":7.1447253899950391},{"$f":"[3]!T2_turb(11,H93,H94,H95,H97)","v":{"$error":"#VALUE!"}},{"$f":"[3]!T2_turb(11,I93,I94,I95,I97)","v":8.6903815136344829}]
[null,"Efficacity","%",0.72,null,{"$f":"(0.321*F119^4-1.6098*F119^3+1.316*F119^2+0.9448*F119)*($D$97/0.97215493)","v":0.58179731360313081},{"$f":"(0.321*G119^4-1.6098*G119^3+1.316*G119^2+0.9448*G119)*($D$97/0.97215493)","v":0.582724483494652},{"$f":"(0.321*H119^4-1.6098*H119^3+1.316*H119^2+0.9448*H119)*($D$97/0.97215493)","v":{"$error":"#VALUE!"}},{"$f":"(0.321*I119^4-1.6098*I119^3+1.316*I119^2+0.9448*I119)*($D$97/0.97215493)","v":0.50201641458397539}]
[null,"Power","W",{"$f":"+D92*(D109-D110)","v":2075.5404202052005},null,954.74184184263254,182.5140950412455,{"$error":"#DIV/0!"},610.67834348723773]
[null,"Speed","Hz",2076,null,1602.552519659416,914.20818650847264,862.66257848011605,1367.3629344539765]
[null,null,null,null,null,{"$f":"(F98/$D98*$D102/F102)^(1/3)*$D99","v":1602.5525123839127},{"$f":"(G98/$D98*$D102/G102)^(1/3)*$D99","v":914.20817108894096},{"$f":"(H98/$D98*$D102/H102)^(1/3)*$D99","v":{"$error":"#DIV/0!"}},{"$f":"(I98/$D98*$D102/I102)^(1/3)*$D99","v":1367.3629301538849}]
[null,null,null,null,null,{"$f":"F99-F100","v":7.2755033215798903E-6},{"$f":"G99-G100","v":1.5419531678162457E-5},{"$f":"H99-H100","v":{"$error":"#DIV/0!"}},{"$f":"I99-I100","v":4.300091632103431E-6}]
[null,"Brake Pressure",null,10.1,null,{"$f":"($D102-$D95)+F95","v":10.1},{"$f":"($D102-$D95)+G95","v":10.399999999999999},{"$f":"($D102-$D95)+H95","v":5.22},{"$f":"($D102-$D95)+I95","v":10.399999999999999}]
[null,"Rho (brake)",null,{"$f":"[3]!rho_(11,D102,330)","v":1.4673342046153373},null,{"$f":"[3]!rho_(11,F102,330)","v":1.4673342046153373},{"$f":"[3]!rho_(11,G102,330)","v":1.5107331217743123},{"$f":"[3]!rho_(11,H102,330)","v":0.75987987169063398},{"$f":"[3]!rho_(11,I102,330)","v":1.5107331217743123}]
[null,"Wheel","mm",29.5,null,{"$f":"$D$104","v":29.5},{"$f":"$D$104","v":29.5},{"$f":"$D$104","v":29.5},{"$f":"$D$104","v":29.5}]
[null,"a = mÖT/P",null,{"$f":"D92*D94^0.5/D93","v":82.601994178997316},null,{"$f":"$D$105","v":82.601994178997316},{"$f":"$D$105","v":82.601994178997316},82.601994178997316,82.601994178997316]
[null,"Rho (in)","kg/m3",{"$f":"[3]!rho_(11,D93,D94)","v":122.0413850208848},null,{"$f":"[3]!rho_(11,F93,F94)","v":92.042022544510019},{"$f":"[3]!rho_(11,G93,G94)","v":70.649649504414128},{"$f":"[3]!rho_(11,H93,H94)","v":"NUM"},{"$f":"[3]!rho_(11,I93,I94)","v":58.789985568547117}]
[null,"Sound Speed",null,{"$f":"[3]!Sound_speed(11,D93,D94)","v":249.05671288435045},null,{"$f":"[3]!Sound_speed(11,F93,F94)","v":219.03534618547846},{"$f":"[3]!Sound_speed(11,G93,G94)","v":170.78644408370695},{"$f":"[3]!Sound_speed(11,H93,H94)","v":"NUM"},{"$f":"[3]!Sound_speed(11,I93,I94)","v":204.26692373410398}]
[null,"S=Q/(rho*V) = cte",null,{"$f":"D92/(D106*D107)","v":1.3153381307708404E-2},null,8.0095499679843866E-3,7.8800262035761022E-3,{"$error":"#DIV/0!"},9.7512278209034905E-3]
[null,"Hin",null,{"$f":"[3]!h_(11,D93,D94)","v":28.150884578454882},null,{"$f":"[3]!h_(11,F93,F94)","v":40.890140453818937},{"$f":"[3]!h_(11,G93,G94)","v":36.811643961665368},{"$f":"[3]!h_(11,H93,H94)","v":{"$error":"#VALUE!"}},{"$f":"[3]!h_(11,I93,I94)","v":54.059832308617963}]
[null,"Hout",null,{"$f":"[3]!h_(11,D95,D96)","v":22.959437804554931},null,{"$f":"[3]!h_(11,F95,F96)","v":34.977554271159498},{"$f":"[3]!h_(11,G95,G96)","v":34.892067835939827},{"$f":"[3]!h_(11,H95,H96)","v":{"$error":"#VALUE!"}},{"$f":"[3]!h_(11,I95,I96)","v":48.844862317065612}]
[null,"Sin = Sout",null,{"$f":"[3]!S_(11,D93,D94)","v":5.0600046690749361},null,{"$f":"[3]!S_(11,F93,F94)","v":6.606972813997622},{"$f":"[3]!S_(11,G93,G94)","v":6.9458302073485418},{"$f":"[3]!S_(11,H93,H94)","v":{"$error":"#VALUE!"}},{"$f":"[3]!S_(11,I93,I94)","v":8.3000204511344844}]
[null,"Tout(iso)",null,{"$f":"[1]!HeCalc(2,0,1,D95*10^5,8,D111*1000,1)","v":5.9351387842537191},null,{"$f":"[1]!HeCalc(2,0,1,F95*10^5,8,F111*1000,1)","v":6.6999950291002683},{"$f":"[1]!HeCalc(2,0,1,G95*10^5,8,G111*1000,1)","v":7.0241819850115181},{"$f":"[1]!HeCalc(2,0,1,H95*10^5,8,H111*1000,1)","v":{"$error":"#VALUE!"}},{"$f":"[1]!HeCalc(2,0,1,I95*10^5,8,I111*1000,1)","v":8.0488946725573083}]
[null,"Hout(iso)",null,{"$f":"[3]!h_(11,D95,D112)","v":20.940541836947467},null,{"$f":"[3]!h_(11,F95,F112)","v":30.727518437529557},{"$f":"[3]!h_(11,G95,G112)","v":33.517503797489027},{"$f":"[3]!h_(11,H95,H112)","v":{"$error":"#VALUE!"}},{"$f":"[3]!h_(11,I95,I112)","v":43.671785543492518}]
[null,"ΔHs",null,{"$f":"D109-D113","v":7.2103427415074144},null,10.162622016289379,3.2941401641763406,{"$error":"#VALUE!"},10.388046765125445]
[null,"u1","m/s",{"$f":"(2*52.7%*D114*1000*D97)^0.5","v":73.971514109656738},null,{"$f":"PI()*$D$116*F99","v":57.101751598965535},{"$f":"PI()*$D$116*G99","v":32.574838038282842},30.738177791866459,48.72153497060885]
[null,"D1",null,{"$f":"D115/PI()/D99","v":1.1341938457171245E-2},null,null,null,null,null,null,null,null,"T3"]
[null,"Co = (2*ΔHs)^0,5",null,{"$f":"(2000*D114)^0.5","v":120.0861585821398},null,142.56663015088333,81.16822240478524,{"$error":"#VALUE!"},144.13914641848999,null,null,"MAX",{"$f":"ROUND(F92,0)&\"g/s @ \"&F93&\" b ; \"&F94&\"K\"","v":"161g/s @ 13,07 b ; 9,16K"}]
[null,"u1/Co",null,{"$f":"D115/D117","v":0.61598701285010871},null,0.40052676799986592,0.40132501455843644,{"$error":"#VALUE!"},0.33801736850273811,null,null,"MIN",{"$f":"ROUND(G92,0)&\"g/s @ \"&G93&\" b ; \"&G94&\"K\"","v":"95g/s @ 7,369 b ; 7,912K"}]
[null,"U1/C0 off de / U1/C0 nom",null,{"$f":"D118/$D$49","v":0.96076892283052273},null,{"$f":"F118/$D118","v":0.65021950080841751},{"$f":"G118/$D118","v":0.65151538293242062},{"$f":"H118/$D118","v":{"$error":"#VALUE!"}},{"$f":"I118/$D118","v":0.54874106344996854},null,null,"STS",{"$f":"ROUND(H92,0)&\"g/s @ \"&H93&\" b ; \"&H94&\"K\"","v":{"$error":"#DIV/0!"}}]
[null,"Rdt",null,{"$f":"(0.321*D119^4-1.6098*D119^3+1.316*D119^2+0.9448*D119)*($D97/0.97215493)","v":0.7171786087866604},null,{"$f":"(0.321*F119^4-1.6098*F119^3+1.316*F119^2+0.9448*F119)*($D97/0.97215493)","v":0.58179731360313081},{"$f":"(0.321*G119^4-1.6098*G119^3+1.316*G119^2+0.9448*G119)*($D97/0.97215493)","v":0.582724483494652},{"$f":"(0.321*H119^4-1.6098*H119^3+1.316*H119^2+0.9448*H119)*($D97/0.97215493)","v":{"$error":"#VALUE!"}},{"$f":"(0.321*I119^4-1.6098*I119^3+1.316*I119^2+0.9448*I119)*($D97/0.97215493)","v":0.50201641458397539},null,null,"BAKING",{"$f":"ROUND(I92,0)&\"g/s @ \"&I93&\" b ; \"&I94&\"K\"","v":"117g/s @ 10,48 b ; 10,55K"}]
[]
[null,null,null,null,null,null,null,null,null,null,null,null,{"$f":"M47","v":0},{"$f":"M116","v":"T3"},"T1+T2"]
[null,"Courbe de rendement TC3",null,null,null,null,null,null,null,null,null,{"$f":"L117","v":"MAX"},{"$f":"M48","v":427.56997644068093},{"$f":"M117","v":"161g/s @ 13,07 b ; 9,16K"},{"$f":"F92+F58","v":161.47618188513178}]
[null,null,null,null,null,null,null,null,null,null,null,{"$f":"L118","v":"MIN"},{"$f":"M49","v":0.52406397702634178},{"$f":"M118","v":"95g/s @ 7,369 b ; 7,912K"},{"$f":"G92+G58","v":95.080415199611181}]
[null,null,null,null,null,null,null,null,null,null,null,{"$f":"L119","v":"STS"},{"$f":"M50","v":0.81739447780273011},{"$f":"M119","v":{"$error":"#DIV/0!"}},{"$f":"H92+H58","v":{"$error":"#DIV/0!"}}]
[null,null,null,null,null,null,null,null,null,null,null,{"$f":"L120","v":"BAKING"},{"$f":"M51","v":0.73631628203786348},{"$f":"M120","v":"117g/s @ 10,48 b ; 10,55K"},{"$f":"I92+I58","v":199.10305190264501}]
[null,null,null,null,"d : mm"]
[null,null,null,null,"N : Hz"]
[null,null,null,null,"H : J/kG"]
[]
[]
[]
[]
[]
[null,"rendement=(0,321*rap^4 - 1,6098*rap^3 + 1,316*rap^2 + 0,9448*rap)*(ETAgar/0,97)",null,null,null,null,null,null,"U1/CO _nom",0.64]
[null,null,null,null,null,null,null,null,"Eta_gar",0.8]
[null,"U1/C0",{"$f":"D28","v":0.78},{"$f":"D63","v":0.76},{"$f":"D97","v":0.72}]
[null,0,{"$f":"(0.321*B138^4-1.6098*B138^3+1.316*B138^2+0.9448*B138)*$D$28/0.97215493","v":0}]
[null,{"$f":"B138+0.05","v":0.05},{"$f":"(0.321*$B139^4-1.6098*$B139^3+1.316*$B139^2+0.9448*$B139)*$C$137/0.97215493","v":4.0382461852042459E-2},{"$f":"(0.321*$B139^4-1.6098*$B139^3+1.316*$B139^2+0.9448*$B139)*$D$137/0.97215493","v":3.9347014112246496E-2},{"$f":"(0.321*$B139^4-1.6098*$B139^3+1.316*$B139^2+0.9448*$B139)*$E$137/0.97215493","v":3.7276118632654578E-2}]
[null,0.1,{"$f":"(0.321*$B140^4-1.6098*$B140^3+1.316*$B140^2+0.9448*$B140)*$C$137/0.97215493","v":8.5098158171146673E-2},{"$f":"(0.321*$B140^4-1.6098*$B140^3+1.316*$B140^2+0.9448*$B140)*$D$137/0.97215493","v":8.2916154115476232E-2},{"$f":"(0.321*$B140^4-1.6098*$B140^3+1.316*$B140^2+0.9448*$B140)*$E$137/0.97215493","v":7.8552146004135376E-2}]
[null,0.15000000000000002,0.13323633134792623,0.12982001515951785,0.12298738278270113]
[null,0.2,0.18392485650409657,0.17920883454245307,0.16977679061916603]
[null,0.25,0.23633024149247489,0.23027049171061653,0.21815099214689987]
[null,0.3,0.28965762689698032,0.28223050825859619,0.26737627098182798]
[null,0.35,0.34315078603263366,0.33435204792923284,0.3167545717224311]
[null,0.39999999999999997,0.39609212494555779,0.38593591661362037,0.36562349994974563]
[null,0.44999999999999996,0.4478026824129771,0.43632056235110589,0.41335632222736346]
[null,0.49999999999999994,0.49764212994321799,0.48488207532928934,0.45936196610143198]
[null,0.54999999999999993,0.54500877177570861,0.53103418788402379,0.50308502010065403]
[null,0.6,0.58933954488097895,0.57422827449941549,0.54400573373628835]
[null,0.65,0.63011001896066099,0.61395335180782351,0.58164001750214867]
[null,0.70000000000000007,0.66683439644748832,0.64973607858986027,0.61553944287460449]
[null,0.75000000000000011,0.69906551250529614,0.68114075577439104,0.64529124231258095]
[null,0.80000000000000016,0.7263948350290218,0.70776932643853407,0.67051830925755851]
[null,0.8500000000000002,0.74845246464470438,0.72926137580766071,0.69087919813357312]
[null,0.90000000000000024,0.76490713470948513,0.74529413125539579,0.70606812434721711]
[null,0.95000000000000029,0.77546621131160665,0.7555824623036167,0.71581496428763691]
[null,1.0000000000000002,0.77987569327041351,0.75987888062245412,0.71988525532653547]
[null,1.0500000000000003,0.77792021213635165,0.75797354003029138,0.71808019581817073]
[null,1.1000000000000003,0.76942303219096997,0.74969423649376565,0.7102366450993568]
[null,1.1500000000000004,0.75424605044691839,0.73490640812776653,0.69622712348946292]
[null,1.2000000000000004,0.7322897966479478,0.71351313519543635,0.67595981229041324,null,"F Let u be the peripheral speed of the wheel : u = p . Æ . N / 60                      (in m/s)"]
[null,1.2500000000000004,0.70349343326891334,0.68545514010817188,0.64937855378668918,null,"F Let n, be the speed ratio of the turbine : n =  u / [ 2 . (H1 - H2S ) ] 0.5       (dimensionless number)"]
[null,1.3000000000000005,0.66783475551576954,0.65071078742562172,0.61646285124532574,null,null,"N = speed of rotation of the turbine (in rpm)"]
[null,1.3500000000000005,0.62533019132557388,0.60929608385568745,0.57722786891591438,null,null,"Æ = diameter of the wheel of the turbine (in m)"]
[null,1.4000000000000006,0.57603480136648577,0.56126467825452464,0.53172443203060227]
[null,1.4500000000000006,0.5200422790377659,0.50670786162654113,0.48003902680409161]
[null,1.5000000000000007,0.45748495046977738,0.44575456712439848,0.42229380043364062]

{"sheet":"Turbines_JT60SA (2)","index":7,"n_rows":159,"n_cols":15,"rows_kept":159,"cut":false,"hidden":false,"merged":[]}
[]
[]
[]
[]
[null,null,null,null,"Vitesse de la roue ajustée en fonction de la puissance du frein",null,null,null,null,null,null,{"$f":"D56*0.3","v":448.8}]
[]
[]
[null,"Relation entre la puissance et la vitesse de rotation",null,null,null,null,null,null,null,null,null,null,"²"]
[]
[null,"TURBINE 1"]
[]
[null,null,null,"DESIGN",null,"D3","STS","test",{"$f":"L42","v":"BAKING"}]
[]
[null,"m","g/s",191.5,null,{"$f":"F27/(F17*F16)^0.5*F15","v":67.345412094718213},{"$f":"G27/(G17*G16)^0.5*G15","v":69.557933504226568},76.159281124200461,61.809582516086259]
[null,"Pin","Bara",14.77,null,14.77,12.39,8,9.25]
[null,"Tin","K",40.03,null,50.44,40.729999999999997,55,37.119999999999997]
[null,"Pout","Bara",6.36,null,6.4169999999999998,5.242,1.35,4.0599999999999996]
[null,"Tout","K",{"$f":"[3]!T2_turb(11,D15,D16,D17,D19)","v":31.094586910112792},null,{"$f":"[3]!T2_turb(11,F15,F16,F17,F19)","v":41.7925989903474},{"$f":"[3]!T2_turb(11,G15,G16,G17,G19)","v":32.514839363849774},{"$f":"[3]!T2_turb(11,H15,H16,H17,H19)","v":46.315036459366233},{"$f":"[3]!T2_turb(11,I15,I16,I17,I19)","v":29.372250640597315}]
[null,"Efficacity","%",0.78,null,{"$f":"(0.321*F41^4-1.6098*F41^3+1.316*F41^2+0.9448*F41)*($D$19/0.97215493)","v":0.60962117374688851},{"$f":"(0.321*G41^4-1.6098*G41^3+1.316*G41^2+0.9448*G41)*($D$19/0.97215493)","v":0.69285540878309548},{"$f":"(0.321*H41^4-1.6098*H41^3+1.316*H41^2+0.9448*H41)*($D$19/0.97215493)","v":0.31442797350118995},{"$f":"(0.321*I41^4-1.6098*I41^3+1.316*I41^2+0.9448*I41)*($D$19/0.97215493)","v":0.74204227260897582}]
[null,"Power","W",{"$f":"+D14*(D31-D32)","v":9122.4436160855366},null,3130.6844311015102,3033.7443419532642,3519.2480229703187,2521.103291214944]
[null,"Speed","Hz",1995,null,1391.6843277296848,1498.3350869984386,1000,1578.7177791475433]
[null,"Speed calculated from P=K.rho.N^3",null,null,null,{"$f":"(F20/$D20*$D24/F24)^(1/3)*$D21","v":1391.6842880827912},{"$f":"(G20/$D20*$D24/G24)^(1/3)*$D21","v":1498.335070864048},{"$f":"(H20/$D20*$D24/H24)^(1/3)*$D21","v":4376.6220436959629},{"$f":"(I20/$D20*$D24/I24)^(1/3)*$D21","v":1578.7177763051557}]
[null,null,null,null,null,{"$f":"F21-F22","v":3.9646893583267229E-5},{"$f":"G21-G22","v":1.6134390534716658E-5},{"$f":"H21-H22","v":-3376.6220436959629},{"$f":"I21-I22","v":2.8423876301530981E-6}]
[null,"Brake Pressure",null,5.2,null,{"$f":"($D24-$D17)+F17","v":5.2569999999999997},{"$f":"($D24-$D17)+G17","v":4.0819999999999999},{"$f":"($D24-$D17)+H17","v":0.18999999999999995},{"$f":"($D24-$D17)+I17","v":2.8999999999999995}]
[null,"Rho (brake)",null,{"$f":"[3]!rho_(11,D24,330)","v":0.75697464940773784},null,{"$f":"[3]!rho_(11,F24,330)","v":0.76525440749261975},{"$f":"[3]!rho_(11,G24,330)","v":0.59449703414110489},{"$f":"[3]!rho_(11,H24,330)","v":2.7715477303010091E-2},{"$f":"[3]!rho_(11,I24,330)","v":0.42255652641901498}]
[null,"Wheel","mm",35.799999999999997,null,{"$f":"$D$26","v":35.799999999999997},{"$f":"$D$26","v":35.799999999999997},{"$f":"$D$26","v":35.799999999999997},{"$f":"$D$26","v":35.799999999999997}]
[null,"a = mÖT/P",null,{"$f":"D14*D16^0.5/D15","v":82.031580287488268},null,{"$f":"+$D$27","v":82.031580287488268},{"$f":"+$D$27","v":82.031580287488268},{"$f":"+$D$27","v":82.031580287488268},{"$f":"+$D$27","v":82.031580287488268}]
[null,"Rho (in)","kg/m3",{"$f":"[3]!rho_(11,D15,D16)","v":17.087672541642732},null,{"$f":"[3]!rho_(11,F15,F16)","v":13.60304093359863},{"$f":"[3]!rho_(11,G15,G16)","v":14.178141597167654},{"$f":"[3]!rho_(11,H15,H16)","v":6.8737083497099274},{"$f":"[3]!rho_(11,I15,I16)","v":11.708162912666104}]
[null,"Sound Speed @inlet",null,{"$f":"[3]!Sound_speed(11,D15,D16)","v":391.2334216977045},null,{"$f":"[3]!Sound_speed(11,F15,F16)","v":435.3518858856504},{"$f":"[3]!Sound_speed(11,G15,G16)","v":391.28919888209964},{"$f":"[3]!Sound_speed(11,H15,H16)","v":445.49229392998768},{"$f":"[3]!Sound_speed(11,I15,I16)","v":370.51577371924787}]
[null,"S=Q/(rho*V) = cte",null,{"$f":"D14/(D28*D29)","v":2.8645071953707371E-2},null,1.1371861972371593E-2,1.2538035694620982E-2,2.4870902148344934E-2,1.4248211455909057E-2]
[null,"Hin",null,{"$f":"[3]!h_(11,D15,D16)","v":223.57106614117126},null,{"$f":"[3]!h_(11,F15,F16)","v":279.05861768841004},{"$f":"[3]!h_(11,G15,G16)","v":227.21274224322462},{"$f":"[3]!h_(11,H15,H16)","v":302.11378504089129},{"$f":"[3]!h_(11,I15,I16)","v":207.89085729231627}]
[null,"Hout",null,{"$f":"[3]!h_(11,D17,D18)","v":175.9342848561293},null,{"$f":"[3]!h_(11,F17,F18)","v":232.57164353940124},{"$f":"[3]!h_(11,G17,G18)","v":183.59810061835628},{"$f":"[3]!h_(11,H17,H18)","v":255.90473512573868},{"$f":"[3]!h_(11,I17,I18)","v":167.10263015037086}]
[null,"Sin = Sout",null,{"$f":"[3]!S_(11,D15,D16)","v":15.488244062210457},null,{"$f":"[3]!S_(11,F15,F16)","v":16.720664436151374},{"$f":"[3]!S_(11,G15,G16)","v":15.956591869557485},{"$f":"[3]!S_(11,H15,H16)","v":18.465694482536527},{"$f":"[3]!S_(11,I15,I16)","v":16.084358655112414}]
[null,"Tout(iso)",null,{"$f":"[1]!HeCalc(2,0,1,D17*10^5,8,D33*1000,1)","v":28.580768861485691},null,{"$f":"[1]!HeCalc(2,0,1,F17*10^5,8,F33*1000,1)","v":36.153868894880652},{"$f":"[1]!HeCalc(2,0,1,G17*10^5,8,G33*1000,1)","v":28.875086473743544},{"$f":"[1]!HeCalc(2,0,1,H17*10^5,8,H33*1000,1)","v":26.999291724623038},{"$f":"[1]!HeCalc(2,0,1,I17*10^5,8,I33*1000,1)","v":26.699737772795068}]
[null,"Hout(iso)",null,{"$f":"[3]!h_(11,D17,D34)","v":162.49826962188638},null,{"$f":"[3]!h_(11,F17,F34)","v":202.80310664162681},{"$f":"[3]!h_(11,G17,G34)","v":164.26361740133086},{"$f":"[3]!h_(11,H17,H34)","v":155.15151129466645},{"$f":"[3]!h_(11,I17,I34)","v":152.92333233105427}]
[null,"ΔHs",null,{"$f":"D31-D35","v":61.072796519284879},null,76.255511046783226,62.949124841893763,146.96227374622484,54.967524961262001]
[null,"u1","m/s",{"$f":"(2*52.7%*D36*1000*D19)^0.5","v":224.07402231056255},null,{"$f":"PI()*$D$38*F21","v":156.31092987516874},{"$f":"PI()*$D$38*G21","v":168.28970912921642},{"$f":"PI()*$D$38*H21","v":112.3178056694549},{"$f":"PI()*$D$38*I21","v":177.31811672520718}]
[null,"D1",null,{"$f":"D37/PI()/D21","v":3.5751867939057311E-2},null,null,null,null,null,null,null,null,"T1"]
[null,"Co = (2*ΔHs)^0,5",null,{"$f":"(2000*D36)^0.5","v":349.49333761685608},null,390.52659588505168,354.82143351802682,542.14808631263259,331.56454865157707,null,null,"MAX",{"$f":"ROUND(F14,0)&\"g/s @ \"&F15&\" b ; \"&F16&\"K\"","v":"67g/s @ 14,77 b ; 50,44K"}]
[null,"u1/Co",null,{"$f":"D37/D39","v":0.64113961038138956},null,0.40025681098855964,0.4742940905813865,0.20717181984976377,0.53479214664635644,null,null,"MIN",{"$f":"ROUND(G14,0)&\"g/s @ \"&G15&\" b ; \"&G16&\"K\"","v":"70g/s @ 12,39 b ; 40,73K"}]
[null,"U1/C0 off de / U1/C0 nom",null,{"$f":"D40/$D$40","v":1},null,{"$f":"F40/$D40","v":0.62428963131830539},{"$f":"G40/$D40","v":0.73976725646267116},{"$f":"H40/$D40","v":0.32313058886897528},{"$f":"I40/$D40","v":0.83412744741855671},null,null,"STS",{"$f":"ROUND(H14,0)&\"g/s @ \"&H15&\" b ; \"&H16&\"K\"","v":"76g/s @ 8 b ; 55K"}]
[null,"Rdt",null,{"$f":"(0.321*D41^4-1.6098*D41^3+1.316*D41^2+0.9448*D41)*($D19/0.97215493)","v":0.77987569327041328},null,{"$f":"(0.321*F41^4-1.6098*F41^3+1.316*F41^2+0.9448*F41)*($D19/0.97215493)","v":0.60962117374688851},{"$f":"(0.321*G41^4-1.6098*G41^3+1.316*G41^2+0.9448*G41)*($D19/0.97215493)","v":0.69285540878309548},{"$f":"(0.321*H41^4-1.6098*H41^3+1.316*H41^2+0.9448*H41)*($D19/0.97)","v":0.31512649955576411},{"$f":"(0.321*I41^4-1.6098*I41^3+1.316*I41^2+0.9448*I41)*($D19/0.97215493)","v":0.74204227260897582},null,null,"BAKING",{"$f":"ROUND(I14,0)&\"g/s @ \"&I15&\" b ; \"&I16&\"K\"","v":"62g/s @ 9,25 b ; 37,12K"}]
[]
[]
[null,"TURBINE 2"]
[]
[null,null,null,"DESIGN",null,{"$f":"F12","v":"D3"},{"$f":"G12","v":"STS"},{"$f":"H12","v":"test"},{"$f":"I12","v":"BAKING"}]
[]
[null,"m","g/s",191.20000000000002,null,{"$f":"F62/(F52*F51)^0.5*F50","v":149.23747011578729},{"$f":"G62/(G52*G51)^0.5*G50","v":141.71734668092299},{"$f":"H62/(H52*H51)^0.5*H50","v":27.965429571357426},{"$f":"I62/(I52*I51)^0.5*I50","v":109.09228329173929}]
[null,"Pin","Bara",6.3070000000000004,null,6.4169999999999998,5.242,1.35,4.0599999999999996]
[null,"Tin","K",18.21,null,22.92,17.75,30,17.170000000000002]
[null,"Pout","Bara",1.35,null,1.35,1.29,1.3,1.35]
[null,"Tout","K",{"$f":"[3]!T2_turb(11,D50,D51,D52,D54)","v":11.618357475588732},null,{"$f":"[3]!T2_turb(11,F50,F51,F52,F54)","v":14.934394415965505},{"$f":"[3]!T2_turb(11,G50,G51,G52,G54)","v":11.85507099059971},{"$f":"[3]!T2_turb(11,H50,H51,H52,H54)","v":29.775889818722707},{"$f":"[3]!T2_turb(11,I50,I51,I52,I54)","v":12.550937597957923}]
[null,"Efficacity","%",0.76,null,{"$f":"(0.321*F76^4-1.6098*F76^3+1.316*F76^2+0.9448*F76)*($D$54/0.97215493)","v":0.73617440710513871},{"$f":"(0.321*G76^4-1.6098*G76^3+1.316*G76^2+0.9448*G76)*($D$54/0.97215493)","v":0.74840735754157472},{"$f":"(0.321*H76^4-1.6098*H76^3+1.316*H76^2+0.9448*H76)*($D$54/0.97215493)","v":0.49670786028564828},{"$f":"(0.321*I76^4-1.6098*I76^3+1.316*I76^2+0.9448*I76)*($D$54/0.97215493)","v":0.73148870755398121}]
[null,"Power","W",{"$f":"+D49*(D66-D67)","v":6144.650345780522},null,6016.5440035091169,4088.7985292422336,32.522723439499444,2480.8845946575275]
[null,"Speed","Hz",1496,null,1480.2636567352852,1303.3718922863225,1320.034490255443,1098.0517093965677]
[null,null,null,null,null,{"$f":"(F55/$D55*$D59/F59)^(1/3)*$D56","v":1485.530482166668},{"$f":"(G55/$D55*$D59/G59)^(1/3)*$D56","v":1309.3455222269272},{"$f":"(H55/$D55*$D59/H59)^(1/3)*$D56","v":261.25771454590381},{"$f":"(I55/$D55*$D59/I59)^(1/3)*$D56","v":1105.6934137834776}]
[null,null,null,null,null,{"$f":"F56-F57","v":-5.2668254313828129},{"$f":"G56-G57","v":-5.9736299406047237},{"$f":"H56-H57","v":1058.7767757095392},{"$f":"I56-I57","v":-7.6417043869098507}]
[null,"Brake Pressure",null,8,null,{"$f":"($D59-$D52)+F52","v":8},{"$f":"($D59-$D52)+G52","v":7.94},{"$f":"($D59-$D52)+H52","v":7.95},{"$f":"($D59-$D52)+I52","v":8}]
[null,"Rho (brake)",null,{"$f":"[3]!rho_(11,D59,330)","v":1.1632432504804469},null,{"$f":"[3]!rho_(11,F59,330)","v":1.1632432504804469},{"$f":"[3]!rho_(11,G59,330)","v":1.1545472550104166},{"$f":"[3]!rho_(11,H59,330)","v":1.1559966172478962},{"$f":"[3]!rho_(11,I59,330)","v":1.1632432504804469}]
[null,"Wheel","mm",39.5,null,{"$f":"$D$26","v":35.799999999999997},{"$f":"$D$26","v":35.799999999999997},{"$f":"$D$26","v":35.799999999999997},{"$f":"$D$26","v":35.799999999999997}]
[null,"a = mÖT/P",null,{"$f":"D49*D51^0.5/D50","v":129.36596422035444},null,{"$f":"$D$62","v":129.36596422035444},{"$f":"$D$62","v":129.36596422035444},129.36596422035444,129.36596422035444]
[null,"Rho (in)","kg/m3",{"$f":"[3]!rho_(11,D50,D51)","v":16.817250243896773},null,{"$f":"[3]!rho_(11,F50,F51)","v":13.375291153857948},{"$f":"[3]!rho_(11,G50,G51)","v":14.359191477750651},{"$f":"[3]!rho_(11,H50,H51)","v":2.159549883675286},{"$f":"[3]!rho_(11,I50,I51)","v":11.505933047185708}]
[null,"Sound Speed",null,{"$f":"[3]!Sound_speed(11,D50,D51)","v":258.39146376447951},null,{"$f":"[3]!Sound_speed(11,F50,F51)","v":290.04823018762818},{"$f":"[3]!Sound_speed(11,G50,G51)","v":253.64425936604641},{"$f":"[3]!Sound_speed(11,H50,H51)","v":324.04409152255937},{"$f":"[3]!Sound_speed(11,I50,I51)","v":247.92823053689861}]
[null,"S=Q/(rho*V) = cte",null,{"$f":"D49/(D63*D64)","v":4.4000208975996838E-2},null,3.8468425741379667E-2,3.8910605430234162E-2,3.9962637851455929E-2,3.8242494085549791E-2]
[null,"Hin",null,{"$f":"[3]!h_(11,D50,D51)","v":105.90220745591094},null,{"$f":"[3]!h_(11,F50,F51)","v":131.89535213089164},{"$f":"[3]!h_(11,G50,G51)","v":103.97945828770561},{"$f":"[3]!h_(11,H50,H51)","v":170.84491042210561},{"$f":"[3]!h_(11,I50,I51)","v":101.54892418840952}]
[null,"Hout",null,{"$f":"[3]!h_(11,D52,D53)","v":73.764914852456329},null,{"$f":"[3]!h_(11,F52,F53)","v":91.580114953250359},{"$f":"[3]!h_(11,G52,G53)","v":75.12767249716174},{"$f":"[3]!h_(11,H52,H53)","v":169.68194872482457},{"$f":"[3]!h_(11,I52,I53)","v":78.807768537436118}]
[null,"Sin = Sout",null,{"$f":"[3]!S_(11,D50,D51)","v":13.041567593259808},null,{"$f":"[3]!S_(11,F50,F51)","v":14.275813975533033},{"$f":"[3]!S_(11,G50,G51)","v":13.315255392328808},{"$f":"[3]!S_(11,H50,H51)","v":19.01686410394105},{"$f":"[3]!S_(11,I50,I51)","v":13.701310752755484}]
[null,"Tout(iso)",null,{"$f":"[1]!HeCalc(2,0,1,D52*10^5,8,D68*1000,1)","v":9.7639107105745424},null,{"$f":"[1]!HeCalc(2,0,1,F52*10^5,8,F68*1000,1)","v":12.240423559213966},{"$f":"[1]!HeCalc(2,0,1,G52*10^5,8,G68*1000,1)","v":10.073861840183332},{"$f":"[1]!HeCalc(2,0,1,H52*10^5,8,H68*1000,1)","v":29.550386617947556},{"$f":"[1]!HeCalc(2,0,1,I52*10^5,8,I68*1000,1)","v":11.010714114185083}]
[null,"Hout(iso)",null,{"$f":"[3]!h_(11,D52,D69)","v":63.616296135548602},null,{"$f":"[3]!h_(11,F52,F69)","v":77.132191677960307},{"$f":"[3]!h_(11,G52,G69)","v":65.428546809061586},{"$f":"[3]!h_(11,H52,H69)","v":168.50357099451483},{"$f":"[3]!h_(11,I52,I69)","v":70.460056491444234}]
[null,"ΔHs",null,{"$f":"D66-D70","v":42.285911320362338},null,54.763160452931331,38.550911478644025,2.341339427590782,31.088867696965281]
[null,"u1","m/s",{"$f":"(2*52.7%*D71*1000*D54)^0.5","v":184.04539223806461},null,{"$f":"PI()*$D$73*F56","v":182.10942868957045},{"$f":"PI()*$D$73*G56","v":160.34732028603256},162.39723631473041,135.08780585131595]
[null,"D1",null,{"$f":"D72/PI()/D56","v":3.9160072096222902E-2},null,null,null,null,null,null,null,null,"T2"]
[null,"Co = (2*ΔHs)^0,5",null,{"$f":"(2000*D71)^0.5","v":290.81234953269205},null,330.94761051541474,277.67215012904705,68.430101966762876,249.35463780313083,null,null,"MAX",{"$f":"ROUND(F49,0)&\"g/s @ \"&F50&\" b ; \"&F51&\"K\"","v":"149g/s @ 6,417 b ; 22,92K"}]
[null,"u1/Co",null,{"$f":"D72/D74","v":0.6328664946100403},null,0.55026663708480905,0.57746994148139008,2.3731841930267503,0.54174972256970721,null,null,"MIN",{"$f":"ROUND(G49,0)&\"g/s @ \"&G50&\" b ; \"&G51&\"K\"","v":"142g/s @ 5,242 b ; 17,75K"}]
[null,"U1/C0 off de / U1/C0 nom",null,{"$f":"D75/$D$40","v":0.98709623358564935},null,{"$f":"F75/$D75","v":0.86948296642544232},{"$f":"G75/$D75","v":0.9124672366123846},{"$f":"H75/$D75","v":3.7498970371137426},{"$f":"I75/$D75","v":0.85602528682375989},null,null,"STS",{"$f":"ROUND(H49,0)&\"g/s @ \"&H50&\" b ; \"&H51&\"K\"","v":"28g/s @ 1,35 b ; 30K"}]
[null,"Rdt",null,{"$f":"(0.321*D76^4-1.6098*D76^3+1.316*D76^2+0.9448*D76)*($D54/0.97215493)","v":0.75935604730996153},null,{"$f":"(0.321*F76^4-1.6098*F76^3+1.316*F76^2+0.9448*F76)*($D54/0.97215493)","v":0.73617440710513871},{"$f":"(0.321*G76^4-1.6098*G76^3+1.316*G76^2+0.9448*G76)*($D54/0.97215493)","v":0.74840735754157472},{"$f":"(0.321*H76^4-1.6098*H76^3+1.316*H76^2+0.9448*H76)*($D54/0.97215493)","v":0.49670786028564828},{"$f":"(0.321*I76^4-1.6098*I76^3+1.316*I76^2+0.9448*I76)*($D54/0.97215493)","v":0.73148870755398121},null,null,"BAKING",{"$f":"ROUND(I49,0)&\"g/s @ \"&I50&\" b ; \"&I51&\"K\"","v":"109g/s @ 4,06 b ; 17,17K"}]
[]
[null,"TURBINE 3"]
[]
[null,null,null,"DESIGN",null,{"$f":"F47","v":"D3"},{"$f":"G47","v":"STS"},{"$f":"H47","v":"test"},{"$f":"I47","v":"BAKING"}]
[]
[null,"m","g/s",399.8,null,{"$f":"F96/(F86*F85)^0.5*F84","v":161.47618188513178},{"$f":"G96/(G86*G85)^0.5*G84","v":95.080415199611181},{"$error":"#DIV/0!"},117.10102732642108]
[null,"Pin","Bara",13.07,null,13.07,7.3689999999999998,null,10.48]
[null,"Tin","K",7.2919999999999998,null,9.16,7.9119999999999999,null,10.55]
[null,"Pout","Bara",4.88,null,4.88,5.18,null,5.18]
[null,"Tout","K",{"$f":"[3]!T2_turb(11,D84,D85,D86,D88)","v":6.1198408797506243},null,{"$f":"[3]!T2_turb(11,F84,F85,F86,F88)","v":7.0494463059442776},{"$f":"[3]!T2_turb(11,G84,G85,G86,G88)","v":7.1447253899950391},{"$f":"[3]!T2_turb(11,H84,H85,H86,H88)","v":{"$error":"#VALUE!"}},{"$f":"[3]!T2_turb(11,I84,I85,I86,I88)","v":8.6903815136344829}]
[null,"Efficacity","%",0.72,null,{"$f":"(0.321*F110^4-1.6098*F110^3+1.316*F110^2+0.9448*F110)*($D$88/0.97215493)","v":0.58179731360313081},{"$f":"(0.321*G110^4-1.6098*G110^3+1.316*G110^2+0.9448*G110)*($D$88/0.97215493)","v":0.582724483494652},{"$f":"(0.321*H110^4-1.6098*H110^3+1.316*H110^2+0.9448*H110)*($D$88/0.97215493)","v":{"$error":"#VALUE!"}},{"$f":"(0.321*I110^4-1.6098*I110^3+1.316*I110^2+0.9448*I110)*($D$88/0.97215493)","v":0.50201641458397539}]
[null,"Power","W",{"$f":"+D83*(D100-D101)","v":2075.5404202052005},null,954.74184184263254,182.5140950412455,{"$error":"#DIV/0!"},610.67834348723773]
[null,"Speed","Hz",2076,null,1602.552519659416,914.20818650847264,862.66257848011605,1367.3629344539765]
[null,null,null,null,null,{"$f":"(F89/$D89*$D93/F93)^(1/3)*$D90","v":1602.5525123839127},{"$f":"(G89/$D89*$D93/G93)^(1/3)*$D90","v":914.20817108894096},{"$f":"(H89/$D89*$D93/H93)^(1/3)*$D90","v":{"$error":"#DIV/0!"}},{"$f":"(I89/$D89*$D93/I93)^(1/3)*$D90","v":1367.3629301538849}]
[null,null,null,null,null,{"$f":"F90-F91","v":7.2755033215798903E-6},{"$f":"G90-G91","v":1.5419531678162457E-5},{"$f":"H90-H91","v":{"$error":"#DIV/0!"}},{"$f":"I90-I91","v":4.300091632103431E-6}]
[null,"Brake Pressure",null,10.1,null,{"$f":"($D93-$D86)+F86","v":10.1},{"$f":"($D93-$D86)+G86","v":10.399999999999999},{"$f":"($D93-$D86)+H86","v":5.22},{"$f":"($D93-$D86)+I86","v":10.399999999999999}]
[null,"Rho (brake)",null,{"$f":"[3]!rho_(11,D93,330)","v":1.4673342046153373},null,{"$f":"[3]!rho_(11,F93,330)","v":1.4673342046153373},{"$f":"[3]!rho_(11,G93,330)","v":1.5107331217743123},{"$f":"[3]!rho_(11,H93,330)","v":0.75987987169063398},{"$f":"[3]!rho_(11,I93,330)","v":1.5107331217743123}]
[null,"Wheel","mm",29.5,null,{"$f":"$D$95","v":29.5},{"$f":"$D$95","v":29.5},{"$f":"$D$95","v":29.5},{"$f":"$D$95","v":29.5}]
[null,"a = mÖT/P",null,{"$f":"D83*D85^0.5/D84","v":82.601994178997316},null,{"$f":"$D$96","v":82.601994178997316},{"$f":"$D$96","v":82.601994178997316},82.601994178997316,82.601994178997316]
[null,"Rho (in)","kg/m3",{"$f":"[3]!rho_(11,D84,D85)","v":122.0413850208848},null,{"$f":"[3]!rho_(11,F84,F85)","v":92.042022544510019},{"$f":"[3]!rho_(11,G84,G85)","v":70.649649504414128},{"$f":"[3]!rho_(11,H84,H85)","v":"NUM"},{"$f":"[3]!rho_(11,I84,I85)","v":58.789985568547117}]
[null,"Sound Speed",null,{"$f":"[3]!Sound_speed(11,D84,D85)","v":249.05671288435045},null,{"$f":"[3]!Sound_speed(11,F84,F85)","v":219.03534618547846},{"$f":"[3]!Sound_speed(11,G84,G85)","v":170.78644408370695},{"$f":"[3]!Sound_speed(11,H84,H85)","v":"NUM"},{"$f":"[3]!Sound_speed(11,I84,I85)","v":204.26692373410398}]
[null,"S=Q/(rho*V) = cte",null,{"$f":"D83/(D97*D98)","v":1.3153381307708404E-2},null,8.0095499679843866E-3,7.8800262035761022E-3,{"$error":"#DIV/0!"},9.7512278209034905E-3]
[null,"Hin",null,{"$f":"[3]!h_(11,D84,D85)","v":28.150884578454882},null,{"$f":"[3]!h_(11,F84,F85)","v":40.890140453818937},{"$f":"[3]!h_(11,G84,G85)","v":36.811643961665368},{"$f":"[3]!h_(11,H84,H85)","v":{"$error":"#VALUE!"}},{"$f":"[3]!h_(11,I84,I85)","v":54.059832308617963}]
[null,"Hout",null,{"$f":"[3]!h_(11,D86,D87)","v":22.959437804554931},null,{"$f":"[3]!h_(11,F86,F87)","v":34.977554271159498},{"$f":"[3]!h_(11,G86,G87)","v":34.892067835939827},{"$f":"[3]!h_(11,H86,H87)","v":{"$error":"#VALUE!"}},{"$f":"[3]!h_(11,I86,I87)","v":48.844862317065612}]
[null,"Sin = Sout",null,{"$f":"[3]!S_(11,D84,D85)","v":5.0600046690749361},null,{"$f":"[3]!S_(11,F84,F85)","v":6.606972813997622},{"$f":"[3]!S_(11,G84,G85)","v":6.9458302073485418},{"$f":"[3]!S_(11,H84,H85)","v":{"$error":"#VALUE!"}},{"$f":"[3]!S_(11,I84,I85)","v":8.3000204511344844}]
[null,"Tout(iso)",null,{"$f":"[1]!HeCalc(2,0,1,D86*10^5,8,D102*1000,1)","v":5.9351387842537191},null,{"$f":"[1]!HeCalc(2,0,1,F86*10^5,8,F102*1000,1)","v":6.6999950291002683},{"$f":"[1]!HeCalc(2,0,1,G86*10^5,8,G102*1000,1)","v":7.0241819850115181},{"$f":"[1]!HeCalc(2,0,1,H86*10^5,8,H102*1000,1)","v":{"$error":"#VALUE!"}},{"$f":"[1]!HeCalc(2,0,1,I86*10^5,8,I102*1000,1)","v":8.0488946725573083}]
[null,"Hout(iso)",null,{"$f":"[3]!h_(11,D86,D103)","v":20.940541836947467},null,{"$f":"[3]!h_(11,F86,F103)","v":30.727518437529557},{"$f":"[3]!h_(11,G86,G103)","v":33.517503797489027},{"$f":"[3]!h_(11,H86,H103)","v":{"$error":"#VALUE!"}},{"$f":"[3]!h_(11,I86,I103)","v":43.671785543492518}]
[null,"ΔHs",null,{"$f":"D100-D104","v":7.2103427415074144},null,10.162622016289379,3.2941401641763406,{"$error":"#VALUE!"},10.388046765125445]
[null,"u1","m/s",{"$f":"(2*52.7%*D105*1000*D88)^0.5","v":73.971514109656738},null,{"$f":"PI()*$D$107*F90","v":57.101751598965535},{"$f":"PI()*$D$107*G90","v":32.574838038282842},30.738177791866459,48.72153497060885]
[null,"D1",null,{"$f":"D106/PI()/D90","v":1.1341938457171245E-2},null,null,null,null,null,null,null,null,"T3"]
[null,"Co = (2*ΔHs)^0,5",null,{"$f":"(2000*D105)^0.5","v":120.0861585821398},null,142.56663015088333,81.16822240478524,{"$error":"#VALUE!"},144.13914641848999,null,null,"MAX",{"$f":"ROUND(F83,0)&\"g/s @ \"&F84&\" b ; \"&F85&\"K\"","v":"161g/s @ 13,07 b ; 9,16K"}]
[null,"u1/Co",null,{"$f":"D106/D108","v":0.61598701285010871},null,0.40052676799986592,0.40132501455843644,{"$error":"#VALUE!"},0.33801736850273811,null,null,"MIN",{"$f":"ROUND(G83,0)&\"g/s @ \"&G84&\" b ; \"&G85&\"K\"","v":"95g/s @ 7,369 b ; 7,912K"}]
[null,"U1/C0 off de / U1/C0 nom",null,{"$f":"D109/$D$40","v":0.96076892283052273},null,{"$f":"F109/$D109","v":0.65021950080841751},{"$f":"G109/$D109","v":0.65151538293242062},{"$f":"H109/$D109","v":{"$error":"#VALUE!"}},{"$f":"I109/$D109","v":0.54874106344996854},null,null,"STS",{"$f":"ROUND(H83,0)&\"g/s @ \"&H84&\" b ; \"&H85&\"K\"","v":{"$error":"#DIV/0!"}}]
[null,"Rdt",null,{"$f":"(0.321*D110^4-1.6098*D110^3+1.316*D110^2+0.9448*D110)*($D88/0.97215493)","v":0.7171786087866604},null,{"$f":"(0.321*F110^4-1.6098*F110^3+1.316*F110^2+0.9448*F110)*($D88/0.97215493)","v":0.58179731360313081},{"$f":"(0.321*G110^4-1.6098*G110^3+1.316*G110^2+0.9448*G110)*($D88/0.97215493)","v":0.582724483494652},{"$f":"(0.321*H110^4-1.6098*H110^3+1.316*H110^2+0.9448*H110)*($D88/0.97215493)","v":{"$error":"#VALUE!"}},{"$f":"(0.321*I110^4-1.6098*I110^3+1.316*I110^2+0.9448*I110)*($D88/0.97215493)","v":0.50201641458397539},null,null,"BAKING",{"$f":"ROUND(I83,0)&\"g/s @ \"&I84&\" b ; \"&I85&\"K\"","v":"117g/s @ 10,48 b ; 10,55K"}]
[]
[null,null,null,null,null,null,null,null,null,null,null,null,{"$f":"M38","v":"T1"},{"$f":"M107","v":"T3"},"T1+T2"]
[null,"Courbe de rendement TC3",null,null,null,null,null,null,null,null,null,{"$f":"L108","v":"MAX"},{"$f":"M39","v":"67g/s @ 14,77 b ; 50,44K"},{"$f":"M108","v":"161g/s @ 13,07 b ; 9,16K"},{"$f":"F83+F49","v":310.71365200091907}]
[null,null,null,null,null,null,null,null,null,null,null,{"$f":"L109","v":"MIN"},{"$f":"M40","v":"70g/s @ 12,39 b ; 40,73K"},{"$f":"M109","v":"95g/s @ 7,369 b ; 7,912K"},{"$f":"G83+G49","v":236.79776188053415}]
[null,null,null,null,null,null,null,null,null,null,null,{"$f":"L110","v":"STS"},{"$f":"M41","v":"76g/s @ 8 b ; 55K"},{"$f":"M110","v":{"$error":"#DIV/0!"}},{"$f":"H83+H49","v":{"$error":"#DIV/0!"}}]
[null,null,null,null,null,null,null,null,null,null,null,{"$f":"L111","v":"BAKING"},{"$f":"M42","v":"62g/s @ 9,25 b ; 37,12K"},{"$f":"M111","v":"117g/s @ 10,48 b ; 10,55K"},{"$f":"I83+I49","v":226.19331061816035}]
[null,null,null,null,"d : mm"]
[null,null,null,null,"N : Hz"]
[null,null,null,null,"H : J/kG"]
[]
[]
[]
[]
[]
[null,"rendement=(0,321*rap^4 - 1,6098*rap^3 + 1,316*rap^2 + 0,9448*rap)*(ETAgar/0,97)",null,null,null,null,null,null,"U1/CO _nom",0.64]
[null,null,null,null,null,null,null,null,"Eta_gar",0.8]
[null,"U1/C0",{"$f":"D19","v":0.78},{"$f":"D54","v":0.76},{"$f":"D88","v":0.72}]
[null,0,{"$f":"(0.321*B129^4-1.6098*B129^3+1.316*B129^2+0.9448*B129)*$D$19/0.97215493","v":0}]
[null,{"$f":"B129+0.05","v":0.05},{"$f":"(0.321*$B130^4-1.6098*$B130^3+1.316*$B130^2+0.9448*$B130)*$C$128/0.97215493","v":4.0382461852042459E-2},{"$f":"(0.321*$B130^4-1.6098*$B130^3+1.316*$B130^2+0.9448*$B130)*$D$128/0.97215493","v":3.9347014112246496E-2},{"$f":"(0.321*$B130^4-1.6098*$B130^3+1.316*$B130^2+0.9448*$B130)*$E$128/0.97215493","v":3.7276118632654578E-2}]
[null,0.1,{"$f":"(0.321*$B131^4-1.6098*$B131^3+1.316*$B131^2+0.9448*$B131)*$C$128/0.97215493","v":8.5098158171146673E-2},{"$f":"(0.321*$B131^4-1.6098*$B131^3+1.316*$B131^2+0.9448*$B131)*$D$128/0.97215493","v":8.2916154115476232E-2},{"$f":"(0.321*$B131^4-1.6098*$B131^3+1.316*$B131^2+0.9448*$B131)*$E$128/0.97215493","v":7.8552146004135376E-2}]
[null,0.15000000000000002,0.13323633134792623,0.12982001515951785,0.12298738278270113]
[null,0.2,0.18392485650409657,0.17920883454245307,0.16977679061916603]
[null,0.25,0.23633024149247489,0.23027049171061653,0.21815099214689987]
[null,0.3,0.28965762689698032,0.28223050825859619,0.26737627098182798]
[null,0.35,0.34315078603263366,0.33435204792923284,0.3167545717224311]
[null,0.39999999999999997,0.39609212494555779,0.38593591661362037,0.36562349994974563]
[null,0.44999999999999996,0.4478026824129771,0.43632056235110589,0.41335632222736346]
[null,0.49999999999999994,0.49764212994321799,0.48488207532928934,0.45936196610143198]
[null,0.54999999999999993,0.54500877177570861,0.53103418788402379,0.50308502010065403]
[null,0.6,0.58933954488097895,0.57422827449941549,0.54400573373628835]
[null,0.65,0.63011001896066099,0.61395335180782351,0.58164001750214867]
[null,0.70000000000000007,0.66683439644748832,0.64973607858986027,0.61553944287460449]
[null,0.75000000000000011,0.69906551250529614,0.68114075577439104,0.64529124231258095]
[null,0.80000000000000016,0.7263948350290218,0.70776932643853407,0.67051830925755851]
[null,0.8500000000000002,0.74845246464470438,0.72926137580766071,0.69087919813357312]
[null,0.90000000000000024,0.76490713470948513,0.74529413125539579,0.70606812434721711]
[null,0.95000000000000029,0.77546621131160665,0.7555824623036167,0.71581496428763691]
[null,1.0000000000000002,0.77987569327041351,0.75987888062245412,0.71988525532653547]
[null,1.0500000000000003,0.77792021213635165,0.75797354003029138,0.71808019581817073]
[null,1.1000000000000003,0.76942303219096997,0.74969423649376565,0.7102366450993568]
[null,1.1500000000000004,0.75424605044691839,0.73490640812776653,0.69622712348946292]
[null,1.2000000000000004,0.7322897966479478,0.71351313519543635,0.67595981229041324,null,"F Let u be the peripheral speed of the wheel : u = p . Æ . N / 60                      (in m/s)"]
[null,1.2500000000000004,0.70349343326891334,0.68545514010817188,0.64937855378668918,null,"F Let n, be the speed ratio of the turbine : n =  u / [ 2 . (H1 - H2S ) ] 0.5       (dimensionless number)"]
[null,1.3000000000000005,0.66783475551576954,0.65071078742562172,0.61646285124532574,null,null,"N = speed of rotation of the turbine (in rpm)"]
[null,1.3500000000000005,0.62533019132557388,0.60929608385568745,0.57722786891591438,null,null,"Æ = diameter of the wheel of the turbine (in m)"]
[null,1.4000000000000006,0.57603480136648577,0.56126467825452464,0.53172443203060227]
[null,1.4500000000000006,0.5200422790377659,0.50670786162654113,0.48003902680409161]
[null,1.5000000000000007,0.45748495046977738,0.44575456712439848,0.42229380043364062]

{"sheet":"Fluides","index":8,"n_rows":53,"n_cols":8,"rows_kept":53,"cut":false,"hidden":false,"merged":[]}
[null,null,"Liste des fluides disponibles"]
[1,1,"Ammoniac","C:\\Program files\\GaspakDemo5\\NH379.gas",null,null,null,1]
[2,2,"Argon","C:\\Program files\\GaspakDemo5\\ARGON83.gas",null,null,null,2]
[3,21,"Azote","C:\\Program files\\GaspakDemo5\\N273.gas",null,null,null,21]
[4,22,"Azote","C:\\Program files\\GaspakDemo5\\N286.gas",null,null,null,22]
[5,4,"Butane Normal","C:\\Program files\\GaspakDemo5\\NORB86.gas",null,null,null,4]
[6,7,"Deutérium","C:\\Program files\\GaspakDemo5\\D286.gas",null,null,null,7]
[7,5,"Dioxide de carbone","C:\\Program files\\GaspakDemo5\\CO289.gas",null,null,null,5]
[8,27,"Eau","C:\\Program files\\GaspakDemo5\\H2O89.gas",null,null,null,27]
[9,8,"Ethane","C:\\Program files\\GaspakDemo5\\C2H686.gas",null,null,null,8]
[10,9,"Ethylène","C:\\Program files\\GaspakDemo5\\C2H481.gas",null,null,null,9]
[11,10,"Ethylène","C:\\Program files\\GaspakDemo5\\C2H486.gas",null,null,null,10]
[12,11,"Helium","C:\\Program files\\GaspakDemo5\\HE89.gas",null,null,null,11]
[13,16,"Hydrogen Sulfide","C:\\Program files\\GaspakDemo5\\H2S93.gas",null,null,null,16]
[14,3,"Isobutane","C:\\Program files\\GaspakDemo5\\ISOB86.gas",null,null,null,3]
[15,17,"Krypton","C:\\Program files\\GaspakDemo5\\KR90.gas",null,null,null,17]
[16,18,"Méthane","C:\\Program files\\GaspakDemo5\\METH86.gas",null,null,null,18]
[17,19,"Méthane","C:\\Program files\\GaspakDemo5\\CH489.gas",null,null,null,19]
[18,6,"Monoxide de carbone","C:\\Program files\\GaspakDemo5\\CO85.gas",null,null,null,6]
[19,20,"Néon","C:\\Program files\\GaspakDemo5\\NE91.gas",null,null,null,20]
[20,23,"Nitrogene Trifluoride","C:\\Program files\\GaspakDemo5\\NF380.gas",null,null,null,23]
[21,13,"Normal Hydrogene","C:\\Program files\\GaspakDemo5\\NH291.gas",null,null,null,13]
[22,24,"Oxygène","C:\\Program files\\GaspakDemo5\\O278.gas",null,null,null,24]
[23,25,"Oxygène","C:\\Program files\\GaspakDemo5\\O285.gas",null,null,null,25]
[24,15,"Hydrogène Para","C:\\Program files\\GaspakDemo5\\PH275.gas",null,null,null,15]
[25,26,"Propane","C:\\Program files\\GaspakDemo5\\C3H886.gas",null,null,null,26]
[26,29,"R11","C:\\Program files\\GaspakDemo5\\R1191.gas",null,null,null,29]
[27,30,"R12","C:\\Program files\\GaspakDemo5\\R1291.gas",null,null,null,30]
[28,33,"R123","C:\\Program files\\GaspakDemo5\\R123N93.gas",null,null,null,33]
[29,34,"R124","C:\\Program files\\GaspakDemo5\\R124N93.gas",null,null,null,34]
[30,35,"R125","C:\\Program files\\GaspakDemo5\\R125N93.gas",null,null,null,35]
[31,36,"R134","C:\\Program files\\GaspakDemo5\\R134AN92.gas",null,null,null,36]
[32,37,"R134","C:\\Program files\\GaspakDemo5\\R134AT93.gas",null,null,null,37]
[33,38,"R152","C:\\Program files\\GaspakDemo5\\R152AT94.gas",null,null,null,38]
[34,31,"R22","C:\\Program files\\GaspakDemo5\\R2291.gas",null,null,null,31]
[35,32,"R32","C:\\Program files\\GaspakDemo5\\R32N93.gas",null,null,null,32]
[36,50,"R32","C:\\Program files\\GaspakDemo5\\R32N94.gas",null,null,null,50]
[37,28,"Xénon","C:\\Program files\\GaspakDemo5\\\\XE90.gas",null,null,null,28]
[38,"Phosphine",1.45,10.6]
[39,"Protoxyde d'azote",1.8720000000000001,13.6]
[40,"R11 gaz",6.2,10.16]
[41,"R12 gaz",5.75,11.99]
[42,"R22 gaz",4.2300000000000004,11.8]
[43,"Silane",1.36,10.8]
[44,"Sulfure d'hydrogène",1.45,11.79]
[45,"R11 liq",1500,567.5]
[46,"R12 liq",1350,260]
[47,"R22 liq",1250,210]
[48,"R32 liq",1000,193.2]
[49,"R123 liq",1500,569.6]
[50,"R124 liq",1400,346]
[51,"R125 liq",1250,205]
[52,"R152a liq",950,214]

{"sheet":"Turbines_Hefei","index":9,"n_rows":159,"n_cols":15,"rows_kept":159,"cut":false,"hidden":false,"merged":[]}
[]
[]
[]
[]
[]
[]
[]
[null,"Relation entre la puissance et la vitesse de rotation",null,null,null,null,null,null,null,null,null,null,"²"]
[]
[null,"TURBINE 1"]
[]
[null,null,null,null,null,"ESSAI"]
[null,null,null,"LIQUE","REFRIG"]
[null,"m","g/s",26.3,26.6,26]
[null,"Pin","Bara",13.83,12.17,12.11]
[null,"Tin","K",43.18,31.18,41.44]
[null,"Pout","Bara",6.53,5.55,5.28]
[null,"Tout","K",{"$f":"[3]!T2_turb(11,D15,D16,D17,D19)","v":35.022927904324874},{"$f":"[3]!T2_turb(11,E15,E16,E17,E19)","v":25.125351080036832},{"$f":"[3]!T2_turb(11,F15,F16,F17,F19)","v":32.880608687226122}]
[null,"Efficacity","%",0.73,0.71279999999999999,{"$f":"(0.321*F41^4-1.6098*F41^3+1.316*F41^2+0.9448*F41)*($D$19/0.97)","v":0.73135958219850672}]
[null,"Power","W",{"$f":"+D14*(D31-D32)","v":1145.7660192315839},842.55240196071315,1181.7951135975291]
[null,"Speed","Hz",2696,2463,2737.6819165537222]
[null,null,null,null,null,{"$f":"(F20/$D20*$D24/F24)^(1/3)*$D21","v":2737.6821698408871}]
[null,null,null,null,null,{"$f":"F21-F22","v":-2.5328716492367676E-4}]
[null,"Brake Pressure",null,5.35,4.8899999999999997,5.27]
[null,"Rho (brake)",null,{"$f":"[3]!rho_(11,D24,330)","v":0.77876265690570234},{"$f":"[3]!rho_(11,E24,330)","v":0.71193761959398882},{"$f":"[3]!rho_(11,F24,330)","v":0.76714271925513389}]
[null,"Wheel","mm",25.5,{"$f":"$D$26","v":25.5},{"$f":"$D$26","v":25.5}]
[null,"a = mÖT/P",null,{"$f":"D14*D16^0.5/D15","v":12.496111376757693},{"$f":"+$D$27","v":12.496111376757693},{"$f":"+$D$27","v":12.496111376757693}]
[null,"Rho (in)","kg/m3",{"$f":"[3]!rho_(11,D15,D16)","v":14.879796869338547},{"$f":"[3]!rho_(11,E15,E16)","v":18.219752593610284},{"$f":"[3]!rho_(11,F15,F16)","v":13.631897027299175}]
[null,"Sound Speed",null,{"$f":"[3]!Sound_speed(11,D15,D16)","v":403.94826470833328},{"$f":"[3]!Sound_speed(11,E15,E16)","v":345.07753482231766},{"$f":"[3]!Sound_speed(11,F15,F16)","v":394.1049516112281}]
[null,"S=Q/(rho*V) = cte",null,{"$f":"D14/(D28*D29)","v":4.3755535083431132E-3},4.2307997926800418E-3,4.8395519891523591E-3]
[null,"Hin",null,{"$f":"[3]!h_(11,D15,D16)","v":240.37201833506001},{"$f":"[3]!h_(11,E15,E16)","v":175.793789198182},{"$f":"[3]!h_(11,F15,F16)","v":230.98585196367696}]
[null,"Hout",null,{"$f":"[3]!h_(11,D17,D18)","v":196.8067704555321},{"$f":"[3]!h_(11,E17,E18)","v":144.11888686883188},{"$f":"[3]!h_(11,F17,F18)","v":185.53219374838739}]
[null,"Sin = Sout",null,{"$f":"[3]!S_(11,D15,D16)","v":16.034045276350056},{"$f":"[3]!S_(11,E15,E16)","v":14.555816928865609},{"$f":"[3]!S_(11,F15,F16)","v":16.097453351061993}]
[null,"Tout(iso)",null,{"$f":"[1]!HeCalc(2,0,1,D17*10^5,8,D33*1000,1)","v":31.991025425862453},{"$f":"[1]!HeCalc(2,0,1,E17*10^5,8,E33*1000,1)","v":22.764217726468384},{"$f":"[1]!HeCalc(2,0,1,F17*10^5,8,F33*1000,1)","v":29.735058090451112}]
[null,"Hout(iso)",null,{"$f":"[3]!h_(11,D17,D34)","v":180.69359658228194},{"$f":"[3]!h_(11,E17,E34)","v":131.35649636800315},{"$f":"[3]!h_(11,F17,F34)","v":168.83631660289936}]
[null,"ΔHs",null,{"$f":"D31-D35","v":59.678421752778064},44.437292830178848,62.149535360777605]
[null,"u1","m/s",{"$f":"(2*52.7%*D36*1000*D19)^0.5","v":214.28432342339582},{"$f":"PI()*$D$38*E21","v":195.76494383969731},{"$f":"PI()*$D$38*F21","v":217.59729867847921}]
[null,"D1",null,{"$f":"D37/PI()/D21","v":2.530000689906221E-2},null,null,null,null,null,null,null,null,"T1"]
[null,"Co = (2*ΔHs)^0,5",null,{"$f":"(2000*D36)^0.5","v":345.48059787136543},298.11840879146945,352.56073338015852,null,null,null,null,null,"MAX",{"$f":"ROUND(F14,0)&\"g/s @ \"&F15&\" b ; \"&F16&\"K\"","v":"26g/s @ 12,11 b ; 41,44K"}]
[null,"u1/Co",null,{"$f":"D37/D39","v":0.6202499496170879},0.65666841787228492,0.61719096336190338,null,null,null,null,null,"MIN",{"$f":"ROUND(G14,0)&\"g/s @ \"&G15&\" b ; \"&G16&\"K\"","v":"0g/s @  b ; K"}]
[null,"U1/C0 off de / U1/C0 nom",null,{"$f":"D40/$D$40","v":1},{"$f":"E40/$D40","v":1.0587157939757674},{"$f":"F40/$D40","v":0.99506813945398465},null,null,null,null,null,"STS",{"$f":"ROUND(H14,0)&\"g/s @ \"&H15&\" b ; \"&H16&\"K\"","v":"0g/s @  b ; K"}]
[null,"Rdt",null,{"$f":"(0.321*D41^4-1.6098*D41^3+1.316*D41^2+0.9448*D41)*($D19/0.97)","v":0.73150515463917531},0.72872732323122758,0.73135958219850672,null,null,null,null,null,"BAKING",{"$f":"ROUND(I14,0)&\"g/s @ \"&I15&\" b ; \"&I16&\"K\"","v":"0g/s @  b ; K"}]
[]
[]
[null,"TURBINE 2"]
[]
[null,null,null,"DESIGN",null,{"$f":"F12","v":"ESSAI"},{"$f":"G12","v":0},{"$f":"H12","v":0},{"$f":"I12","v":0}]
[]
[null,"m","g/s",248,232.50201830451695,274.39999999999998,264.89999999999998,202,199]
[null,"Pin","Bara",11,10.37,11,10.69,8.9909999999999997,8.4939999999999998]
[null,"Tin","K",20.6,20.83,19.29,19.489999999999998,23.4,21.74]
[null,"Pout","Bara",4.2770000000000001,4.1769999999999996,2.27,4.2270000000000003,3.9769999999999999,4.4770000000000003]
[null,"Tout","K",{"$f":"[3]!T2_turb(11,D50,D51,D52,D54)","v":15.363803304958967},{"$f":"[3]!T2_turb(11,E50,E51,E52,E54)","v":15.706193965367389},{"$f":"[3]!T2_turb(11,F50,F51,F52,F54)","v":11.943801869020682},{"$f":"[3]!T2_turb(11,G50,G51,G52,G54)","v":14.580843885518025},{"$f":"[3]!T2_turb(11,H50,H51,H52,H54)","v":18.242851223891211},{"$f":"[3]!T2_turb(11,I50,I51,I52,I54)","v":17.814530381937882}]
[null,"Efficacity","%",0.78,{"$f":"(0.321*E76^4-1.6098*E76^3+1.316*E76^2+0.9448*E76)*($D$54/0.97)","v":0.7808654646155484},{"$f":"(0.321*F76^4-1.6098*F76^3+1.316*F76^2+0.9448*F76)*($D$54/0.97)","v":0.78042050968331311},{"$f":"(0.321*G76^4-1.6098*G76^3+1.316*G76^2+0.9448*G76)*($D$54/0.97)","v":0.78076660910128171},{"$f":"(0.321*H76^4-1.6098*H76^3+1.316*H76^2+0.9448*H76)*($D$54/0.97)","v":0.77490491286183738},{"$f":"(0.321*I76^4-1.6098*I76^3+1.316*I76^2+0.9448*I76)*($D$54/0.97)","v":0.77926545775633205}]
[null,"Power","W",{"$f":"+D49*(D66-D67)","v":6410.9677720011541},5909.8194484461528,9688.556436742052,6344.3690121204836,5292.3122805234452,3940.8469916747836]
[null,"Speed","Hz",1400,1365,1703.9988094293917,1397.0224893917318,1324.0638691222946,1184.0331666692389]
[null,null,null,null,null,{"$f":"(F55/$D55*$D59/F59)^(1/3)*$D56","v":1703.9889790791685},{"$f":"(G55/$D55*$D59/G59)^(1/3)*$D56","v":1397.015502276163},{"$f":"(H55/$D55*$D59/H59)^(1/3)*$D56","v":1324.0796073443339},{"$f":"(I55/$D55*$D59/I59)^(1/3)*$D56","v":1184.0419119093897}]
[null,null,null,null,null,{"$f":"F56-F57","v":9.8303502231829043E-3},{"$f":"G56-G57","v":6.9871155687906139E-3},{"$f":"H56-H57","v":-1.5738222039317407E-2},{"$f":"I56-I57","v":-8.7452401508016919E-3}]
[null,"Brake Pressure",null,12.4,null,{"$f":"($D59-$D52)+F52","v":10.393000000000001},{"$f":"($D59-$D52)+G52","v":12.350000000000001},{"$f":"($D59-$D52)+H52","v":12.100000000000001},{"$f":"($D59-$D52)+I52","v":12.600000000000001}]
[null,"Rho (brake)",null,{"$f":"[3]!rho_(11,D59,330)","v":1.7997871404336276},null,{"$f":"[3]!rho_(11,F59,330)","v":1.5097206017696665},{"$f":"[3]!rho_(11,G59,330)","v":1.7925665531313912},{"$f":"[3]!rho_(11,H59,330)","v":1.7564591857919802},{"$f":"[3]!rho_(11,I59,330)","v":1.8286665362232972}]
[null,"Wheel","mm",37.5,{"$f":"$D$26","v":25.5},{"$f":"$D$26","v":25.5},{"$f":"$D$26","v":25.5},{"$f":"$D$26","v":25.5},{"$f":"$D$26","v":25.5}]
[null,"a = mÖT/P",null,{"$f":"D49*D51^0.5/D50","v":102.32755701969941},102.32755701969943,109.56139055719603,109.39819907343733,108.68041809518232,109.23720754170373]
[null,"Rho (in)","kg/m3",{"$f":"[3]!rho_(11,D50,D51)","v":25.540855637956792},{"$f":"[3]!rho_(11,E50,E51)","v":23.807556766461335},{"$f":"[3]!rho_(11,F50,F51)","v":27.48048465747328},{"$f":"[3]!rho_(11,G50,G51)","v":26.406682377280482},{"$f":"[3]!rho_(11,H50,H51)","v":18.257238934263505},{"$f":"[3]!rho_(11,I50,I51)","v":18.66731756848581}]
[null,"Sound Speed",null,{"$f":"[3]!Sound_speed(11,D50,D51)","v":281.98328846410919},{"$f":"[3]!Sound_speed(11,E50,E51)","v":282.4894474736368},{"$f":"[3]!Sound_speed(11,F50,F51)","v":273.17336875646583},{"$f":"[3]!Sound_speed(11,G50,G51)","v":274.0281512729216},{"$f":"[3]!Sound_speed(11,H50,H51)","v":296.72109855062985},{"$f":"[3]!Sound_speed(11,I50,I51)","v":285.54632194029665}]
[null,"S=Q/(rho*V) = cte",null,{"$f":"D49/(D63*D64)","v":3.4434427550877951E-2},3.4570819098406869E-2,3.6552859809052589E-2,3.6607741476904966E-2,3.7287892853458113E-2,3.733314612459418E-2]
[null,"Hin",null,{"$f":"[3]!h_(11,D50,D51)","v":117.19893024722134},{"$f":"[3]!h_(11,E50,E51)","v":118.76588483254763},{"$f":"[3]!h_(11,F50,F51)","v":109.62807186850429},{"$f":"[3]!h_(11,G50,G51)","v":110.9314560888928},{"$f":"[3]!h_(11,H50,H51)","v":133.68648404791796},{"$f":"[3]!h_(11,I50,I51)","v":124.62661687105937}]
[null,"Hout",null,{"$f":"[3]!h_(11,D52,D53)","v":91.348253747216688},{"$f":"[3]!h_(11,E52,E53)","v":93.34752721336416},{"$f":"[3]!h_(11,F52,F53)","v":74.319921588832088},{"$f":"[3]!h_(11,G52,G53)","v":86.981403193005733},{"$f":"[3]!h_(11,H52,H53)","v":107.48691830275239},{"$f":"[3]!h_(11,I52,I53)","v":104.82336565661322}]
[null,"Sin = Sout",null,{"$f":"[3]!S_(11,D50,D51)","v":12.471269933399629},{"$f":"[3]!S_(11,E50,E51)","v":12.670232847386409},{"$f":"[3]!S_(11,F50,F51)","v":12.091517398356705},{"$f":"[3]!S_(11,G50,G51)","v":12.218086211860863},{"$f":"[3]!S_(11,H50,H51)","v":13.645422775959359},{"$f":"[3]!S_(11,I50,I51)","v":13.363174953746494}]
[null,"Tout(iso)",null,{"$f":"[1]!HeCalc(2,0,1,D52*10^5,8,D68*1000,1)","v":14.074271984296702},{"$f":"[1]!HeCalc(2,0,1,E52*10^5,8,E68*1000,1)","v":14.437047364569063},{"$f":"[1]!HeCalc(2,0,1,F52*10^5,8,F68*1000,1)","v":10.18382109815426},{"$f":"[1]!HeCalc(2,0,1,G52*10^5,8,G68*1000,1)","v":13.401601278072976},{"$f":"[1]!HeCalc(2,0,1,H52*10^5,8,H68*1000,1)","v":16.855854125595496},{"$f":"[1]!HeCalc(2,0,1,I52*10^5,8,I68*1000,1)","v":16.80071466056123}]
[null,"Hout(iso)",null,{"$f":"[3]!h_(11,D52,D69)","v":84.057037298965582},{"$f":"[3]!h_(11,E52,E69)","v":86.214365049964513},{"$f":"[3]!h_(11,F52,F69)","v":64.38560342813183},{"$f":"[3]!h_(11,G52,G69)","v":80.256408493578149},{"$f":"[3]!h_(11,H52,H69)","v":99.876444505903692},{"$f":"[3]!h_(11,I52,I69)","v":99.213901579601895}]
[null,"ΔHs",null,{"$f":"D66-D70","v":33.141892948255759},32.551519782583114,45.242468440372463,30.675047595314652,33.810039542014266,25.412715291457474]
[null,"u1","m/s",{"$f":"(2*52.7%*D71*1000*D54)^0.5","v":165.06548103895022},{"$f":"PI()*$D$73*E56","v":160.93884401297646},{"$f":"PI()*$D$73*F56","v":200.90813083447216},164.71442088119855,156.11231391640371,139.60214587309247]
[null,"D1",null,{"$f":"D72/PI()/D56","v":3.7529981773129217E-2},null,null,null,null,null,null,null,null,"T2"]
[null,"Co = (2*ΔHs)^0,5",null,{"$f":"(2000*D71)^0.5","v":257.45637668644275},255.15297287150355,300.80714233665549,247.68951368725584,260.038610756227,225.44496131631539,null,null,"MAX",{"$f":"ROUND(F49,0)&\"g/s @ \"&F50&\" b ; \"&F51&\"K\"","v":"274g/s @ 11 b ; 19,29K"}]
[null,"u1/Co",null,{"$f":"D72/D74","v":0.64113961038138978},0.63075433612143783,0.66789681014163227,0.66500361048459466,0.60034282394606042,0.61922938999386501,null,null,"MIN",{"$f":"ROUND(G49,0)&\"g/s @ \"&G50&\" b ; \"&G51&\"K\"","v":"265g/s @ 10,69 b ; 19,49K"}]
[null,"U1/C0 off de / U1/C0 nom",null,{"$f":"D75/$D$40","v":1.0336794235569033},{"$f":"E75/$D75","v":0.98380185205875181},{"$f":"F75/$D75","v":1.0417338116799952},{"$f":"G75/$D75","v":1.0372212225181487},{"$f":"H75/$D75","v":0.93636832637580936},{"$f":"I75/$D75","v":0.96582613204245604},null,null,"STS",{"$f":"ROUND(H49,0)&\"g/s @ \"&H50&\" b ; \"&H51&\"K\"","v":"202g/s @ 8,991 b ; 23,4K"}]
[null,"Rdt",null,{"$f":"(0.321*D76^4-1.6098*D76^3+1.316*D76^2+0.9448*D76)*($D54/0.97)","v":0.78100105922686858},0.7808654646155484,0.78042050968331311,0.78076660910128171,0.77490491286183738,0.77926545775633205,null,null,"BAKING",{"$f":"ROUND(I49,0)&\"g/s @ \"&I50&\" b ; \"&I51&\"K\"","v":"199g/s @ 8,494 b ; 21,74K"}]
[]
[null,"TURBINE 3"]
[]
[null,null,null,"DESIGN",null,{"$f":"F47","v":"ESSAI"},{"$f":"G47","v":0},{"$f":"H47","v":0},{"$f":"I47","v":0}]
[]
[null,"m","g/s",454,433,427,408,340,370]
[null,"Pin","Bara",15.69,14.69,15.34,14.84,13.54,14.2]
[null,"Tin","K",7.03,7.37,8.08,8.3010000000000002,9.7219999999999995,9.1839999999999993]
[null,"Pout","Bara",2.8,2.8,5.1230000000000002,5.1230000000000002,5.0030000000000001,5]
[null,"Tout","K",{"$f":"[3]!T2_turb(11,D84,D85,D86,D88)","v":5.3921383594836865},{"$f":"[3]!T2_turb(11,E84,E85,E86,E88)","v":5.4398165000286154},{"$f":"[3]!T2_turb(11,F84,F85,F86,F88)","v":6.4211804644392645},{"$f":"[3]!T2_turb(11,G84,G85,G86,G88)","v":6.5276822232344989},{"$f":"[3]!T2_turb(11,H84,H85,H86,H88)","v":7.2650648995103211},{"$f":"[3]!T2_turb(11,I84,I85,I86,I88)","v":6.9113442710349418}]
[null,"Efficacity","%",0.73,{"$f":"(0.321*E110^4-1.6098*E110^3+1.316*E110^2+0.9448*E110)*($D$88/0.97)","v":0.73124589629827341},{"$f":"(0.321*F110^4-1.6098*F110^3+1.316*F110^2+0.9448*F110)*($D$88/0.97)","v":0.72160494577218692},{"$f":"(0.321*G110^4-1.6098*G110^3+1.316*G110^2+0.9448*G110)*($D$88/0.97)","v":0.71925001320033477},{"$f":"(0.321*H110^4-1.6098*H110^3+1.316*H110^2+0.9448*H110)*($D$88/0.97)","v":0.69943561116273223},{"$f":"(0.321*I110^4-1.6098*I110^3+1.316*I110^2+0.9448*I110)*($D$88/0.97)","v":0.70917518045315897}]
[null,"Power","W",{"$f":"+D83*(D100-D101)","v":3516.41626962996},3307.2848647874539,2914.0599266559489,2773.0578264299274,2723.1214930373581,2821.3323281883586]
[null,"Speed","Hz",1026,1010,888.88901054616645,878.46240471256397,898.50983793217677,899.62680726358053]
[null,null,null,null,null,{"$f":"(F89/$D89*$D93/F93)^(1/3)*$D90","v":910.09881961496023},{"$f":"(G89/$D89*$D93/G93)^(1/3)*$D90","v":895.1765567960681},{"$f":"(H89/$D89*$D93/H93)^(1/3)*$D90","v":892.20120712840082},{"$f":"(I89/$D89*$D93/I93)^(1/3)*$D90","v":902.8625212665396}]
[null,null,null,null,null,{"$f":"F90-F91","v":-21.209809068793788},{"$f":"G90-G91","v":-16.714152083504132},{"$f":"H90-H91","v":6.3086308037759409},{"$f":"I90-I91","v":-3.235714002959071}]
[null,"Brake Pressure",null,12.4,null,{"$f":"($D93-$D86)+F86","v":14.723000000000003},{"$f":"($D93-$D86)+G86","v":14.723000000000003},{"$f":"($D93-$D86)+H86","v":14.603000000000002},{"$f":"($D93-$D86)+I86","v":14.600000000000001}]
[null,"Rho (brake)",null,{"$f":"[3]!rho_(11,D93,330)","v":1.7997871404336276},null,{"$f":"[3]!rho_(11,F93,330)","v":2.1349302317911873},{"$f":"[3]!rho_(11,G93,330)","v":2.1349302317911873},{"$f":"[3]!rho_(11,H93,330)","v":2.1176332249962067},{"$f":"[3]!rho_(11,I93,330)","v":2.117200778075456}]
[null,"Wheel","mm",28,{"$f":"$D$95","v":28},{"$f":"$D$95","v":28},{"$f":"$D$95","v":28},{"$f":"$D$95","v":28},{"$f":"$D$95","v":28}]
[null,"a = mÖT/P",null,{"$f":"D83*D85^0.5/D84","v":76.720349355481659},80.02023905916586,79.123992989786956,79.212089423011363,78.295727006923869,78.964032250186492]
[null,"Rho (in)","kg/m3",{"$f":"[3]!rho_(11,D84,D85)","v":133.10041212976475},{"$f":"[3]!rho_(11,E84,E85)","v":126.15150431340835},{"$f":"[3]!rho_(11,F84,F85)","v":118.52007478205572},{"$f":"[3]!rho_(11,G84,G85)","v":113.5622187212817},{"$f":"[3]!rho_(11,H84,H85)","v":86.357771280008706},{"$f":"[3]!rho_(11,I84,I85)","v":97.527739457599623}]
[null,"Sound Speed",null,{"$f":"[3]!Sound_speed(11,D84,D85)","v":278.37037413368364},{"$f":"[3]!Sound_speed(11,E84,E85)","v":263.0805002567734},{"$f":"[3]!Sound_speed(11,F84,F85)","v":255.30523600661596},{"$f":"[3]!Sound_speed(11,G84,G85)","v":246.67040794527531},{"$f":"[3]!Sound_speed(11,H84,H85)","v":220.26513084300478},{"$f":"[3]!Sound_speed(11,I84,I85)","v":228.80664487050078}]
[null,"S=Q/(rho*V) = cte",null,{"$f":"D83/(D97*D98)","v":1.2253310522154687E-2},1.3046884076824011E-2,1.4111599309667234E-2,1.4564958182830321E-2,1.7874411011785177E-2,1.6580779092051731E-2]
[null,"Hin",null,{"$f":"[3]!h_(11,D84,D85)","v":27.297656061036612},{"$f":"[3]!h_(11,E84,E85)","v":28.806899242841915},{"$f":"[3]!h_(11,F84,F85)","v":32.929563952369485},{"$f":"[3]!h_(11,G84,G85)","v":34.299579059824019},{"$f":"[3]!h_(11,H84,H85)","v":44.864448113929591},{"$f":"[3]!h_(11,I84,I85)","v":40.504985501827527}]
[null,"Hout",null,{"$f":"[3]!h_(11,D86,D87)","v":19.552245775508066},{"$f":"[3]!h_(11,E86,E87)","v":21.168827961577588},{"$f":"[3]!h_(11,F86,F87)","v":26.105067637015974},{"$f":"[3]!h_(11,G86,G87)","v":27.502868700927138},{"$f":"[3]!h_(11,H86,H87)","v":36.855267252055008},{"$f":"[3]!h_(11,I86,I87)","v":32.879762993210342}]
[null,"Sin = Sout",null,{"$f":"[3]!S_(11,D84,D85)","v":4.6548744621978262},{"$f":"[3]!S_(11,E84,E85)","v":4.971471814103408},{"$f":"[3]!S_(11,F84,F85)","v":5.4363798982443239},{"$f":"[3]!S_(11,G84,G85)","v":5.656221826069662},{"$f":"[3]!S_(11,H84,H85)","v":6.9722021671127212},{"$f":"[3]!S_(11,I84,I85)","v":6.4350392283015685}]
[null,"Tout(iso)",null,{"$f":"[1]!HeCalc(2,0,1,D86*10^5,8,D102*1000,1)","v":5.2264698889085857},{"$f":"[1]!HeCalc(2,0,1,E86*10^5,8,E102*1000,1)","v":5.3402792096199763},{"$f":"[1]!HeCalc(2,0,1,F86*10^5,8,F102*1000,1)","v":6.2091585528103979},{"$f":"[1]!HeCalc(2,0,1,G86*10^5,8,G102*1000,1)","v":6.3231083063920845},{"$f":"[1]!HeCalc(2,0,1,H86*10^5,8,H102*1000,1)","v":6.9570296110913148},{"$f":"[1]!HeCalc(2,0,1,I86*10^5,8,I102*1000,1)","v":6.6631485316340617}]
[null,"Hout(iso)",null,{"$f":"[3]!h_(11,D86,D103)","v":16.687504985257792},{"$f":"[3]!h_(11,E86,E103)","v":18.361615060348232},{"$f":"[3]!h_(11,F86,F103)","v":23.472178224393527},{"$f":"[3]!h_(11,G86,G103)","v":24.849860276911517},{"$f":"[3]!h_(11,H86,H103)","v":33.413528638210821},{"$f":"[3]!h_(11,I86,I103)","v":29.75274442115229}]
[null,"ΔHs",null,{"$f":"D100-D104","v":10.61015107577882},10.445284182493683,9.4573857279759572,9.4497187829125018,11.45091947571877,10.752241080675237]
[null,"u1","m/s",{"$f":"(2*52.7%*D105*1000*D88)^0.5","v":90.352988001093465},{"$f":"PI()*$D$107*E90","v":88.943974542986751},{"$f":"PI()*$D$107*F90","v":78.278536163919711},77.360334417549723,79.125778367982861,79.224142419247883]
[null,"D1",null,{"$f":"D106/PI()/D90","v":2.8031432092586225E-2},null,null,null,null,null,null,null,null,"T3"]
[null,"Co = (2*ΔHs)^0,5",null,{"$f":"(2000*D105)^0.5","v":145.67189897697372},144.53569927525646,137.53098362169854,137.47522528013911,151.33353544881433,146.64406623300675,null,null,"MAX",{"$f":"ROUND(F83,0)&\"g/s @ \"&F84&\" b ; \"&F85&\"K\"","v":"427g/s @ 15,34 b ; 8,08K"}]
[null,"u1/Co",null,{"$f":"D106/D108","v":0.6202499496170879},0.61537720430992071,0.56917019061855634,0.56272200507334524,0.522856867999001,0.54024785628466199,null,null,"MIN",{"$f":"ROUND(G83,0)&\"g/s @ \"&G84&\" b ; \"&G85&\"K\"","v":"408g/s @ 14,84 b ; 8,301K"}]
[null,"U1/C0 off de / U1/C0 nom",null,{"$f":"D109/$D$40","v":1},{"$f":"E109/$D109","v":0.99214390051917711},{"$f":"F109/$D109","v":0.91764649230513329},{"$f":"G109/$D109","v":0.9072503841729328},{"$f":"H109/$D109","v":0.84297768717560939},{"$f":"I109/$D109","v":0.87101636464168142},null,null,"STS",{"$f":"ROUND(H83,0)&\"g/s @ \"&H84&\" b ; \"&H85&\"K\"","v":"340g/s @ 13,54 b ; 9,722K"}]
[null,"Rdt",null,{"$f":"(0.321*D110^4-1.6098*D110^3+1.316*D110^2+0.9448*D110)*($D88/0.97)","v":0.73150515463917531},0.73124589629827341,0.72160494577218692,0.71925001320033477,0.69943561116273223,0.70917518045315897,null,null,"BAKING",{"$f":"ROUND(I83,0)&\"g/s @ \"&I84&\" b ; \"&I85&\"K\"","v":"370g/s @ 14,2 b ; 9,184K"}]
[]
[null,null,null,null,null,null,null,null,null,null,null,null,{"$f":"M38","v":"T1"},{"$f":"M107","v":"T3"},"T1+T2"]
[null,"Courbe de rendement TC3",null,null,null,null,null,null,null,null,null,{"$f":"L108","v":"MAX"},{"$f":"M39","v":"26g/s @ 12,11 b ; 41,44K"},{"$f":"M108","v":"427g/s @ 15,34 b ; 8,08K"},{"$f":"F83+F49","v":701.4}]
[null,null,null,null,null,null,null,null,null,null,null,{"$f":"L109","v":"MIN"},{"$f":"M40","v":"0g/s @  b ; K"},{"$f":"M109","v":"408g/s @ 14,84 b ; 8,301K"},{"$f":"G83+G49","v":672.9}]
[null,null,null,null,null,null,null,null,null,null,null,{"$f":"L110","v":"STS"},{"$f":"M41","v":"0g/s @  b ; K"},{"$f":"M110","v":"340g/s @ 13,54 b ; 9,722K"},{"$f":"H83+H49","v":542}]
[null,null,null,null,null,null,null,null,null,null,null,{"$f":"L111","v":"BAKING"},{"$f":"M42","v":"0g/s @  b ; K"},{"$f":"M111","v":"370g/s @ 14,2 b ; 9,184K"},{"$f":"I83+I49","v":569}]
[null,null,null,null,"d : mm"]
[null,null,null,null,"N : Hz"]
[null,null,null,null,"H : J/kG"]
[]
[]
[]
[]
[]
[null,"rendement=(0,321*rap^4 - 1,6098*rap^3 + 1,316*rap^2 + 0,9448*rap)*(ETAgar/0,97)",null,null,null,null,null,null,"U1/CO _nom",0.64]
[null,null,null,null,null,null,null,null,"Eta_gar",0.8]
[null,"U1/C0",{"$f":"D19","v":0.73},{"$f":"D54","v":0.78},{"$f":"D88","v":0.73}]
[null,0,{"$f":"(0.321*B129^4-1.6098*B129^3+1.316*B129^2+0.9448*B129)*$D$19/0.97215493","v":0}]
[null,{"$f":"B129+0.05","v":0.05},{"$f":"(0.321*$B130^4-1.6098*$B130^3+1.316*$B130^2+0.9448*$B130)*$C$128/0.97215493","v":3.7793842502552556E-2},{"$f":"(0.321*$B130^4-1.6098*$B130^3+1.316*$B130^2+0.9448*$B130)*$D$128/0.97215493","v":4.0382461852042459E-2},{"$f":"(0.321*$B130^4-1.6098*$B130^3+1.316*$B130^2+0.9448*$B130)*$E$128/0.97215493","v":3.7793842502552556E-2}]
[null,0.1,7.964314803197059E-2,8.5098158171146673E-2,7.964314803197059E-2]
[null,0.15000000000000002,0.12469554087690531,0.13323633134792623,0.12469554087690531]
[null,0.2,0.17213480159998779,0.18392485650409657,0.17213480159998779]
[null,0.25,0.22118086703782905,0.23633024149247489,0.22118086703782905]
[null,0.3,0.27108983030102002,0.28965762689698032,0.27108983030102002]
[null,0.35,0.32115394077413151,0.34315078603263366,0.32115394077413151]
[null,0.39999999999999997,0.37070160411571434,0.39609212494555779,0.37070160411571434]
[null,0.44999999999999996,0.41909738225829907,0.4478026824129771,0.41909738225829907]
[null,0.49999999999999994,0.46574199340839634,0.49764212994321799,0.46574199340839634]
[null,0.54999999999999993,0.5100723120464965,0.54500877177570861,0.5100723120464965]
[null,0.6,0.55156136892707008,0.58933954488097895,0.55156136892707008]
[null,0.65,0.58971835107856729,0.63011001896066099,0.58971835107856729]
[null,0.70000000000000007,0.62408860180341841,0.66683439644748832,0.62408860180341841]
[null,0.75000000000000011,0.65425362067803339,0.69906551250529614,0.65425362067803339]
[null,0.80000000000000016,0.67983106355280232,0.7263948350290218,0.67983106355280232]
[null,0.8500000000000002,0.70047474255209508,0.74845246464470438,0.70047474255209508]
[null,0.90000000000000024,0.71587462607426167,0.76490713470948513,0.71587462607426167]
[null,0.95000000000000029,0.72575683879163178,0.77546621131160665,0.72575683879163178]
[null,1.0000000000000002,0.7298836616505151,0.77987569327041351,0.7298836616505151]
[null,1.0500000000000003,0.72805353187120092,0.77792021213635165,0.72805353187120092]
[null,1.1000000000000003,0.72010104294795907,0.76942303219096997,0.72010104294795907]
[null,1.1500000000000004,0.70589694464903885,0.75424605044691839,0.70589694464903885]
[null,1.2000000000000004,0.68534814301666902,0.7322897966479478,0.68534814301666902,null,"F Let u be the peripheral speed of the wheel : u = p . Æ . N / 60                      (in m/s)"]
[null,1.2500000000000004,0.6583977003670598,0.70349343326891334,0.6583977003670598,null,"F Let n, be the speed ratio of the turbine : n =  u / [ 2 . (H1 - H2S ) ] 0.5       (dimensionless number)"]
[null,1.3000000000000005,0.62502483529039965,0.66783475551576954,0.62502483529039965,null,null,"N = speed of rotation of the turbine (in rpm)"]
[null,1.3500000000000005,0.58524492265085759,0.62533019132557388,0.58524492265085759,null,null,"Æ = diameter of the wheel of the turbine (in m)"]
[null,1.4000000000000006,0.53910949358658278,0.57603480136648577,0.53910949358658278]
[null,1.4500000000000006,0.48670623550970399,0.5200422790377659,0.48670623550970399]
[null,1.5000000000000007,0.42815899210633013,0.45748495046977738,0.42815899210633013]